You are viewing a plain text version of this content. The canonical link for it is here.
Posted to commits@sling.apache.org by Apache Jenkins Server <je...@builds.apache.org> on 2016/10/27 14:57:13 UTC

Build failed in Jenkins: sling-karaf-org.apache.sling.karaf-distribution-1.8 #7

See <https://builds.apache.org/job/sling-karaf-org.apache.sling.karaf-distribution-1.8/7/>

------------------------------------------
Started by upstream project "sling-karaf-org.apache.sling.karaf-features-1.7" build number 7
originally caused by:
 Started by upstream project "sling-karaf-org.apache.sling.karaf-configs-1.7" build number 6
 originally caused by:
  Started by an SCM change
[EnvInject] - Loading node environment variables.
Building remotely on H10 (Ubuntu yahoo-not-h2 ubuntu docker) in workspace <https://builds.apache.org/job/sling-karaf-org.apache.sling.karaf-distribution-1.8/ws/>
Checking out a fresh workspace because there's no workspace at <https://builds.apache.org/job/sling-karaf-org.apache.sling.karaf-distribution-1.8/ws/>
Cleaning local Directory .
Checking out https://svn.apache.org/repos/asf/sling/trunk/karaf/org.apache.sling.karaf-distribution at revision '2016-10-27T14:56:19.523 +0000'
A         src
A         src/main
A         src/main/resources
A         src/main/resources/etc
AU        src/main/resources/etc/custom.properties
A         pom.xml
At revision 1766841

No changes for https://svn.apache.org/repos/asf/sling/trunk/karaf/org.apache.sling.karaf-distribution since the previous build
Parsing POMs
Established TCP socket on 44526
maven32-agent.jar already up to date
maven32-interceptor.jar already up to date
maven3-interceptor-commons.jar already up to date
[sling-karaf-org.apache.sling.karaf-distribution-1.8] $ /home/jenkins/tools/java/latest1.8/bin/java -Xmx2g -Xms256m -XX:MaxPermSize=512m -cp /home/jenkins/jenkins-slave/maven32-agent.jar:/home/jenkins/tools/maven/apache-maven-3.3.9/boot/plexus-classworlds-2.5.2.jar:/home/jenkins/tools/maven/apache-maven-3.3.9/conf/logging jenkins.maven3.agent.Maven32Main /home/jenkins/tools/maven/apache-maven-3.3.9 /home/jenkins/jenkins-slave/slave.jar /home/jenkins/jenkins-slave/maven32-interceptor.jar /home/jenkins/jenkins-slave/maven3-interceptor-commons.jar 44526
Java HotSpot(TM) 64-Bit Server VM warning: ignoring option MaxPermSize=512m; support was removed in 8.0
<===[JENKINS REMOTING CAPACITY]===>   channel started
Executing Maven:  -B -f <https://builds.apache.org/job/sling-karaf-org.apache.sling.karaf-distribution-1.8/ws/pom.xml> -Dmaven.repo.local=/home/jenkins/jenkins-slave/maven-repositories/1 -U clean verify
[INFO] Scanning for projects...
[INFO]                                                                         
[INFO] ------------------------------------------------------------------------
[INFO] Building Apache Sling - Karaf Distribution 0.1.1-SNAPSHOT
[INFO] ------------------------------------------------------------------------
[INFO] Downloading: http://repository.apache.org/snapshots/org/apache/sling/org.apache.sling.karaf-features/0.1.1-SNAPSHOT/maven-metadata.xml
[INFO] Downloaded: http://repository.apache.org/snapshots/org/apache/sling/org.apache.sling.karaf-features/0.1.1-SNAPSHOT/maven-metadata.xml (2 KB at 2.2 KB/sec)
[INFO] Downloading: http://repository.apache.org/snapshots/org/apache/sling/org.apache.sling.karaf-features/0.1.1-SNAPSHOT/org.apache.sling.karaf-features-0.1.1-20161027.145528-5.pom
[INFO] Downloaded: http://repository.apache.org/snapshots/org/apache/sling/org.apache.sling.karaf-features/0.1.1-SNAPSHOT/org.apache.sling.karaf-features-0.1.1-20161027.145528-5.pom (3 KB at 7.4 KB/sec)
[INFO] Downloading: http://repository.apache.org/snapshots/org/apache/sling/org.apache.sling.karaf-configs/0.1.1-SNAPSHOT/maven-metadata.xml
[INFO] Downloaded: http://repository.apache.org/snapshots/org/apache/sling/org.apache.sling.karaf-configs/0.1.1-SNAPSHOT/maven-metadata.xml (8 KB at 18.5 KB/sec)
[INFO] Downloading: http://repository.apache.org/snapshots/org/apache/sling/org.apache.sling.karaf-features/0.1.1-SNAPSHOT/org.apache.sling.karaf-features-0.1.1-20161027.145528-5-features.xml
[INFO] Downloading: http://repository.apache.org/snapshots/org/apache/sling/org.apache.sling.karaf-configs/0.1.1-SNAPSHOT/org.apache.sling.karaf-configs-0.1.1-20161027.144705-6-org.apache.felix.jaas.Configuration.factory-GuestLoginModule.config
[INFO] Downloading: http://repository.apache.org/snapshots/org/apache/sling/org.apache.sling.karaf-configs/0.1.1-SNAPSHOT/org.apache.sling.karaf-configs-0.1.1-20161027.144705-6-org.apache.felix.jaas.Configuration.factory-LoginModuleImpl.config
[INFO] Downloading: http://repository.apache.org/snapshots/org/apache/sling/org.apache.sling.karaf-configs/0.1.1-SNAPSHOT/org.apache.sling.karaf-configs-0.1.1-20161027.144705-6-org.apache.felix.jaas.Configuration.factory-TokenLoginModule.config
[INFO] Downloading: http://repository.apache.org/snapshots/org/apache/sling/org.apache.sling.karaf-configs/0.1.1-SNAPSHOT/org.apache.sling.karaf-configs-0.1.1-20161027.144705-6-org.apache.felix.jaas.ConfigurationSpi.config
[INFO] Downloaded: http://repository.apache.org/snapshots/org/apache/sling/org.apache.sling.karaf-configs/0.1.1-SNAPSHOT/org.apache.sling.karaf-configs-0.1.1-20161027.144705-6-org.apache.felix.jaas.Configuration.factory-LoginModuleImpl.config (116 B at 0.3 KB/sec)
[INFO] Downloaded: http://repository.apache.org/snapshots/org/apache/sling/org.apache.sling.karaf-configs/0.1.1-SNAPSHOT/org.apache.sling.karaf-configs-0.1.1-20161027.144705-6-org.apache.felix.jaas.Configuration.factory-GuestLoginModule.config (136 B at 0.3 KB/sec)
[INFO] Downloading: http://repository.apache.org/snapshots/org/apache/sling/org.apache.sling.karaf-configs/0.1.1-SNAPSHOT/org.apache.sling.karaf-configs-0.1.1-20161027.144705-6-org.apache.jackrabbit.oak.plugins.document.DocumentNodeStoreService.cfg
[INFO] Downloading: http://repository.apache.org/snapshots/org/apache/sling/org.apache.sling.karaf-configs/0.1.1-SNAPSHOT/org.apache.sling.karaf-configs-0.1.1-20161027.144705-6-org.apache.jackrabbit.oak.plugins.index.lucene.LuceneIndexProviderService.config
[INFO] Downloaded: http://repository.apache.org/snapshots/org/apache/sling/org.apache.sling.karaf-configs/0.1.1-SNAPSHOT/org.apache.sling.karaf-configs-0.1.1-20161027.144705-6-org.apache.felix.jaas.Configuration.factory-TokenLoginModule.config (140 B at 0.3 KB/sec)
[INFO] Downloaded: http://repository.apache.org/snapshots/org/apache/sling/org.apache.sling.karaf-configs/0.1.1-SNAPSHOT/org.apache.sling.karaf-configs-0.1.1-20161027.144705-6-org.apache.felix.jaas.ConfigurationSpi.config (83 B at 0.2 KB/sec)
[INFO] Downloading: http://repository.apache.org/snapshots/org/apache/sling/org.apache.sling.karaf-configs/0.1.1-SNAPSHOT/org.apache.sling.karaf-configs-0.1.1-20161027.144705-6-org.apache.jackrabbit.oak.plugins.segment.SegmentNodeStoreService.config
[INFO] Downloading: http://repository.apache.org/snapshots/org/apache/sling/org.apache.sling.karaf-configs/0.1.1-SNAPSHOT/org.apache.sling.karaf-configs-0.1.1-20161027.144705-6-org.apache.jackrabbit.oak.security.authentication.AuthenticationConfigurationImpl.config
[INFO] Downloaded: http://repository.apache.org/snapshots/org/apache/sling/org.apache.sling.karaf-features/0.1.1-SNAPSHOT/org.apache.sling.karaf-features-0.1.1-20161027.145528-5-features.xml (41 KB at 87.7 KB/sec)
[INFO] Downloading: http://repository.apache.org/snapshots/org/apache/sling/org.apache.sling.karaf-configs/0.1.1-SNAPSHOT/org.apache.sling.karaf-configs-0.1.1-20161027.144705-6-org.apache.jackrabbit.oak.security.user.RandomAuthorizableNodeName.config
[INFO] Downloaded: http://repository.apache.org/snapshots/org/apache/sling/org.apache.sling.karaf-configs/0.1.1-SNAPSHOT/org.apache.sling.karaf-configs-0.1.1-20161027.144705-6-org.apache.jackrabbit.oak.plugins.index.lucene.LuceneIndexProviderService.config (39 B at 0.1 KB/sec)
[INFO] Downloaded: http://repository.apache.org/snapshots/org/apache/sling/org.apache.sling.karaf-configs/0.1.1-SNAPSHOT/org.apache.sling.karaf-configs-0.1.1-20161027.144705-6-org.apache.jackrabbit.oak.plugins.document.DocumentNodeStoreService.cfg (2 KB at 1.3 KB/sec)
[INFO] Downloading: http://repository.apache.org/snapshots/org/apache/sling/org.apache.sling.karaf-configs/0.1.1-SNAPSHOT/org.apache.sling.karaf-configs-0.1.1-20161027.144705-6-org.apache.jackrabbit.oak.security.user.UserConfigurationImpl.config
[INFO] Downloading: http://repository.apache.org/snapshots/org/apache/sling/org.apache.sling.karaf-configs/0.1.1-SNAPSHOT/org.apache.sling.karaf-configs-0.1.1-20161027.144705-6-org.apache.jackrabbit.oak.spi.security.user.action.DefaultAuthorizableActionProvider.config
[INFO] Downloaded: http://repository.apache.org/snapshots/org/apache/sling/org.apache.sling.karaf-configs/0.1.1-SNAPSHOT/org.apache.sling.karaf-configs-0.1.1-20161027.144705-6-org.apache.jackrabbit.oak.security.authentication.AuthenticationConfigurationImpl.config (75 B at 0.1 KB/sec)
[INFO] Downloaded: http://repository.apache.org/snapshots/org/apache/sling/org.apache.sling.karaf-configs/0.1.1-SNAPSHOT/org.apache.sling.karaf-configs-0.1.1-20161027.144705-6-org.apache.jackrabbit.oak.plugins.segment.SegmentNodeStoreService.config (60 B at 0.1 KB/sec)
[INFO] Downloading: http://repository.apache.org/snapshots/org/apache/sling/org.apache.sling.karaf-configs/0.1.1-SNAPSHOT/org.apache.sling.karaf-configs-0.1.1-20161027.144705-6-org.apache.sling.commons.messaging.mail.internal.SimpleMailBuilder.config
[INFO] Downloading: http://repository.apache.org/snapshots/org/apache/sling/org.apache.sling.karaf-configs/0.1.1-SNAPSHOT/org.apache.sling.karaf-configs-0.1.1-SNAPSHOT-org.apache.sling.jcr.base.internal.LoginAdminWhitelistImpl.config
[INFO] Downloaded: http://repository.apache.org/snapshots/org/apache/sling/org.apache.sling.karaf-configs/0.1.1-SNAPSHOT/org.apache.sling.karaf-configs-0.1.1-20161027.144705-6-org.apache.jackrabbit.oak.security.user.RandomAuthorizableNodeName.config (13 B at 0.0 KB/sec)
[INFO] Downloading: http://repository.apache.org/snapshots/org/apache/sling/org.apache.sling.karaf-configs/0.1.1-SNAPSHOT/org.apache.sling.karaf-configs-0.1.1-SNAPSHOT-org.apache.sling.jcr.repoinit.impl.RepositoryInitializer.config
[INFO] Downloading: http://repository.apache.org/snapshots/org/apache/sling/org.apache.sling.karaf-configs/0.1.1-SNAPSHOT/org.apache.sling.karaf-configs-0.1.1-20161027.144705-6-org.apache.sling.nosql.couchbase.client.CouchbaseClient.factory.config-default.config
[INFO] Downloading: http://repository.apache.org/snapshots/org/apache/sling/org.apache.sling.karaf-configs/0.1.1-SNAPSHOT/org.apache.sling.karaf-configs-0.1.1-20161027.144705-6-org.apache.sling.nosql.couchbase.resourceprovider.CouchbaseNoSqlResourceProviderFactory.factory.config-default.config
[INFO] Downloaded: http://repository.apache.org/snapshots/org/apache/sling/org.apache.sling.karaf-configs/0.1.1-SNAPSHOT/org.apache.sling.karaf-configs-0.1.1-20161027.144705-6-org.apache.jackrabbit.oak.security.user.UserConfigurationImpl.config (96 B at 0.1 KB/sec)
[INFO] Downloading: http://repository.apache.org/snapshots/org/apache/sling/org.apache.sling.karaf-configs/0.1.1-SNAPSHOT/org.apache.sling.karaf-configs-0.1.1-20161027.144705-6-org.apache.sling.nosql.mongodb.resourceprovider.MongoDBNoSqlResourceProviderFactory.factory.config-default.config
[INFO] Downloaded: http://repository.apache.org/snapshots/org/apache/sling/org.apache.sling.karaf-configs/0.1.1-SNAPSHOT/org.apache.sling.karaf-configs-0.1.1-20161027.144705-6-org.apache.jackrabbit.oak.spi.security.user.action.DefaultAuthorizableActionProvider.config (154 B at 0.1 KB/sec)
[INFO] Downloading: http://repository.apache.org/snapshots/org/apache/sling/org.apache.sling.karaf-configs/0.1.1-SNAPSHOT/org.apache.sling.karaf-configs-0.1.1-20161027.144705-6-org.apache.sling.resourceresolver.impl.observation.OsgiObservationBridge.config
[INFO] Downloaded: http://repository.apache.org/snapshots/org/apache/sling/org.apache.sling.karaf-configs/0.1.1-SNAPSHOT/org.apache.sling.karaf-configs-0.1.1-20161027.144705-6-org.apache.sling.commons.messaging.mail.internal.SimpleMailBuilder.config (143 B at 0.1 KB/sec)
[INFO] Downloading: http://repository.apache.org/snapshots/org/apache/sling/org.apache.sling.karaf-configs/0.1.1-SNAPSHOT/org.apache.sling.karaf-configs-0.1.1-20161027.144705-6-org.apache.sling.samples.fling.internal.WiserSmtpService.config
[INFO] Downloaded: http://repository.apache.org/snapshots/org/apache/sling/org.apache.sling.karaf-configs/0.1.1-SNAPSHOT/org.apache.sling.karaf-configs-0.1.1-20161027.144705-6-org.apache.sling.nosql.couchbase.client.CouchbaseClient.factory.config-default.config (111 B at 0.1 KB/sec)
[INFO] Downloading: http://repository.apache.org/snapshots/org/apache/sling/org.apache.sling.karaf-configs/0.1.1-SNAPSHOT/org.apache.sling.karaf-configs-0.1.1-20161027.144705-6-org.apache.sling.serviceusermapping.impl.ServiceUserMapperImpl.amended-event.config
[INFO] Downloaded: http://repository.apache.org/snapshots/org/apache/sling/org.apache.sling.karaf-configs/0.1.1-SNAPSHOT/org.apache.sling.karaf-configs-0.1.1-20161027.144705-6-org.apache.sling.nosql.couchbase.resourceprovider.CouchbaseNoSqlResourceProviderFactory.factory.config-default.config (21 B at 0.0 KB/sec)
[INFO] Downloading: http://repository.apache.org/snapshots/org/apache/sling/org.apache.sling.karaf-configs/0.1.1-SNAPSHOT/org.apache.sling.karaf-configs-0.1.1-20161027.144705-6-org.apache.sling.serviceusermapping.impl.ServiceUserMapperImpl.amended-i18n.config
[INFO] Downloaded: http://repository.apache.org/snapshots/org/apache/sling/org.apache.sling.karaf-configs/0.1.1-SNAPSHOT/org.apache.sling.karaf-configs-0.1.1-20161027.144705-6-org.apache.sling.nosql.mongodb.resourceprovider.MongoDBNoSqlResourceProviderFactory.factory.config-default.config (96 B at 0.1 KB/sec)
[INFO] Downloading: http://repository.apache.org/snapshots/org/apache/sling/org.apache.sling.karaf-configs/0.1.1-SNAPSHOT/org.apache.sling.karaf-configs-0.1.1-20161027.144705-6-org.apache.sling.serviceusermapping.impl.ServiceUserMapperImpl.amended-scripting.config
[INFO] Downloaded: http://repository.apache.org/snapshots/org/apache/sling/org.apache.sling.karaf-configs/0.1.1-SNAPSHOT/org.apache.sling.karaf-configs-0.1.1-20161027.144705-6-org.apache.sling.resourceresolver.impl.observation.OsgiObservationBridge.config (16 B at 0.0 KB/sec)
[INFO] Downloading: http://repository.apache.org/snapshots/org/apache/sling/org.apache.sling.karaf-configs/0.1.1-SNAPSHOT/org.apache.sling.karaf-configs-0.1.1-20161027.144705-6-org.apache.sling.serviceusermapping.impl.ServiceUserMapperImpl.amended-scripting_sightly.config
[INFO] Downloaded: http://repository.apache.org/snapshots/org/apache/sling/org.apache.sling.karaf-configs/0.1.1-SNAPSHOT/org.apache.sling.karaf-configs-0.1.1-20161027.144705-6-org.apache.sling.samples.fling.internal.WiserSmtpService.config (17 B at 0.0 KB/sec)
[INFO] Downloading: http://repository.apache.org/snapshots/org/apache/sling/org.apache.sling.karaf-configs/0.1.1-SNAPSHOT/org.apache.sling.karaf-configs-0.1.1-20161027.144705-6-org.apache.sling.serviceusermapping.impl.ServiceUserMapperImpl.amended-scripting_thymeleaf.config
[INFO] Downloaded: http://repository.apache.org/snapshots/org/apache/sling/org.apache.sling.karaf-configs/0.1.1-SNAPSHOT/org.apache.sling.karaf-configs-0.1.1-20161027.144705-6-org.apache.sling.serviceusermapping.impl.ServiceUserMapperImpl.amended-i18n.config (54 B at 0.0 KB/sec)
[INFO] Downloaded: http://repository.apache.org/snapshots/org/apache/sling/org.apache.sling.karaf-configs/0.1.1-SNAPSHOT/org.apache.sling.karaf-configs-0.1.1-20161027.144705-6-org.apache.sling.serviceusermapping.impl.ServiceUserMapperImpl.amended-event.config (100 B at 0.1 KB/sec)
[INFO] Downloading: http://repository.apache.org/snapshots/org/apache/sling/org.apache.sling.karaf-configs/0.1.1-SNAPSHOT/org.apache.sling.karaf-configs-0.1.1-20161027.144705-6-org.apache.sling.serviceusermapping.impl.ServiceUserMapperImpl.amended-xss.config
[INFO] Downloaded: http://repository.apache.org/snapshots/org/apache/sling/org.apache.sling.karaf-configs/0.1.1-SNAPSHOT/org.apache.sling.karaf-configs-0.1.1-20161027.144705-6-org.apache.sling.serviceusermapping.impl.ServiceUserMapperImpl.amended-scripting.config (69 B at 0.0 KB/sec)
[INFO] Downloaded: http://repository.apache.org/snapshots/org/apache/sling/org.apache.sling.karaf-configs/0.1.1-SNAPSHOT/org.apache.sling.karaf-configs-0.1.1-20161027.144705-6-org.apache.sling.serviceusermapping.impl.ServiceUserMapperImpl.amended-scripting_sightly.config (84 B at 0.0 KB/sec)
[INFO] Downloaded: http://repository.apache.org/snapshots/org/apache/sling/org.apache.sling.karaf-configs/0.1.1-SNAPSHOT/org.apache.sling.karaf-configs-0.1.1-20161027.144705-6-org.apache.sling.serviceusermapping.impl.ServiceUserMapperImpl.amended-scripting_thymeleaf.config (74 B at 0.0 KB/sec)
[INFO] Downloaded: http://repository.apache.org/snapshots/org/apache/sling/org.apache.sling.karaf-configs/0.1.1-SNAPSHOT/org.apache.sling.karaf-configs-0.1.1-20161027.144705-6-org.apache.sling.serviceusermapping.impl.ServiceUserMapperImpl.amended-xss.config (52 B at 0.0 KB/sec)
[JENKINS] Archiving disabled
[JENKINS] Archiving disabled[INFO] ------------------------------------------------------------------------
[INFO] BUILD FAILURE
[INFO] ------------------------------------------------------------------------
[INFO] Total time: 17.989 s
[INFO] Finished at: 2016-10-27T14:55:37+00:00

[INFO] Final Memory: 25M/309M
[INFO] ------------------------------------------------------------------------
Waiting for Jenkins to finish collecting data
[ERROR] Failed to execute goal on project org.apache.sling.karaf-distribution: Could not resolve dependencies for project org.apache.sling:org.apache.sling.karaf-distribution:karaf-assembly:0.1.1-SNAPSHOT: The following artifacts could not be resolved: org.apache.sling:org.apache.sling.karaf-configs:config:org.apache.sling.jcr.base.internal.LoginAdminWhitelistImpl:0.1.1-SNAPSHOT, org.apache.sling:org.apache.sling.karaf-configs:config:org.apache.sling.jcr.repoinit.impl.RepositoryInitializer:0.1.1-SNAPSHOT: Could not find artifact org.apache.sling:org.apache.sling.karaf-configs:config:org.apache.sling.jcr.base.internal.LoginAdminWhitelistImpl:0.1.1-SNAPSHOT in Nexus (http://repository.apache.org/snapshots) -> [Help 1]
[ERROR] 
[ERROR] To see the full stack trace of the errors, re-run Maven with the -e switch.
[ERROR] Re-run Maven using the -X switch to enable full debug logging.
[ERROR] 
[ERROR] For more information about the errors and possible solutions, please read the following articles:
[ERROR] [Help 1] http://cwiki.apache.org/confluence/display/MAVEN/DependencyResolutionException
channel stopped
Recording test results

Jenkins build is back to normal : sling-karaf-org.apache.sling.karaf-distribution-1.8 #8

Posted by Apache Jenkins Server <je...@builds.apache.org>.
See <https://builds.apache.org/job/sling-karaf-org.apache.sling.karaf-distribution-1.8/8/>