You are viewing a plain text version of this content. The canonical link for it is here.
Posted to builds@cassandra.apache.org by Apache Jenkins Server <je...@builds.apache.org> on 2025/04/03 02:59:35 UTC
Build complete: Cassandra-4.1 #573 [UNSTABLE] 49ec0dc692281ffb72fb3824fea09e82336d4400
-------------------------------------------------------------------------------
Build Cassandra-4.1 #573 Still Unstable
URL: https://ci-cassandra.apache.org/job/Cassandra-4.1/573/
-------------------------------------------------------------------------------
Changes:
[Stefan Miklosovic] Suppress CVE-2025-25193
-------------------------------------------------------------------------------
Failed Tests:
6 tests failed.
FAILED: dtest-novnode.topology_test.TestTopology.test_decommissioned_node_cant_rejoin
FAILED: dtest.cql_test.TestCQLSlowQuery.test_remote_query
FAILED: dtest.cqlsh_tests.test_cqlsh_copy.TestCqlshCopy.test_bulk_round_trip_with_timeouts
FAILED: dtest.snapshot_test.TestArchiveCommitlog.test_dont_archive_commitlog
FAILED: org.apache.cassandra.distributed.test.CASTest.fastReadsAndFailedWrites
FAILED: org.apache.cassandra.db.RangeTombstoneTest.overlappingRangeTest
-------------------------------------------------------------------------------
For complete test report and logs see https://nightlies.apache.org/cassandra/Cassandra-4.1/573/