You are viewing a plain text version of this content. The canonical link for it is here.
Posted to dev@lucene.apache.org by Policeman Jenkins Server <je...@thetaphi.de> on 2017/07/27 09:35:22 UTC

[JENKINS] Lucene-Solr-master-Linux (64bit/jdk1.8.0_141) - Build # 20208 - Failure!

Build: https://jenkins.thetaphi.de/job/Lucene-Solr-master-Linux/20208/
Java: 64bit/jdk1.8.0_141 -XX:-UseCompressedOops -XX:+UseConcMarkSweepGC

All tests passed

Build Log:
[...truncated 52820 lines...]
-ecj-javadoc-lint-src:
    [mkdir] Created dir: /tmp/ecj959519816
 [ecj-lint] Compiling 1118 source files to /tmp/ecj959519816
 [ecj-lint] invalid Class-Path header in manifest of jar file: /home/jenkins/.ivy2/cache/org.restlet.jee/org.restlet/jars/org.restlet-2.3.0.jar
 [ecj-lint] invalid Class-Path header in manifest of jar file: /home/jenkins/.ivy2/cache/org.restlet.jee/org.restlet.ext.servlet/jars/org.restlet.ext.servlet-2.3.0.jar
 [ecj-lint] ----------
 [ecj-lint] 1. WARNING in /home/jenkins/workspace/Lucene-Solr-master-Linux/solr/core/src/java/org/apache/solr/core/CoreContainer.java (at line 972)
 [ecj-lint] 	core = new SolrCore(this, dcore, coreConfig);
 [ecj-lint] 	^^^^^^^^^^^^^^^^^^^^^^^^^^^^^^^^^^^^^^^^^^^^
 [ecj-lint] Resource leak: 'core' is never closed
 [ecj-lint] ----------
 [ecj-lint] ----------
 [ecj-lint] 2. WARNING in /home/jenkins/workspace/Lucene-Solr-master-Linux/solr/core/src/java/org/apache/solr/core/HdfsDirectoryFactory.java (at line 234)
 [ecj-lint] 	dir = new BlockDirectory(path, hdfsDir, cache, null, blockCacheReadEnabled, false, cacheMerges, cacheReadOnce);
 [ecj-lint] 	^^^^^^^^^^^^^^^^^^^^^^^^^^^^^^^^^^^^^^^^^^^^^^^^^^^^^^^^^^^^^^^^^^^^^^^^^^^^^^^^^^^^^^^^^^^^^^^^^^^^^^^^^^^^^^
 [ecj-lint] Resource leak: 'dir' is never closed
 [ecj-lint] ----------
 [ecj-lint] ----------
 [ecj-lint] 3. WARNING in /home/jenkins/workspace/Lucene-Solr-master-Linux/solr/core/src/java/org/apache/solr/handler/AnalysisRequestHandlerBase.java (at line 120)
 [ecj-lint] 	reader = cfiltfac.create(reader);
 [ecj-lint] 	^^^^^^^^^^^^^^^^^^^^^^^^^^^^^^^^
 [ecj-lint] Resource leak: 'reader' is not closed at this location
 [ecj-lint] ----------
 [ecj-lint] 4. WARNING in /home/jenkins/workspace/Lucene-Solr-master-Linux/solr/core/src/java/org/apache/solr/handler/AnalysisRequestHandlerBase.java (at line 144)
 [ecj-lint] 	return namedList;
 [ecj-lint] 	^^^^^^^^^^^^^^^^^
 [ecj-lint] Resource leak: 'listBasedTokenStream' is not closed at this location
 [ecj-lint] ----------
 [ecj-lint] ----------
 [ecj-lint] 5. WARNING in /home/jenkins/workspace/Lucene-Solr-master-Linux/solr/core/src/java/org/apache/solr/handler/ReplicationHandler.java (at line 1282)
 [ecj-lint] 	DirectoryReader reader = s==null ? null : s.get().getIndexReader();
 [ecj-lint] 	                ^^^^^^
 [ecj-lint] Resource leak: 'reader' is never closed
 [ecj-lint] ----------
 [ecj-lint] ----------
 [ecj-lint] 6. WARNING in /home/jenkins/workspace/Lucene-Solr-master-Linux/solr/core/src/java/org/apache/solr/handler/sql/SolrTable.java (at line 517)
 [ecj-lint] 	ParallelStream parallelStream = new ParallelStream(zk, collection, tupleStream, numWorkers, comp);
 [ecj-lint] 	               ^^^^^^^^^^^^^^
 [ecj-lint] Resource leak: 'parallelStream' is never closed
 [ecj-lint] ----------
 [ecj-lint] 7. WARNING in /home/jenkins/workspace/Lucene-Solr-master-Linux/solr/core/src/java/org/apache/solr/handler/sql/SolrTable.java (at line 743)
 [ecj-lint] 	ParallelStream parallelStream = new ParallelStream(zkHost, collection, tupleStream, numWorkers, comp);
 [ecj-lint] 	               ^^^^^^^^^^^^^^
 [ecj-lint] Resource leak: 'parallelStream' is never closed
 [ecj-lint] ----------
 [ecj-lint] ----------
 [ecj-lint] 8. WARNING in /home/jenkins/workspace/Lucene-Solr-master-Linux/solr/core/src/java/org/apache/solr/highlight/DefaultSolrHighlighter.java (at line 578)
 [ecj-lint] 	tvWindowStream = new OffsetWindowTokenFilter(tvStream);
 [ecj-lint] 	^^^^^^^^^^^^^^^^^^^^^^^^^^^^^^^^^^^^^^^^^^^^^^^^^^^^^^
 [ecj-lint] Resource leak: 'tvWindowStream' is never closed
 [ecj-lint] ----------
 [ecj-lint] ----------
 [ecj-lint] 9. WARNING in /home/jenkins/workspace/Lucene-Solr-master-Linux/solr/core/src/java/org/apache/solr/request/SimpleFacets.java (at line 912)
 [ecj-lint] 	fastForRandomSet = new HashDocSet(sset.getDocs(), 0, sset.size());
 [ecj-lint] 	^^^^^^^^^^^^^^^^^^^^^^^^^^^^^^^^^^^^^^^^^^^^^^^^^^^^^^^^^^^^^^^^^
 [ecj-lint] Resource leak: 'fastForRandomSet' is never closed
 [ecj-lint] ----------
 [ecj-lint] ----------
 [ecj-lint] 10. WARNING in /home/jenkins/workspace/Lucene-Solr-master-Linux/solr/core/src/java/org/apache/solr/response/SmileResponseWriter.java (at line 33)
 [ecj-lint] 	new SmileWriter(out, request, response).writeResponse();
 [ecj-lint] 	^^^^^^^^^^^^^^^^^^^^^^^^^^^^^^^^^^^^^^^
 [ecj-lint] Resource leak: '<unassigned Closeable value>' is never closed
 [ecj-lint] ----------
 [ecj-lint] ----------
 [ecj-lint] 11. WARNING in /home/jenkins/workspace/Lucene-Solr-master-Linux/solr/core/src/java/org/apache/solr/schema/OpenExchangeRatesOrgProvider.java (at line 146)
 [ecj-lint] 	ratesJsonStream = resourceLoader.openResource(ratesFileLocation);
 [ecj-lint] 	^^^^^^^^^^^^^^^^^^^^^^^^^^^^^^^^^^^^^^^^^^^^^^^^^^^^^^^^^^^^^^^^
 [ecj-lint] Resource leak: 'ratesJsonStream' is not closed at this location
 [ecj-lint] ----------
 [ecj-lint] ----------
 [ecj-lint] 12. WARNING in /home/jenkins/workspace/Lucene-Solr-master-Linux/solr/core/src/java/org/apache/solr/search/CollapsingQParserPlugin.java (at line 1315)
 [ecj-lint] 	UninvertingReader uninvertingReader = new UninvertingReader(new ReaderWrapper(searcher.getSlowAtomicReader(), collapseField), mapping);
 [ecj-lint] 	                  ^^^^^^^^^^^^^^^^^
 [ecj-lint] Resource leak: 'uninvertingReader' is never closed
 [ecj-lint] ----------
 [ecj-lint] ----------
 [ecj-lint] 13. WARNING in /home/jenkins/workspace/Lucene-Solr-master-Linux/solr/core/src/java/org/apache/solr/search/DocSlice.java (at line 145)
 [ecj-lint] 	HashDocSet h = new HashDocSet(docs,offset,len);
 [ecj-lint] 	           ^
 [ecj-lint] Resource leak: 'h' is never closed
 [ecj-lint] ----------
 [ecj-lint] 14. WARNING in /home/jenkins/workspace/Lucene-Solr-master-Linux/solr/core/src/java/org/apache/solr/search/DocSlice.java (at line 154)
 [ecj-lint] 	HashDocSet h = new HashDocSet(docs,offset,len);
 [ecj-lint] 	           ^
 [ecj-lint] Resource leak: 'h' is never closed
 [ecj-lint] ----------
 [ecj-lint] 15. WARNING in /home/jenkins/workspace/Lucene-Solr-master-Linux/solr/core/src/java/org/apache/solr/search/DocSlice.java (at line 163)
 [ecj-lint] 	HashDocSet h = new HashDocSet(docs,offset,len);
 [ecj-lint] 	           ^
 [ecj-lint] Resource leak: 'h' is never closed
 [ecj-lint] ----------
 [ecj-lint] ----------
 [ecj-lint] 16. WARNING in /home/jenkins/workspace/Lucene-Solr-master-Linux/solr/core/src/java/org/apache/solr/search/function/OrdFieldSource.java (at line 78)
 [ecj-lint] 	SolrIndexSearcher is = (SolrIndexSearcher) o;
 [ecj-lint] 	                  ^^
 [ecj-lint] Resource leak: 'is' is never closed
 [ecj-lint] ----------
 [ecj-lint] ----------
 [ecj-lint] 17. WARNING in /home/jenkins/workspace/Lucene-Solr-master-Linux/solr/core/src/java/org/apache/solr/search/function/ReverseOrdFieldSource.java (at line 78)
 [ecj-lint] 	SolrIndexSearcher is = (SolrIndexSearcher) o;
 [ecj-lint] 	                  ^^
 [ecj-lint] Resource leak: 'is' is never closed
 [ecj-lint] ----------
 [ecj-lint] ----------
 [ecj-lint] 18. WARNING in /home/jenkins/workspace/Lucene-Solr-master-Linux/solr/core/src/java/org/apache/solr/servlet/SolrDispatchFilter.java (at line 287)
 [ecj-lint] 	throw new SolrException(ErrorCode.SERVER_ERROR, "Error occurred while loading solr.xml from zookeeper", e);
 [ecj-lint] 	^^^^^^^^^^^^^^^^^^^^^^^^^^^^^^^^^^^^^^^^^^^^^^^^^^^^^^^^^^^^^^^^^^^^^^^^^^^^^^^^^^^^^^^^^^^^^^^^^^^^^^^^^^^
 [ecj-lint] Resource leak: 'loader' is not closed at this location
 [ecj-lint] ----------
 [ecj-lint] ----------
 [ecj-lint] 19. WARNING in /home/jenkins/workspace/Lucene-Solr-master-Linux/solr/core/src/java/org/apache/solr/update/CdcrTransactionLog.java (at line 98)
 [ecj-lint] 	ChannelFastInputStream is = new ChannelFastInputStream(channel, pos);
 [ecj-lint] 	                       ^^
 [ecj-lint] Resource leak: 'is' is never closed
 [ecj-lint] ----------
 [ecj-lint] ----------
 [ecj-lint] 20. WARNING in /home/jenkins/workspace/Lucene-Solr-master-Linux/solr/core/src/java/org/apache/solr/update/HdfsTransactionLog.java (at line 191)
 [ecj-lint] 	LogCodec codec = new LogCodec(resolver);
 [ecj-lint] 	         ^^^^^
 [ecj-lint] Resource leak: 'codec' is never closed
 [ecj-lint] ----------
 [ecj-lint] 21. WARNING in /home/jenkins/workspace/Lucene-Solr-master-Linux/solr/core/src/java/org/apache/solr/update/HdfsTransactionLog.java (at line 261)
 [ecj-lint] 	LogCodec codec = new LogCodec(resolver);
 [ecj-lint] 	         ^^^^^
 [ecj-lint] Resource leak: 'codec' is never closed
 [ecj-lint] ----------
 [ecj-lint] ----------
 [ecj-lint] 22. WARNING in /home/jenkins/workspace/Lucene-Solr-master-Linux/solr/core/src/java/org/apache/solr/update/TransactionLog.java (at line 228)
 [ecj-lint] 	ChannelFastInputStream is = new ChannelFastInputStream(channel, pos);
 [ecj-lint] 	                       ^^
 [ecj-lint] Resource leak: 'is' is never closed
 [ecj-lint] ----------
 [ecj-lint] 23. WARNING in /home/jenkins/workspace/Lucene-Solr-master-Linux/solr/core/src/java/org/apache/solr/update/TransactionLog.java (at line 228)
 [ecj-lint] 	ChannelFastInputStream is = new ChannelFastInputStream(channel, pos);
 [ecj-lint] 	                       ^^
 [ecj-lint] Resource leak: 'is' is never closed
 [ecj-lint] ----------
 [ecj-lint] 24. WARNING in /home/jenkins/workspace/Lucene-Solr-master-Linux/solr/core/src/java/org/apache/solr/update/TransactionLog.java (at line 260)
 [ecj-lint] 	LogCodec codec = new LogCodec(resolver);
 [ecj-lint] 	         ^^^^^
 [ecj-lint] Resource leak: 'codec' is never closed
 [ecj-lint] ----------
 [ecj-lint] 25. WARNING in /home/jenkins/workspace/Lucene-Solr-master-Linux/solr/core/src/java/org/apache/solr/update/TransactionLog.java (at line 275)
 [ecj-lint] 	LogCodec codec = new LogCodec(resolver);
 [ecj-lint] 	         ^^^^^
 [ecj-lint] Resource leak: 'codec' is never closed
 [ecj-lint] ----------
 [ecj-lint] 26. WARNING in /home/jenkins/workspace/Lucene-Solr-master-Linux/solr/core/src/java/org/apache/solr/update/TransactionLog.java (at line 529)
 [ecj-lint] 	LogCodec codec = new LogCodec(resolver);
 [ecj-lint] 	         ^^^^^
 [ecj-lint] Resource leak: 'codec' is never closed
 [ecj-lint] ----------
 [ecj-lint] ----------
 [ecj-lint] 27. ERROR in /home/jenkins/workspace/Lucene-Solr-master-Linux/solr/core/src/java/org/apache/solr/update/processor/UUIDUpdateProcessorFactory.java (at line 23)
 [ecj-lint] 	import org.apache.solr.common.SolrException;
 [ecj-lint] 	       ^^^^^^^^^^^^^^^^^^^^^^^^^^^^^^^^^^^^
 [ecj-lint] The import org.apache.solr.common.SolrException is never used
 [ecj-lint] ----------
 [ecj-lint] 28. ERROR in /home/jenkins/workspace/Lucene-Solr-master-Linux/solr/core/src/java/org/apache/solr/update/processor/UUIDUpdateProcessorFactory.java (at line 24)
 [ecj-lint] 	import static org.apache.solr.common.SolrException.ErrorCode.*;
 [ecj-lint] 	              ^^^^^^^^^^^^^^^^^^^^^^^^^^^^^^^^^^^^^^^^^^^^^^
 [ecj-lint] The import org.apache.solr.common.SolrException.ErrorCode is never used
 [ecj-lint] ----------
 [ecj-lint] ----------
 [ecj-lint] 29. WARNING in /home/jenkins/workspace/Lucene-Solr-master-Linux/solr/core/src/java/org/apache/solr/update/processor/UpdateRequestProcessor.java (at line 85)
 [ecj-lint] 	UpdateRequestProcessor p = this;
 [ecj-lint] 	                       ^
 [ecj-lint] Resource leak: 'p' is never closed
 [ecj-lint] ----------
 [ecj-lint] ----------
 [ecj-lint] 30. WARNING in /home/jenkins/workspace/Lucene-Solr-master-Linux/solr/core/src/java/org/apache/solr/util/SimplePostTool.java (at line 655)
 [ecj-lint] 	BAOS bos =  new BAOS();
 [ecj-lint] 	     ^^^
 [ecj-lint] Resource leak: 'bos' is never closed
 [ecj-lint] ----------
 [ecj-lint] 31. WARNING in /home/jenkins/workspace/Lucene-Solr-master-Linux/solr/core/src/java/org/apache/solr/util/SimplePostTool.java (at line 655)
 [ecj-lint] 	BAOS bos =  new BAOS();
 [ecj-lint] 	     ^^^
 [ecj-lint] Resource leak: 'bos' is never closed
 [ecj-lint] ----------
 [ecj-lint] ----------
 [ecj-lint] 32. WARNING in /home/jenkins/workspace/Lucene-Solr-master-Linux/solr/core/src/java/org/apache/solr/util/SolrLogLayout.java (at line 149)
 [ecj-lint] 	SolrQueryRequest req = requestInfo == null ? null : requestInfo.getReq();
 [ecj-lint] 	                 ^^^
 [ecj-lint] Resource leak: 'req' is never closed
 [ecj-lint] ----------
 [ecj-lint] 32 problems (2 errors, 30 warnings)

BUILD FAILED
/home/jenkins/workspace/Lucene-Solr-master-Linux/build.xml:810: The following error occurred while executing this line:
/home/jenkins/workspace/Lucene-Solr-master-Linux/build.xml:101: The following error occurred while executing this line:
/home/jenkins/workspace/Lucene-Solr-master-Linux/solr/build.xml:689: The following error occurred while executing this line:
/home/jenkins/workspace/Lucene-Solr-master-Linux/lucene/common-build.xml:2007: The following error occurred while executing this line:
/home/jenkins/workspace/Lucene-Solr-master-Linux/lucene/common-build.xml:2046: Compile failed; see the compiler error output for details.

Total time: 64 minutes 16 seconds
Build step 'Invoke Ant' marked build as failure
Archiving artifacts
[WARNINGS] Skipping publisher since build result is FAILURE
Recording test results
Email was triggered for: Failure - Any
Sending email for trigger: Failure - Any

[JENKINS-EA] Lucene-Solr-master-Linux (32bit/jdk-9-ea+178) - Build # 20211 - Still unstable!

Posted by Policeman Jenkins Server <je...@thetaphi.de>.
Build: https://jenkins.thetaphi.de/job/Lucene-Solr-master-Linux/20211/
Java: 32bit/jdk-9-ea+178 -client -XX:+UseSerialGC --illegal-access=deny

1 tests failed.
FAILED:  org.apache.solr.update.processor.AtomicUpdateProcessorFactoryTest.testMultipleThreads

Error Message:
Exception during query

Stack Trace:
java.lang.RuntimeException: Exception during query
	at __randomizedtesting.SeedInfo.seed([9443951AA108D5AF:B871E2972DCCA32B]:0)
	at org.apache.solr.SolrTestCaseJ4.assertQ(SolrTestCaseJ4.java:886)
	at org.apache.solr.update.processor.AtomicUpdateProcessorFactoryTest.testMultipleThreads(AtomicUpdateProcessorFactoryTest.java:260)
	at java.base/jdk.internal.reflect.NativeMethodAccessorImpl.invoke0(Native Method)
	at java.base/jdk.internal.reflect.NativeMethodAccessorImpl.invoke(NativeMethodAccessorImpl.java:62)
	at java.base/jdk.internal.reflect.DelegatingMethodAccessorImpl.invoke(DelegatingMethodAccessorImpl.java:43)
	at java.base/java.lang.reflect.Method.invoke(Method.java:564)
	at com.carrotsearch.randomizedtesting.RandomizedRunner.invoke(RandomizedRunner.java:1713)
	at com.carrotsearch.randomizedtesting.RandomizedRunner$8.evaluate(RandomizedRunner.java:907)
	at com.carrotsearch.randomizedtesting.RandomizedRunner$9.evaluate(RandomizedRunner.java:943)
	at com.carrotsearch.randomizedtesting.RandomizedRunner$10.evaluate(RandomizedRunner.java:957)
	at com.carrotsearch.randomizedtesting.rules.SystemPropertiesRestoreRule$1.evaluate(SystemPropertiesRestoreRule.java:57)
	at org.apache.lucene.util.TestRuleSetupTeardownChained$1.evaluate(TestRuleSetupTeardownChained.java:49)
	at org.apache.lucene.util.AbstractBeforeAfterRule$1.evaluate(AbstractBeforeAfterRule.java:45)
	at org.apache.lucene.util.TestRuleThreadAndTestName$1.evaluate(TestRuleThreadAndTestName.java:48)
	at org.apache.lucene.util.TestRuleIgnoreAfterMaxFailures$1.evaluate(TestRuleIgnoreAfterMaxFailures.java:64)
	at org.apache.lucene.util.TestRuleMarkFailure$1.evaluate(TestRuleMarkFailure.java:47)
	at com.carrotsearch.randomizedtesting.rules.StatementAdapter.evaluate(StatementAdapter.java:36)
	at com.carrotsearch.randomizedtesting.ThreadLeakControl$StatementRunner.run(ThreadLeakControl.java:368)
	at com.carrotsearch.randomizedtesting.ThreadLeakControl.forkTimeoutingTask(ThreadLeakControl.java:817)
	at com.carrotsearch.randomizedtesting.ThreadLeakControl$3.evaluate(ThreadLeakControl.java:468)
	at com.carrotsearch.randomizedtesting.RandomizedRunner.runSingleTest(RandomizedRunner.java:916)
	at com.carrotsearch.randomizedtesting.RandomizedRunner$5.evaluate(RandomizedRunner.java:802)
	at com.carrotsearch.randomizedtesting.RandomizedRunner$6.evaluate(RandomizedRunner.java:852)
	at com.carrotsearch.randomizedtesting.RandomizedRunner$7.evaluate(RandomizedRunner.java:863)
	at com.carrotsearch.randomizedtesting.rules.StatementAdapter.evaluate(StatementAdapter.java:36)
	at com.carrotsearch.randomizedtesting.rules.SystemPropertiesRestoreRule$1.evaluate(SystemPropertiesRestoreRule.java:57)
	at org.apache.lucene.util.AbstractBeforeAfterRule$1.evaluate(AbstractBeforeAfterRule.java:45)
	at com.carrotsearch.randomizedtesting.rules.StatementAdapter.evaluate(StatementAdapter.java:36)
	at org.apache.lucene.util.TestRuleStoreClassName$1.evaluate(TestRuleStoreClassName.java:41)
	at com.carrotsearch.randomizedtesting.rules.NoShadowingOrOverridesOnMethodsRule$1.evaluate(NoShadowingOrOverridesOnMethodsRule.java:40)
	at com.carrotsearch.randomizedtesting.rules.NoShadowingOrOverridesOnMethodsRule$1.evaluate(NoShadowingOrOverridesOnMethodsRule.java:40)
	at com.carrotsearch.randomizedtesting.rules.StatementAdapter.evaluate(StatementAdapter.java:36)
	at com.carrotsearch.randomizedtesting.rules.StatementAdapter.evaluate(StatementAdapter.java:36)
	at org.apache.lucene.util.TestRuleAssertionsRequired$1.evaluate(TestRuleAssertionsRequired.java:53)
	at org.apache.lucene.util.TestRuleMarkFailure$1.evaluate(TestRuleMarkFailure.java:47)
	at org.apache.lucene.util.TestRuleIgnoreAfterMaxFailures$1.evaluate(TestRuleIgnoreAfterMaxFailures.java:64)
	at org.apache.lucene.util.TestRuleIgnoreTestSuites$1.evaluate(TestRuleIgnoreTestSuites.java:54)
	at com.carrotsearch.randomizedtesting.rules.StatementAdapter.evaluate(StatementAdapter.java:36)
	at com.carrotsearch.randomizedtesting.ThreadLeakControl$StatementRunner.run(ThreadLeakControl.java:368)
	at java.base/java.lang.Thread.run(Thread.java:844)
Caused by: java.lang.RuntimeException: REQUEST FAILED: xpath=//result[@numFound=1]
	xml response was: <?xml version="1.0" encoding="UTF-8"?>
<response>
<lst name="responseHeader"><int name="status">0</int><int name="QTime">1</int></lst><result name="response" numFound="0" start="0"></result>
</response>

	request was:q=cat:6biam6rszy1v3fjiwq5l+j114d5xz3xf8vhblrxk3+ni1vl0kxmtv24qmns1e6+gjiruxl9e8yhkk5rp1lx+grik2qsfb4p7lwlwt93s&wt=xml
	at org.apache.solr.SolrTestCaseJ4.assertQ(SolrTestCaseJ4.java:879)
	... 39 more




Build Log:
[...truncated 10869 lines...]
   [junit4] Suite: org.apache.solr.update.processor.AtomicUpdateProcessorFactoryTest
   [junit4]   2> Creating dataDir: /home/jenkins/workspace/Lucene-Solr-master-Linux/solr/build/solr-core/test/J0/temp/solr.update.processor.AtomicUpdateProcessorFactoryTest_9443951AA108D5AF-001/init-core-data-001
   [junit4]   2> 83348 WARN  (SUITE-AtomicUpdateProcessorFactoryTest-seed#[9443951AA108D5AF]-worker) [    ] o.a.s.SolrTestCaseJ4 startTrackingSearchers: numOpens=16 numCloses=16
   [junit4]   2> 83348 INFO  (SUITE-AtomicUpdateProcessorFactoryTest-seed#[9443951AA108D5AF]-worker) [    ] o.a.s.SolrTestCaseJ4 Using TrieFields (NUMERIC_POINTS_SYSPROP=false) w/NUMERIC_DOCVALUES_SYSPROP=false
   [junit4]   2> 83349 INFO  (SUITE-AtomicUpdateProcessorFactoryTest-seed#[9443951AA108D5AF]-worker) [    ] o.a.s.SolrTestCaseJ4 Randomized ssl (true) and clientAuth (false) via: @org.apache.solr.util.RandomizeSSL(reason="", ssl=0.0/0.0, value=0.0/0.0, clientAuth=0.0/0.0)
   [junit4]   2> 83349 INFO  (SUITE-AtomicUpdateProcessorFactoryTest-seed#[9443951AA108D5AF]-worker) [    ] o.a.s.SolrTestCaseJ4 SecureRandom sanity checks: test.solr.allowed.securerandom=null & java.security.egd=file:/dev/./urandom
   [junit4]   2> 83349 INFO  (SUITE-AtomicUpdateProcessorFactoryTest-seed#[9443951AA108D5AF]-worker) [    ] o.a.s.SolrTestCaseJ4 ####initCore
   [junit4]   2> 83350 INFO  (SUITE-AtomicUpdateProcessorFactoryTest-seed#[9443951AA108D5AF]-worker) [    ] o.a.s.c.SolrResourceLoader [null] Added 2 libs to classloader, from paths: [/home/jenkins/workspace/Lucene-Solr-master-Linux/solr/core/src/test-files/solr/collection1/lib, /home/jenkins/workspace/Lucene-Solr-master-Linux/solr/core/src/test-files/solr/collection1/lib/classes]
   [junit4]   2> 83382 INFO  (SUITE-AtomicUpdateProcessorFactoryTest-seed#[9443951AA108D5AF]-worker) [    ] o.a.s.c.SolrConfig Using Lucene MatchVersion: 8.0.0
   [junit4]   2> 83402 INFO  (SUITE-AtomicUpdateProcessorFactoryTest-seed#[9443951AA108D5AF]-worker) [    ] o.a.s.s.IndexSchema [null] Schema name=test
   [junit4]   2> 83498 INFO  (SUITE-AtomicUpdateProcessorFactoryTest-seed#[9443951AA108D5AF]-worker) [    ] o.a.s.s.IndexSchema Loaded schema test/1.0 with uniqueid field id
   [junit4]   2> 83541 INFO  (SUITE-AtomicUpdateProcessorFactoryTest-seed#[9443951AA108D5AF]-worker) [    ] o.a.s.m.r.SolrJmxReporter JMX monitoring for 'solr.node' (registry 'solr.node') enabled at server: com.sun.jmx.mbeanserver.JmxMBeanServer@9e8b8c
   [junit4]   2> 83545 INFO  (SUITE-AtomicUpdateProcessorFactoryTest-seed#[9443951AA108D5AF]-worker) [    ] o.a.s.m.r.SolrJmxReporter JMX monitoring for 'solr.jvm' (registry 'solr.jvm') enabled at server: com.sun.jmx.mbeanserver.JmxMBeanServer@9e8b8c
   [junit4]   2> 83545 INFO  (SUITE-AtomicUpdateProcessorFactoryTest-seed#[9443951AA108D5AF]-worker) [    ] o.a.s.m.r.SolrJmxReporter JMX monitoring for 'solr.jetty' (registry 'solr.jetty') enabled at server: com.sun.jmx.mbeanserver.JmxMBeanServer@9e8b8c
   [junit4]   2> 83546 INFO  (coreLoadExecutor-474-thread-1) [    ] o.a.s.c.SolrResourceLoader [null] Added 2 libs to classloader, from paths: [/home/jenkins/workspace/Lucene-Solr-master-Linux/solr/core/src/test-files/solr/collection1/lib, /home/jenkins/workspace/Lucene-Solr-master-Linux/solr/core/src/test-files/solr/collection1/lib/classes]
   [junit4]   2> 83571 INFO  (coreLoadExecutor-474-thread-1) [    ] o.a.s.c.SolrConfig Using Lucene MatchVersion: 8.0.0
   [junit4]   2> 83596 INFO  (coreLoadExecutor-474-thread-1) [    ] o.a.s.s.IndexSchema [collection1] Schema name=test
   [junit4]   2> 83689 INFO  (coreLoadExecutor-474-thread-1) [    ] o.a.s.s.IndexSchema Loaded schema test/1.0 with uniqueid field id
   [junit4]   2> 83700 INFO  (coreLoadExecutor-474-thread-1) [    ] o.a.s.c.CoreContainer Creating SolrCore 'collection1' using configuration from instancedir /home/jenkins/workspace/Lucene-Solr-master-Linux/solr/core/src/test-files/solr/collection1, trusted=true
   [junit4]   2> 83700 INFO  (coreLoadExecutor-474-thread-1) [    ] o.a.s.m.r.SolrJmxReporter JMX monitoring for 'solr.core.collection1' (registry 'solr.core.collection1') enabled at server: com.sun.jmx.mbeanserver.JmxMBeanServer@9e8b8c
   [junit4]   2> 83700 INFO  (coreLoadExecutor-474-thread-1) [    ] o.a.s.c.SolrCore solr.RecoveryStrategy.Builder
   [junit4]   2> 83700 INFO  (coreLoadExecutor-474-thread-1) [    ] o.a.s.c.SolrCore [[collection1] ] Opening new SolrCore at [/home/jenkins/workspace/Lucene-Solr-master-Linux/solr/core/src/test-files/solr/collection1], dataDir=[/home/jenkins/workspace/Lucene-Solr-master-Linux/solr/build/solr-core/test/J0/temp/solr.update.processor.AtomicUpdateProcessorFactoryTest_9443951AA108D5AF-001/init-core-data-001/]
   [junit4]   2> 83702 INFO  (coreLoadExecutor-474-thread-1) [    ] o.a.s.u.RandomMergePolicy RandomMergePolicy wrapping class org.apache.lucene.index.TieredMergePolicy: [TieredMergePolicy: maxMergeAtOnce=21, maxMergeAtOnceExplicit=48, maxMergedSegmentMB=24.4384765625, floorSegmentMB=1.083984375, forceMergeDeletesPctAllowed=6.0468503319009255, segmentsPerTier=18.0, maxCFSSegmentSizeMB=8.796093022207999E12, noCFSRatio=1.0
   [junit4]   2> 83763 INFO  (coreLoadExecutor-474-thread-1) [    ] o.a.s.u.UpdateHandler Using UpdateLog implementation: org.apache.solr.update.UpdateLog
   [junit4]   2> 83763 INFO  (coreLoadExecutor-474-thread-1) [    ] o.a.s.u.UpdateLog Initializing UpdateLog: dataDir= defaultSyncLevel=FLUSH numRecordsToKeep=100 maxNumLogsToKeep=10 numVersionBuckets=65536
   [junit4]   2> 83764 INFO  (coreLoadExecutor-474-thread-1) [    ] o.a.s.u.CommitTracker Hard AutoCommit: disabled
   [junit4]   2> 83764 INFO  (coreLoadExecutor-474-thread-1) [    ] o.a.s.u.CommitTracker Soft AutoCommit: disabled
   [junit4]   2> 83765 INFO  (coreLoadExecutor-474-thread-1) [    ] o.a.s.u.RandomMergePolicy RandomMergePolicy wrapping class org.apache.lucene.index.TieredMergePolicy: [TieredMergePolicy: maxMergeAtOnce=47, maxMergeAtOnceExplicit=21, maxMergedSegmentMB=69.9970703125, floorSegmentMB=0.8935546875, forceMergeDeletesPctAllowed=12.025496456159294, segmentsPerTier=46.0, maxCFSSegmentSizeMB=8.796093022207999E12, noCFSRatio=0.2017702079580036
   [junit4]   2> 83765 INFO  (coreLoadExecutor-474-thread-1) [    ] o.a.s.s.SolrIndexSearcher Opening [Searcher@18dc824[collection1] main]
   [junit4]   2> 83766 INFO  (coreLoadExecutor-474-thread-1) [    ] o.a.s.h.c.SpellCheckComponent Initializing spell checkers
   [junit4]   2> 83790 INFO  (coreLoadExecutor-474-thread-1) [    ] o.a.s.s.DirectSolrSpellChecker init: {name=direct,classname=DirectSolrSpellChecker,field=lowerfilt,minQueryLength=3}
   [junit4]   2> 83855 INFO  (coreLoadExecutor-474-thread-1) [    ] o.a.s.h.ReplicationHandler Commits will be reserved for  10000
   [junit4]   2> 83855 INFO  (searcherExecutor-475-thread-1) [    ] o.a.s.h.c.SpellCheckComponent Loading spell index for spellchecker: default
   [junit4]   2> 83855 INFO  (searcherExecutor-475-thread-1) [    ] o.a.s.h.c.SpellCheckComponent Loading spell index for spellchecker: direct
   [junit4]   2> 83855 INFO  (searcherExecutor-475-thread-1) [    ] o.a.s.h.c.SpellCheckComponent Loading spell index for spellchecker: wordbreak
   [junit4]   2> 83855 INFO  (searcherExecutor-475-thread-1) [    ] o.a.s.h.c.SpellCheckComponent Loading spell index for spellchecker: multipleFields
   [junit4]   2> 83855 INFO  (coreLoadExecutor-474-thread-1) [    ] o.a.s.u.UpdateLog Could not find max version in index or recent updates, using new clock 1574110643262324736
   [junit4]   2> 83855 INFO  (searcherExecutor-475-thread-1) [    ] o.a.s.h.c.SpellCheckComponent Loading spell index for spellchecker: jarowinkler
   [junit4]   2> 83856 INFO  (searcherExecutor-475-thread-1) [    ] o.a.s.h.c.SpellCheckComponent Loading spell index for spellchecker: external
   [junit4]   2> 83856 INFO  (searcherExecutor-475-thread-1) [    ] o.a.s.h.c.SpellCheckComponent Loading spell index for spellchecker: freq
   [junit4]   2> 83856 INFO  (searcherExecutor-475-thread-1) [    ] o.a.s.h.c.SpellCheckComponent Loading spell index for spellchecker: fqcn
   [junit4]   2> 83856 INFO  (searcherExecutor-475-thread-1) [    ] o.a.s.h.c.SpellCheckComponent Loading spell index for spellchecker: perDict
   [junit4]   2> 83858 INFO  (SUITE-AtomicUpdateProcessorFactoryTest-seed#[9443951AA108D5AF]-worker) [    ] o.a.s.SolrTestCaseJ4 ####initCore end
   [junit4]   2> 83858 INFO  (searcherExecutor-475-thread-1) [    ] o.a.s.c.SolrCore [collection1] Registered new searcher Searcher@18dc824[collection1] main{ExitableDirectoryReader(UninvertingDirectoryReader())}
   [junit4]   2> 83859 INFO  (TEST-AtomicUpdateProcessorFactoryTest.testWrongAtomicOpPassed-seed#[9443951AA108D5AF]) [    ] o.a.s.SolrTestCaseJ4 ###Starting testWrongAtomicOpPassed
   [junit4]   2> 83860 INFO  (TEST-AtomicUpdateProcessorFactoryTest.testWrongAtomicOpPassed-seed#[9443951AA108D5AF]) [    ] o.a.s.SolrTestCaseJ4 ###Ending testWrongAtomicOpPassed
   [junit4]   2> 83861 INFO  (TEST-AtomicUpdateProcessorFactoryTest.testBasics-seed#[9443951AA108D5AF]) [    ] o.a.s.SolrTestCaseJ4 ###Starting testBasics
   [junit4]   2> 83884 INFO  (TEST-AtomicUpdateProcessorFactoryTest.testBasics-seed#[9443951AA108D5AF]) [    ] o.a.s.u.DirectUpdateHandler2 start commit{_version_=1574110643292733440,optimize=false,openSearcher=true,waitSearcher=true,expungeDeletes=false,softCommit=false,prepareCommit=false}
   [junit4]   2> 83884 INFO  (TEST-AtomicUpdateProcessorFactoryTest.testBasics-seed#[9443951AA108D5AF]) [    ] o.a.s.u.SolrIndexWriter Calling setCommitData with IW:org.apache.solr.update.SolrIndexWriter@9e71a1 commitCommandVersion:1574110643292733440
   [junit4]   2> 83893 INFO  (TEST-AtomicUpdateProcessorFactoryTest.testBasics-seed#[9443951AA108D5AF]) [    ] o.a.s.s.SolrIndexSearcher Opening [Searcher@21b477[collection1] main]
   [junit4]   2> 83894 INFO  (TEST-AtomicUpdateProcessorFactoryTest.testBasics-seed#[9443951AA108D5AF]) [    ] o.a.s.u.DirectUpdateHandler2 end_commit_flush
   [junit4]   2> 83895 INFO  (searcherExecutor-475-thread-1) [    ] o.a.s.c.SolrCore [collection1] Registered new searcher Searcher@21b477[collection1] main{ExitableDirectoryReader(UninvertingDirectoryReader(Uninverting(_0(8.0.0):C1)))}
   [junit4]   2> 83895 INFO  (TEST-AtomicUpdateProcessorFactoryTest.testBasics-seed#[9443951AA108D5AF]) [    ] o.a.s.u.p.LogUpdateProcessorFactory [collection1]  webapp=null path=null params={}{commit=} 0 11
   [junit4]   2> 83898 INFO  (TEST-AtomicUpdateProcessorFactoryTest.testBasics-seed#[9443951AA108D5AF]) [    ] o.a.s.c.S.Request [collection1]  webapp=null path=null params={q=id:1&wt=xml} hits=1 status=0 QTime=0
   [junit4]   2> 83900 INFO  (TEST-AtomicUpdateProcessorFactoryTest.testBasics-seed#[9443951AA108D5AF]) [    ] o.a.s.c.S.Request [collection1]  webapp=null path=null params={q=cat:human&wt=xml} hits=1 status=0 QTime=0
   [junit4]   2> 83901 INFO  (TEST-AtomicUpdateProcessorFactoryTest.testBasics-seed#[9443951AA108D5AF]) [    ] o.a.s.c.S.Request [collection1]  webapp=null path=null params={q=title:Mr&wt=xml} hits=1 status=0 QTime=0
   [junit4]   2> 83902 INFO  (TEST-AtomicUpdateProcessorFactoryTest.testBasics-seed#[9443951AA108D5AF]) [    ] o.a.s.c.S.Request [collection1]  webapp=null path=null params={q=count_i:20&wt=xml} hits=1 status=0 QTime=0
   [junit4]   2> 83902 INFO  (TEST-AtomicUpdateProcessorFactoryTest.testBasics-seed#[9443951AA108D5AF]) [    ] o.a.s.c.S.Request [collection1]  webapp=null path=null params={q=name_s:Virat&wt=xml} hits=1 status=0 QTime=0
   [junit4]   2> 83903 INFO  (TEST-AtomicUpdateProcessorFactoryTest.testBasics-seed#[9443951AA108D5AF]) [    ] o.a.s.c.S.Request [collection1]  webapp=null path=null params={q=multiDefault:Delhi&wt=xml} hits=1 status=0 QTime=0
   [junit4]   2> 83907 INFO  (TEST-AtomicUpdateProcessorFactoryTest.testBasics-seed#[9443951AA108D5AF]) [    ] o.a.s.u.DirectUpdateHandler2 start commit{_version_=1574110643316850688,optimize=false,openSearcher=true,waitSearcher=true,expungeDeletes=false,softCommit=false,prepareCommit=false}
   [junit4]   2> 83907 INFO  (TEST-AtomicUpdateProcessorFactoryTest.testBasics-seed#[9443951AA108D5AF]) [    ] o.a.s.u.SolrIndexWriter Calling setCommitData with IW:org.apache.solr.update.SolrIndexWriter@9e71a1 commitCommandVersion:1574110643316850688
   [junit4]   2> 83922 INFO  (TEST-AtomicUpdateProcessorFactoryTest.testBasics-seed#[9443951AA108D5AF]) [    ] o.a.s.s.SolrIndexSearcher Opening [Searcher@b2fa9b[collection1] main]
   [junit4]   2> 83924 INFO  (searcherExecutor-475-thread-1) [    ] o.a.s.c.SolrCore [collection1] Registered new searcher Searcher@b2fa9b[collection1] main{ExitableDirectoryReader(UninvertingDirectoryReader(Uninverting(_1(8.0.0):C1)))}
   [junit4]   2> 83925 INFO  (TEST-AtomicUpdateProcessorFactoryTest.testBasics-seed#[9443951AA108D5AF]) [    ] o.a.s.u.DirectUpdateHandler2 end_commit_flush
   [junit4]   2> 83925 INFO  (TEST-AtomicUpdateProcessorFactoryTest.testBasics-seed#[9443951AA108D5AF]) [    ] o.a.s.u.p.LogUpdateProcessorFactory [collection1]  webapp=null path=null params={}{commit=} 0 17
   [junit4]   2> 83926 INFO  (TEST-AtomicUpdateProcessorFactoryTest.testBasics-seed#[9443951AA108D5AF]) [    ] o.a.s.c.S.Request [collection1]  webapp=null path=null params={q=id:1&wt=xml} hits=1 status=0 QTime=0
   [junit4]   2> 83926 INFO  (TEST-AtomicUpdateProcessorFactoryTest.testBasics-seed#[9443951AA108D5AF]) [    ] o.a.s.c.S.Request [collection1]  webapp=null path=null params={q=cat:human&wt=xml} hits=1 status=0 QTime=0
   [junit4]   2> 83927 INFO  (TEST-AtomicUpdateProcessorFactoryTest.testBasics-seed#[9443951AA108D5AF]) [    ] o.a.s.c.S.Request [collection1]  webapp=null path=null params={q=cat:animal&wt=xml} hits=1 status=0 QTime=0
   [junit4]   2> 83928 INFO  (TEST-AtomicUpdateProcessorFactoryTest.testBasics-seed#[9443951AA108D5AF]) [    ] o.a.s.c.S.Request [collection1]  webapp=null path=null params={q=title:Mr&wt=xml} hits=0 status=0 QTime=0
   [junit4]   2> 83929 INFO  (TEST-AtomicUpdateProcessorFactoryTest.testBasics-seed#[9443951AA108D5AF]) [    ] o.a.s.c.S.Request [collection1]  webapp=null path=null params={q=title:Dr&wt=xml} hits=1 status=0 QTime=0
   [junit4]   2> 83929 INFO  (TEST-AtomicUpdateProcessorFactoryTest.testBasics-seed#[9443951AA108D5AF]) [    ] o.a.s.c.S.Request [collection1]  webapp=null path=null params={q=count_i:20&wt=xml} hits=0 status=0 QTime=0
   [junit4]   2> 83930 INFO  (TEST-AtomicUpdateProcessorFactoryTest.testBasics-seed#[9443951AA108D5AF]) [    ] o.a.s.c.S.Request [collection1]  webapp=null path=null params={q=count_i:40&wt=xml} hits=1 status=0 QTime=0
   [junit4]   2> 83930 INFO  (TEST-AtomicUpdateProcessorFactoryTest.testBasics-seed#[9443951AA108D5AF]) [    ] o.a.s.c.S.Request [collection1]  webapp=null path=null params={q=name_s:Virat&wt=xml} hits=0 status=0 QTime=0
   [junit4]   2> 83931 INFO  (TEST-AtomicUpdateProcessorFactoryTest.testBasics-seed#[9443951AA108D5AF]) [    ] o.a.s.c.S.Request [collection1]  webapp=null path=null params={q=multiDefault:Delhi&wt=xml} hits=0 status=0 QTime=0
   [junit4]   2> 83931 INFO  (TEST-AtomicUpdateProcessorFactoryTest.testBasics-seed#[9443951AA108D5AF]) [    ] o.a.s.SolrTestCaseJ4 ###Ending testBasics
   [junit4]   2> 83933 INFO  (TEST-AtomicUpdateProcessorFactoryTest.testMultipleThreads-seed#[9443951AA108D5AF]) [    ] o.a.s.SolrTestCaseJ4 ###Starting testMultipleThreads
   [junit4]   2> 83933 INFO  (TEST-AtomicUpdateProcessorFactoryTest.testMultipleThreads-seed#[9443951AA108D5AF]) [    ] o.a.s.u.DirectUpdateHandler2 [collection1] REMOVING ALL DOCUMENTS FROM INDEX
   [junit4]   2> 83933 INFO  (TEST-AtomicUpdateProcessorFactoryTest.testMultipleThreads-seed#[9443951AA108D5AF]) [    ] o.a.s.s.SolrIndexSearcher Opening [Searcher@1054c88[collection1] realtime]
   [junit4]   2> 83934 INFO  (TEST-AtomicUpdateProcessorFactoryTest.testMultipleThreads-seed#[9443951AA108D5AF]) [    ] o.a.s.u.p.LogUpdateProcessorFactory [collection1]  webapp=null path=null params={_version_=-9223372036854775807&update.distrib=FROMLEADER&versions=true&wt=json&indent=true}{deleteByQuery=*:* (-9223372036854775807)} 0 0
   [junit4]   2> 83948 WARN  (Thread-238) [    ] o.a.s.u.p.AtomicUpdateProcessorFactory Atomic update failed due to version conflict for 10 expected=1574110643346210816 actual=1574110643357745152Retrying with new version .... (1)
   [junit4]   2> 83949 WARN  (Thread-238) [    ] o.a.s.u.p.AtomicUpdateProcessorFactory Atomic update failed due to version conflict for 10 expected=1574110643357745152 actual=1574110643360890880Retrying with new version .... (2)
   [junit4]   2> 83954 WARN  (Thread-236) [    ] o.a.s.u.p.AtomicUpdateProcessorFactory Atomic update failed due to version conflict for 10 expected=1574110643346210816 actual=1574110643360890881Retrying with new version .... (1)
   [junit4]   2> 83954 WARN  (Thread-237) [    ] o.a.s.u.p.AtomicUpdateProcessorFactory Atomic update failed due to version conflict for 10 expected=1574110643346210816 actual=1574110643360890881Retrying with new version .... (1)
   [junit4]   2> 83954 WARN  (Thread-235) [    ] o.a.s.u.p.AtomicUpdateProcessorFactory Atomic update failed due to version conflict for 10 expected=1574110643346210816 actual=1574110643360890881Retrying with new version .... (1)
   [junit4]   2> 83954 WARN  (Thread-234) [    ] o.a.s.u.p.AtomicUpdateProcessorFactory Atomic update failed due to version conflict for 10 expected=1574110643346210816 actual=1574110643360890881Retrying with new version .... (1)
   [junit4]   2> 83955 WARN  (Thread-237) [    ] o.a.s.u.p.AtomicUpdateProcessorFactory Atomic update failed due to version conflict for 10 expected=1574110643360890881 actual=1574110643366133760Retrying with new version .... (2)
   [junit4]   2> 83955 WARN  (Thread-234) [    ] o.a.s.u.p.AtomicUpdateProcessorFactory Atomic update failed due to version conflict for 10 expected=1574110643360890881 actual=1574110643366133760Retrying with new version .... (2)
   [junit4]   2> 83955 WARN  (Thread-236) [    ] o.a.s.u.p.AtomicUpdateProcessorFactory Atomic update failed due to version conflict for 10 expected=1574110643360890881 actual=1574110643366133760Retrying with new version .... (2)
   [junit4]   2> 83955 WARN  (Thread-236) [    ] o.a.s.u.p.AtomicUpdateProcessorFactory Atomic update failed due to version conflict for 10 expected=1574110643366133760 actual=1574110643367182336Retrying with new version .... (3)
   [junit4]   2> 83956 WARN  (Thread-237) [    ] o.a.s.u.p.AtomicUpdateProcessorFactory Atomic update failed due to version conflict for 10 expected=1574110643367182336 actual=1574110643367182337Retrying with new version .... (3)
   [junit4]   2> 83957 INFO  (TEST-AtomicUpdateProcessorFactoryTest.testMultipleThreads-seed#[9443951AA108D5AF]) [    ] o.a.s.u.DirectUpdateHandler2 start commit{_version_=1574110643369279488,optimize=false,openSearcher=true,waitSearcher=true,expungeDeletes=false,softCommit=false,prepareCommit=false}
   [junit4]   2> 83957 INFO  (TEST-AtomicUpdateProcessorFactoryTest.testMultipleThreads-seed#[9443951AA108D5AF]) [    ] o.a.s.u.SolrIndexWriter Calling setCommitData with IW:org.apache.solr.update.SolrIndexWriter@9e71a1 commitCommandVersion:1574110643369279488
   [junit4]   2> 83964 INFO  (TEST-AtomicUpdateProcessorFactoryTest.testMultipleThreads-seed#[9443951AA108D5AF]) [    ] o.a.s.s.SolrIndexSearcher Opening [Searcher@1b2eaea[collection1] main]
   [junit4]   2> 83964 INFO  (TEST-AtomicUpdateProcessorFactoryTest.testMultipleThreads-seed#[9443951AA108D5AF]) [    ] o.a.s.u.DirectUpdateHandler2 end_commit_flush
   [junit4]   2> 83966 INFO  (searcherExecutor-475-thread-1) [    ] o.a.s.c.SolrCore [collection1] Registered new searcher Searcher@1b2eaea[collection1] main{ExitableDirectoryReader(UninvertingDirectoryReader(Uninverting(_2(8.0.0):C10/9:delGen=1)))}
   [junit4]   2> 83966 INFO  (TEST-AtomicUpdateProcessorFactoryTest.testMultipleThreads-seed#[9443951AA108D5AF]) [    ] o.a.s.u.p.LogUpdateProcessorFactory [collection1]  webapp=null path=null params={}{commit=} 0 9
   [junit4]   2> 83967 INFO  (TEST-AtomicUpdateProcessorFactoryTest.testMultipleThreads-seed#[9443951AA108D5AF]) [    ] o.a.s.c.S.Request [collection1]  webapp=null path=null params={q=id:10&wt=xml} hits=1 status=0 QTime=0
   [junit4]   2> 83969 INFO  (TEST-AtomicUpdateProcessorFactoryTest.testMultipleThreads-seed#[9443951AA108D5AF]) [    ] o.a.s.c.S.Request [collection1]  webapp=null path=null params={q=cat:6biam6rszy1v3fjiwq5l+j114d5xz3xf8vhblrxk3+ni1vl0kxmtv24qmns1e6+gjiruxl9e8yhkk5rp1lx+grik2qsfb4p7lwlwt93s&wt=xml} hits=0 status=0 QTime=1
   [junit4]   2> 83970 ERROR (TEST-AtomicUpdateProcessorFactoryTest.testMultipleThreads-seed#[9443951AA108D5AF]) [    ] o.a.s.SolrTestCaseJ4 REQUEST FAILED: xpath=//result[@numFound=1]
   [junit4]   2> 	xml response was: <?xml version="1.0" encoding="UTF-8"?>
   [junit4]   2> <response>
   [junit4]   2> <lst name="responseHeader"><int name="status">0</int><int name="QTime">1</int></lst><result name="response" numFound="0" start="0"></result>
   [junit4]   2> </response>
   [junit4]   2> 
   [junit4]   2> 	request was:q=cat:6biam6rszy1v3fjiwq5l+j114d5xz3xf8vhblrxk3+ni1vl0kxmtv24qmns1e6+gjiruxl9e8yhkk5rp1lx+grik2qsfb4p7lwlwt93s&wt=xml
   [junit4]   2> 83970 ERROR (TEST-AtomicUpdateProcessorFactoryTest.testMultipleThreads-seed#[9443951AA108D5AF]) [    ] o.a.s.SolrTestCaseJ4 REQUEST FAILED: q=cat:6biam6rszy1v3fjiwq5l+j114d5xz3xf8vhblrxk3+ni1vl0kxmtv24qmns1e6+gjiruxl9e8yhkk5rp1lx+grik2qsfb4p7lwlwt93s&wt=xml:java.lang.RuntimeException: REQUEST FAILED: xpath=//result[@numFound=1]
   [junit4]   2> 	xml response was: <?xml version="1.0" encoding="UTF-8"?>
   [junit4]   2> <response>
   [junit4]   2> <lst name="responseHeader"><int name="status">0</int><int name="QTime">1</int></lst><result name="response" numFound="0" start="0"></result>
   [junit4]   2> </response>
   [junit4]   2> 
   [junit4]   2> 	request was:q=cat:6biam6rszy1v3fjiwq5l+j114d5xz3xf8vhblrxk3+ni1vl0kxmtv24qmns1e6+gjiruxl9e8yhkk5rp1lx+grik2qsfb4p7lwlwt93s&wt=xml
   [junit4]   2> 	at org.apache.solr.SolrTestCaseJ4.assertQ(SolrTestCaseJ4.java:879)
   [junit4]   2> 	at org.apache.solr.update.processor.AtomicUpdateProcessorFactoryTest.testMultipleThreads(AtomicUpdateProcessorFactoryTest.java:260)
   [junit4]   2> 	at java.base/jdk.internal.reflect.NativeMethodAccessorImpl.invoke0(Native Method)
   [junit4]   2> 	at java.base/jdk.internal.reflect.NativeMethodAccessorImpl.invoke(NativeMethodAccessorImpl.java:62)
   [junit4]   2> 	at java.base/jdk.internal.reflect.DelegatingMethodAccessorImpl.invoke(DelegatingMethodAccessorImpl.java:43)
   [junit4]   2> 	at java.base/java.lang.reflect.Method.invoke(Method.java:564)
   [junit4]   2> 	at com.carrotsearch.randomizedtesting.RandomizedRunner.invoke(RandomizedRunner.java:1713)
   [junit4]   2> 	at com.carrotsearch.randomizedtesting.RandomizedRunner$8.evaluate(RandomizedRunner.java:907)
   [junit4]   2> 	at com.carrotsearch.randomizedtesting.RandomizedRunner$9.evaluate(RandomizedRunner.java:943)
   [junit4]   2> 	at com.carrotsearch.randomizedtesting.RandomizedRunner$10.evaluate(RandomizedRunner.java:957)
   [junit4]   2> 	at com.carrotsearch.randomizedtesting.rules.SystemPropertiesRestoreRule$1.evaluate(SystemPropertiesRestoreRule.java:57)
   [junit4]   2> 	at org.apache.lucene.util.TestRuleSetupTeardownChained$1.evaluate(TestRuleSetupTeardownChained.java:49)
   [junit4]   2> 	at org.apache.lucene.util.AbstractBeforeAfterRule$1.evaluate(AbstractBeforeAfterRule.java:45)
   [junit4]   2> 	at org.apache.lucene.util.TestRuleThreadAndTestName$1.evaluate(TestRuleThreadAndTestName.java:48)
   [junit4]   2> 	at org.apache.lucene.util.TestRuleIgnoreAfterMaxFailures$1.evaluate(TestRuleIgnoreAfterMaxFailures.java:64)
   [junit4]   2> 	at org.apache.lucene.util.TestRuleMarkFailure$1.evaluate(TestRuleMarkFailure.java:47)
   [junit4]   2> 	at com.carrotsearch.randomizedtesting.rules.StatementAdapter.evaluate(StatementAdapter.java:36)
   [junit4]   2> 	at com.carrotsearch.randomizedtesting.ThreadLeakControl$StatementRunner.run(ThreadLeakControl.java:368)
   [junit4]   2> 	at com.carrotsearch.randomizedtesting.ThreadLeakControl.forkTimeoutingTask(ThreadLeakControl.java:817)
   [junit4]   2> 	at com.carrotsearch.randomizedtesting.ThreadLeakControl$3.evaluate(ThreadLeakControl.java:468)
   [junit4]   2> 	at com.carrotsearch.randomizedtesting.RandomizedRunner.runSingleTest(RandomizedRunner.java:916)
   [junit4]   2> 	at com.carrotsearch.randomizedtesting.RandomizedRunner$5.evaluate(RandomizedRunner.java:802)
   [junit4]   2> 	at com.carrotsearch.randomizedtesting.RandomizedRunner$6.evaluate(RandomizedRunner.java:852)
   [junit4]   2> 	at com.carrotsearch.randomizedtesting.RandomizedRunner$7.evaluate(RandomizedRunner.java:863)
   [junit4]   2> 	at com.carrotsearch.randomizedtesting.rules.StatementAdapter.evaluate(StatementAdapter.java:36)
   [junit4]   2> 	at com.carrotsearch.randomizedtesting.rules.SystemPropertiesRestoreRule$1.evaluate(SystemPropertiesRestoreRule.java:57)
   [junit4]   2> 	at org.apache.lucene.util.AbstractBeforeAfterRule$1.evaluate(AbstractBeforeAfterRule.java:45)
   [junit4]   2> 	at com.carrotsearch.randomizedtesting.rules.StatementAdapter.evaluate(StatementAdapter.java:36)
   [junit4]   2> 	at org.apache.lucene.util.TestRuleStoreClassName$1.evaluate(TestRuleStoreClassName.java:41)
   [junit4]   2> 	at com.carrotsearch.randomizedtesting.rules.NoShadowingOrOverridesOnMethodsRule$1.evaluate(NoShadowingOrOverridesOnMethodsRule.java:40)
   [junit4]   2> 	at com.carrotsearch.randomizedtesting.rules.NoShadowingOrOverridesOnMethodsRule$1.evaluate(NoShadowingOrOverridesOnMethodsRule.java:40)
   [junit4]   2> 	at com.carrotsearch.randomizedtesting.rules.StatementAdapter.evaluate(StatementAdapter.java:36)
   [junit4]   2> 	at com.carrotsearch.randomizedtesting.rules.StatementAdapter.evaluate(StatementAdapter.java:36)
   [junit4]   2> 	at org.apache.lucene.util.TestRuleAssertionsRequired$1.evaluate(TestRuleAssertionsRequired.java:53)
   [junit4]   2> 	at org.apache.lucene.util.TestRuleMarkFailure$1.evaluate(TestRuleMarkFailure.java:47)
   [junit4]   2> 	at org.apache.lucene.util.TestRuleIgnoreAfterMaxFailures$1.evaluate(TestRuleIgnoreAfterMaxFailures.java:64)
   [junit4]   2> 	at org.apache.lucene.util.TestRuleIgnoreTestSuites$1.evaluate(TestRuleIgnoreTestSuites.java:54)
   [junit4]   2> 	at com.carrotsearch.randomizedtesting.rules.StatementAdapter.evaluate(StatementAdapter.java:36)
   [junit4]   2> 	at com.carrotsearch.randomizedtesting.ThreadLeakControl$StatementRunner.run(ThreadLeakControl.java:368)
   [junit4]   2> 	at java.base/java.lang.Thread.run(Thread.java:844)
   [junit4]   2> 
   [junit4]   2> 83971 INFO  (TEST-AtomicUpdateProcessorFactoryTest.testMultipleThreads-seed#[9443951AA108D5AF]) [    ] o.a.s.SolrTestCaseJ4 ###Ending testMultipleThreads
   [junit4]   2> NOTE: reproduce with: ant test  -Dtestcase=AtomicUpdateProcessorFactoryTest -Dtests.method=testMultipleThreads -Dtests.seed=9443951AA108D5AF -Dtests.multiplier=3 -Dtests.slow=true -Dtests.locale=ar-ER -Dtests.timezone=America/Fort_Nelson -Dtests.asserts=true -Dtests.file.encoding=UTF-8
   [junit4] ERROR   0.04s J0 | AtomicUpdateProcessorFactoryTest.testMultipleThreads <<<
   [junit4]    > Throwable #1: java.lang.RuntimeException: Exception during query
   [junit4]    > 	at __randomizedtesting.SeedInfo.seed([9443951AA108D5AF:B871E2972DCCA32B]:0)
   [junit4]    > 	at org.apache.solr.SolrTestCaseJ4.assertQ(SolrTestCaseJ4.java:886)
   [junit4]    > 	at org.apache.solr.update.processor.AtomicUpdateProcessorFactoryTest.testMultipleThreads(AtomicUpdateProcessorFactoryTest.java:260)
   [junit4]    > 	at java.base/jdk.internal.reflect.NativeMethodAccessorImpl.invoke0(Native Method)
   [junit4]    > 	at java.base/jdk.internal.reflect.NativeMethodAccessorImpl.invoke(NativeMethodAccessorImpl.java:62)
   [junit4]    > 	at java.base/jdk.internal.reflect.DelegatingMethodAccessorImpl.invoke(DelegatingMethodAccessorImpl.java:43)
   [junit4]    > 	at java.base/java.lang.reflect.Method.invoke(Method.java:564)
   [junit4]    > 	at java.base/java.lang.Thread.run(Thread.java:844)
   [junit4]    > Caused by: java.lang.RuntimeException: REQUEST FAILED: xpath=//result[@numFound=1]
   [junit4]    > 	xml response was: <?xml version="1.0" encoding="UTF-8"?>
   [junit4]    > <response>
   [junit4]    > <lst name="responseHeader"><int name="status">0</int><int name="QTime">1</int></lst><result name="response" numFound="0" start="0"></result>
   [junit4]    > </response>
   [junit4]    > 	request was:q=cat:6biam6rszy1v3fjiwq5l+j114d5xz3xf8vhblrxk3+ni1vl0kxmtv24qmns1e6+gjiruxl9e8yhkk5rp1lx+grik2qsfb4p7lwlwt93s&wt=xml
   [junit4]    > 	at org.apache.solr.SolrTestCaseJ4.assertQ(SolrTestCaseJ4.java:879)
   [junit4]    > 	... 39 more
   [junit4]   2> 83975 INFO  (TEST-AtomicUpdateProcessorFactoryTest.testNoUniqueIdPassed-seed#[9443951AA108D5AF]) [    ] o.a.s.SolrTestCaseJ4 ###Starting testNoUniqueIdPassed
   [junit4]   2> 83975 INFO  (TEST-AtomicUpdateProcessorFactoryTest.testNoUniqueIdPassed-seed#[9443951AA108D5AF]) [    ] o.a.s.SolrTestCaseJ4 ###Ending testNoUniqueIdPassed
   [junit4]   2> 83975 INFO  (SUITE-AtomicUpdateProcessorFactoryTest-seed#[9443951AA108D5AF]-worker) [    ] o.a.s.SolrTestCaseJ4 ###deleteCore
   [junit4]   2> 83975 INFO  (SUITE-AtomicUpdateProcessorFactoryTest-seed#[9443951AA108D5AF]-worker) [    ] o.a.s.c.CoreContainer Shutting down CoreContainer instance=10334766
   [junit4]   2> 83975 INFO  (SUITE-AtomicUpdateProcessorFactoryTest-seed#[9443951AA108D5AF]-worker) [    ] o.a.s.m.SolrMetricManager Closing metric reporters for registry=solr.node, tag=null
   [junit4]   2> 83977 INFO  (SUITE-AtomicUpdateProcessorFactoryTest-seed#[9443951AA108D5AF]-worker) [    ] o.a.s.m.SolrMetricManager Closing metric reporters for registry=solr.jvm, tag=null
   [junit4]   2> 83978 INFO  (SUITE-AtomicUpdateProcessorFactoryTest-seed#[9443951AA108D5AF]-worker) [    ] o.a.s.m.SolrMetricManager Closing metric reporters for registry=solr.jetty, tag=null
   [junit4]   2> 83982 INFO  (SUITE-AtomicUpdateProcessorFactoryTest-seed#[9443951AA108D5AF]-worker) [    ] o.a.s.c.TransientSolrCoreCacheDefault Allocating transient cache for 2147483647 transient cores
   [junit4]   2> 83982 INFO  (coreCloseExecutor-480-thread-1) [    ] o.a.s.c.SolrCore [collection1]  CLOSING SolrCore org.apache.solr.core.SolrCore@f4b301
   [junit4]   2> 83984 INFO  (coreCloseExecutor-480-thread-1) [    ] o.a.s.m.SolrMetricManager Closing metric reporters for registry=solr.core.collection1, tag=16036609
   [junit4]   2> NOTE: leaving temporary files on disk at: /home/jenkins/workspace/Lucene-Solr-master-Linux/solr/build/solr-core/test/J0/temp/solr.update.processor.AtomicUpdateProcessorFactoryTest_9443951AA108D5AF-001
   [junit4]   2> Jul 27, 2017 8:54:51 PM com.carrotsearch.randomizedtesting.ThreadLeakControl checkThreadLeaks
   [junit4]   2> WARNING: Will linger awaiting termination of 1 leaked thread(s).
   [junit4]   2> NOTE: test params are: codec=CheapBastard, sim=RandomSimilarity(queryNorm=false): {}, locale=ar-ER, timezone=America/Fort_Nelson
   [junit4]   2> NOTE: Linux 4.10.0-27-generic i386/Oracle Corporation 9 (32-bit)/cpus=8,threads=1,free=43000584,total=160505856
   [junit4]   2> NOTE: All tests run in this JVM: [OverriddenZkACLAndCredentialsProvidersTest, TestFieldCacheSortRandom, TestCustomStream, DistributedFacetPivotLongTailTest, TestExpandComponent, TestNonDefinedSimilarityFactory, ManagedSchemaRoundRobinCloudTest, TestLegacyFieldReuse, OverseerRolesTest, TestCollectionAPI, AtomicUpdateProcessorFactoryTest]
   [junit4] Completed [31/726 (1!)] on J0 in 0.90s, 4 tests, 1 error <<< FAILURES!

[...truncated 38811 lines...]

[JENKINS] Lucene-Solr-master-Linux (64bit/jdk1.8.0_141) - Build # 20210 - Failure!

Posted by Policeman Jenkins Server <je...@thetaphi.de>.
Build: https://jenkins.thetaphi.de/job/Lucene-Solr-master-Linux/20210/
Java: 64bit/jdk1.8.0_141 -XX:-UseCompressedOops -XX:+UseSerialGC

All tests passed

Build Log:
[...truncated 52864 lines...]
-ecj-javadoc-lint-src:
    [mkdir] Created dir: /tmp/ecj1897145613
 [ecj-lint] Compiling 1118 source files to /tmp/ecj1897145613
 [ecj-lint] invalid Class-Path header in manifest of jar file: /home/jenkins/.ivy2/cache/org.restlet.jee/org.restlet/jars/org.restlet-2.3.0.jar
 [ecj-lint] invalid Class-Path header in manifest of jar file: /home/jenkins/.ivy2/cache/org.restlet.jee/org.restlet.ext.servlet/jars/org.restlet.ext.servlet-2.3.0.jar
 [ecj-lint] ----------
 [ecj-lint] 1. WARNING in /home/jenkins/workspace/Lucene-Solr-master-Linux/solr/core/src/java/org/apache/solr/core/CoreContainer.java (at line 972)
 [ecj-lint] 	core = new SolrCore(this, dcore, coreConfig);
 [ecj-lint] 	^^^^^^^^^^^^^^^^^^^^^^^^^^^^^^^^^^^^^^^^^^^^
 [ecj-lint] Resource leak: 'core' is never closed
 [ecj-lint] ----------
 [ecj-lint] ----------
 [ecj-lint] 2. WARNING in /home/jenkins/workspace/Lucene-Solr-master-Linux/solr/core/src/java/org/apache/solr/core/HdfsDirectoryFactory.java (at line 234)
 [ecj-lint] 	dir = new BlockDirectory(path, hdfsDir, cache, null, blockCacheReadEnabled, false, cacheMerges, cacheReadOnce);
 [ecj-lint] 	^^^^^^^^^^^^^^^^^^^^^^^^^^^^^^^^^^^^^^^^^^^^^^^^^^^^^^^^^^^^^^^^^^^^^^^^^^^^^^^^^^^^^^^^^^^^^^^^^^^^^^^^^^^^^^
 [ecj-lint] Resource leak: 'dir' is never closed
 [ecj-lint] ----------
 [ecj-lint] ----------
 [ecj-lint] 3. WARNING in /home/jenkins/workspace/Lucene-Solr-master-Linux/solr/core/src/java/org/apache/solr/handler/AnalysisRequestHandlerBase.java (at line 120)
 [ecj-lint] 	reader = cfiltfac.create(reader);
 [ecj-lint] 	^^^^^^^^^^^^^^^^^^^^^^^^^^^^^^^^
 [ecj-lint] Resource leak: 'reader' is not closed at this location
 [ecj-lint] ----------
 [ecj-lint] 4. WARNING in /home/jenkins/workspace/Lucene-Solr-master-Linux/solr/core/src/java/org/apache/solr/handler/AnalysisRequestHandlerBase.java (at line 144)
 [ecj-lint] 	return namedList;
 [ecj-lint] 	^^^^^^^^^^^^^^^^^
 [ecj-lint] Resource leak: 'listBasedTokenStream' is not closed at this location
 [ecj-lint] ----------
 [ecj-lint] ----------
 [ecj-lint] 5. WARNING in /home/jenkins/workspace/Lucene-Solr-master-Linux/solr/core/src/java/org/apache/solr/handler/ReplicationHandler.java (at line 1282)
 [ecj-lint] 	DirectoryReader reader = s==null ? null : s.get().getIndexReader();
 [ecj-lint] 	                ^^^^^^
 [ecj-lint] Resource leak: 'reader' is never closed
 [ecj-lint] ----------
 [ecj-lint] ----------
 [ecj-lint] 6. WARNING in /home/jenkins/workspace/Lucene-Solr-master-Linux/solr/core/src/java/org/apache/solr/handler/sql/SolrTable.java (at line 517)
 [ecj-lint] 	ParallelStream parallelStream = new ParallelStream(zk, collection, tupleStream, numWorkers, comp);
 [ecj-lint] 	               ^^^^^^^^^^^^^^
 [ecj-lint] Resource leak: 'parallelStream' is never closed
 [ecj-lint] ----------
 [ecj-lint] 7. WARNING in /home/jenkins/workspace/Lucene-Solr-master-Linux/solr/core/src/java/org/apache/solr/handler/sql/SolrTable.java (at line 743)
 [ecj-lint] 	ParallelStream parallelStream = new ParallelStream(zkHost, collection, tupleStream, numWorkers, comp);
 [ecj-lint] 	               ^^^^^^^^^^^^^^
 [ecj-lint] Resource leak: 'parallelStream' is never closed
 [ecj-lint] ----------
 [ecj-lint] ----------
 [ecj-lint] 8. WARNING in /home/jenkins/workspace/Lucene-Solr-master-Linux/solr/core/src/java/org/apache/solr/highlight/DefaultSolrHighlighter.java (at line 578)
 [ecj-lint] 	tvWindowStream = new OffsetWindowTokenFilter(tvStream);
 [ecj-lint] 	^^^^^^^^^^^^^^^^^^^^^^^^^^^^^^^^^^^^^^^^^^^^^^^^^^^^^^
 [ecj-lint] Resource leak: 'tvWindowStream' is never closed
 [ecj-lint] ----------
 [ecj-lint] ----------
 [ecj-lint] 9. WARNING in /home/jenkins/workspace/Lucene-Solr-master-Linux/solr/core/src/java/org/apache/solr/request/SimpleFacets.java (at line 912)
 [ecj-lint] 	fastForRandomSet = new HashDocSet(sset.getDocs(), 0, sset.size());
 [ecj-lint] 	^^^^^^^^^^^^^^^^^^^^^^^^^^^^^^^^^^^^^^^^^^^^^^^^^^^^^^^^^^^^^^^^^
 [ecj-lint] Resource leak: 'fastForRandomSet' is never closed
 [ecj-lint] ----------
 [ecj-lint] ----------
 [ecj-lint] 10. WARNING in /home/jenkins/workspace/Lucene-Solr-master-Linux/solr/core/src/java/org/apache/solr/response/SmileResponseWriter.java (at line 33)
 [ecj-lint] 	new SmileWriter(out, request, response).writeResponse();
 [ecj-lint] 	^^^^^^^^^^^^^^^^^^^^^^^^^^^^^^^^^^^^^^^
 [ecj-lint] Resource leak: '<unassigned Closeable value>' is never closed
 [ecj-lint] ----------
 [ecj-lint] ----------
 [ecj-lint] 11. WARNING in /home/jenkins/workspace/Lucene-Solr-master-Linux/solr/core/src/java/org/apache/solr/schema/OpenExchangeRatesOrgProvider.java (at line 146)
 [ecj-lint] 	ratesJsonStream = resourceLoader.openResource(ratesFileLocation);
 [ecj-lint] 	^^^^^^^^^^^^^^^^^^^^^^^^^^^^^^^^^^^^^^^^^^^^^^^^^^^^^^^^^^^^^^^^
 [ecj-lint] Resource leak: 'ratesJsonStream' is not closed at this location
 [ecj-lint] ----------
 [ecj-lint] ----------
 [ecj-lint] 12. WARNING in /home/jenkins/workspace/Lucene-Solr-master-Linux/solr/core/src/java/org/apache/solr/search/CollapsingQParserPlugin.java (at line 1315)
 [ecj-lint] 	UninvertingReader uninvertingReader = new UninvertingReader(new ReaderWrapper(searcher.getSlowAtomicReader(), collapseField), mapping);
 [ecj-lint] 	                  ^^^^^^^^^^^^^^^^^
 [ecj-lint] Resource leak: 'uninvertingReader' is never closed
 [ecj-lint] ----------
 [ecj-lint] ----------
 [ecj-lint] 13. WARNING in /home/jenkins/workspace/Lucene-Solr-master-Linux/solr/core/src/java/org/apache/solr/search/DocSlice.java (at line 145)
 [ecj-lint] 	HashDocSet h = new HashDocSet(docs,offset,len);
 [ecj-lint] 	           ^
 [ecj-lint] Resource leak: 'h' is never closed
 [ecj-lint] ----------
 [ecj-lint] 14. WARNING in /home/jenkins/workspace/Lucene-Solr-master-Linux/solr/core/src/java/org/apache/solr/search/DocSlice.java (at line 154)
 [ecj-lint] 	HashDocSet h = new HashDocSet(docs,offset,len);
 [ecj-lint] 	           ^
 [ecj-lint] Resource leak: 'h' is never closed
 [ecj-lint] ----------
 [ecj-lint] 15. WARNING in /home/jenkins/workspace/Lucene-Solr-master-Linux/solr/core/src/java/org/apache/solr/search/DocSlice.java (at line 163)
 [ecj-lint] 	HashDocSet h = new HashDocSet(docs,offset,len);
 [ecj-lint] 	           ^
 [ecj-lint] Resource leak: 'h' is never closed
 [ecj-lint] ----------
 [ecj-lint] ----------
 [ecj-lint] 16. WARNING in /home/jenkins/workspace/Lucene-Solr-master-Linux/solr/core/src/java/org/apache/solr/search/function/OrdFieldSource.java (at line 78)
 [ecj-lint] 	SolrIndexSearcher is = (SolrIndexSearcher) o;
 [ecj-lint] 	                  ^^
 [ecj-lint] Resource leak: 'is' is never closed
 [ecj-lint] ----------
 [ecj-lint] ----------
 [ecj-lint] 17. WARNING in /home/jenkins/workspace/Lucene-Solr-master-Linux/solr/core/src/java/org/apache/solr/search/function/ReverseOrdFieldSource.java (at line 78)
 [ecj-lint] 	SolrIndexSearcher is = (SolrIndexSearcher) o;
 [ecj-lint] 	                  ^^
 [ecj-lint] Resource leak: 'is' is never closed
 [ecj-lint] ----------
 [ecj-lint] ----------
 [ecj-lint] 18. WARNING in /home/jenkins/workspace/Lucene-Solr-master-Linux/solr/core/src/java/org/apache/solr/servlet/SolrDispatchFilter.java (at line 287)
 [ecj-lint] 	throw new SolrException(ErrorCode.SERVER_ERROR, "Error occurred while loading solr.xml from zookeeper", e);
 [ecj-lint] 	^^^^^^^^^^^^^^^^^^^^^^^^^^^^^^^^^^^^^^^^^^^^^^^^^^^^^^^^^^^^^^^^^^^^^^^^^^^^^^^^^^^^^^^^^^^^^^^^^^^^^^^^^^^
 [ecj-lint] Resource leak: 'loader' is not closed at this location
 [ecj-lint] ----------
 [ecj-lint] ----------
 [ecj-lint] 19. WARNING in /home/jenkins/workspace/Lucene-Solr-master-Linux/solr/core/src/java/org/apache/solr/update/CdcrTransactionLog.java (at line 98)
 [ecj-lint] 	ChannelFastInputStream is = new ChannelFastInputStream(channel, pos);
 [ecj-lint] 	                       ^^
 [ecj-lint] Resource leak: 'is' is never closed
 [ecj-lint] ----------
 [ecj-lint] ----------
 [ecj-lint] 20. WARNING in /home/jenkins/workspace/Lucene-Solr-master-Linux/solr/core/src/java/org/apache/solr/update/HdfsTransactionLog.java (at line 191)
 [ecj-lint] 	LogCodec codec = new LogCodec(resolver);
 [ecj-lint] 	         ^^^^^
 [ecj-lint] Resource leak: 'codec' is never closed
 [ecj-lint] ----------
 [ecj-lint] 21. WARNING in /home/jenkins/workspace/Lucene-Solr-master-Linux/solr/core/src/java/org/apache/solr/update/HdfsTransactionLog.java (at line 261)
 [ecj-lint] 	LogCodec codec = new LogCodec(resolver);
 [ecj-lint] 	         ^^^^^
 [ecj-lint] Resource leak: 'codec' is never closed
 [ecj-lint] ----------
 [ecj-lint] ----------
 [ecj-lint] 22. WARNING in /home/jenkins/workspace/Lucene-Solr-master-Linux/solr/core/src/java/org/apache/solr/update/TransactionLog.java (at line 228)
 [ecj-lint] 	ChannelFastInputStream is = new ChannelFastInputStream(channel, pos);
 [ecj-lint] 	                       ^^
 [ecj-lint] Resource leak: 'is' is never closed
 [ecj-lint] ----------
 [ecj-lint] 23. WARNING in /home/jenkins/workspace/Lucene-Solr-master-Linux/solr/core/src/java/org/apache/solr/update/TransactionLog.java (at line 228)
 [ecj-lint] 	ChannelFastInputStream is = new ChannelFastInputStream(channel, pos);
 [ecj-lint] 	                       ^^
 [ecj-lint] Resource leak: 'is' is never closed
 [ecj-lint] ----------
 [ecj-lint] 24. WARNING in /home/jenkins/workspace/Lucene-Solr-master-Linux/solr/core/src/java/org/apache/solr/update/TransactionLog.java (at line 260)
 [ecj-lint] 	LogCodec codec = new LogCodec(resolver);
 [ecj-lint] 	         ^^^^^
 [ecj-lint] Resource leak: 'codec' is never closed
 [ecj-lint] ----------
 [ecj-lint] 25. WARNING in /home/jenkins/workspace/Lucene-Solr-master-Linux/solr/core/src/java/org/apache/solr/update/TransactionLog.java (at line 275)
 [ecj-lint] 	LogCodec codec = new LogCodec(resolver);
 [ecj-lint] 	         ^^^^^
 [ecj-lint] Resource leak: 'codec' is never closed
 [ecj-lint] ----------
 [ecj-lint] 26. WARNING in /home/jenkins/workspace/Lucene-Solr-master-Linux/solr/core/src/java/org/apache/solr/update/TransactionLog.java (at line 529)
 [ecj-lint] 	LogCodec codec = new LogCodec(resolver);
 [ecj-lint] 	         ^^^^^
 [ecj-lint] Resource leak: 'codec' is never closed
 [ecj-lint] ----------
 [ecj-lint] ----------
 [ecj-lint] 27. ERROR in /home/jenkins/workspace/Lucene-Solr-master-Linux/solr/core/src/java/org/apache/solr/update/processor/UUIDUpdateProcessorFactory.java (at line 23)
 [ecj-lint] 	import org.apache.solr.common.SolrException;
 [ecj-lint] 	       ^^^^^^^^^^^^^^^^^^^^^^^^^^^^^^^^^^^^
 [ecj-lint] The import org.apache.solr.common.SolrException is never used
 [ecj-lint] ----------
 [ecj-lint] 28. ERROR in /home/jenkins/workspace/Lucene-Solr-master-Linux/solr/core/src/java/org/apache/solr/update/processor/UUIDUpdateProcessorFactory.java (at line 24)
 [ecj-lint] 	import static org.apache.solr.common.SolrException.ErrorCode.*;
 [ecj-lint] 	              ^^^^^^^^^^^^^^^^^^^^^^^^^^^^^^^^^^^^^^^^^^^^^^
 [ecj-lint] The import org.apache.solr.common.SolrException.ErrorCode is never used
 [ecj-lint] ----------
 [ecj-lint] ----------
 [ecj-lint] 29. WARNING in /home/jenkins/workspace/Lucene-Solr-master-Linux/solr/core/src/java/org/apache/solr/update/processor/UpdateRequestProcessor.java (at line 85)
 [ecj-lint] 	UpdateRequestProcessor p = this;
 [ecj-lint] 	                       ^
 [ecj-lint] Resource leak: 'p' is never closed
 [ecj-lint] ----------
 [ecj-lint] ----------
 [ecj-lint] 30. WARNING in /home/jenkins/workspace/Lucene-Solr-master-Linux/solr/core/src/java/org/apache/solr/util/SimplePostTool.java (at line 655)
 [ecj-lint] 	BAOS bos =  new BAOS();
 [ecj-lint] 	     ^^^
 [ecj-lint] Resource leak: 'bos' is never closed
 [ecj-lint] ----------
 [ecj-lint] 31. WARNING in /home/jenkins/workspace/Lucene-Solr-master-Linux/solr/core/src/java/org/apache/solr/util/SimplePostTool.java (at line 655)
 [ecj-lint] 	BAOS bos =  new BAOS();
 [ecj-lint] 	     ^^^
 [ecj-lint] Resource leak: 'bos' is never closed
 [ecj-lint] ----------
 [ecj-lint] ----------
 [ecj-lint] 32. WARNING in /home/jenkins/workspace/Lucene-Solr-master-Linux/solr/core/src/java/org/apache/solr/util/SolrLogLayout.java (at line 149)
 [ecj-lint] 	SolrQueryRequest req = requestInfo == null ? null : requestInfo.getReq();
 [ecj-lint] 	                 ^^^
 [ecj-lint] Resource leak: 'req' is never closed
 [ecj-lint] ----------
 [ecj-lint] 32 problems (2 errors, 30 warnings)

BUILD FAILED
/home/jenkins/workspace/Lucene-Solr-master-Linux/build.xml:810: The following error occurred while executing this line:
/home/jenkins/workspace/Lucene-Solr-master-Linux/build.xml:101: The following error occurred while executing this line:
/home/jenkins/workspace/Lucene-Solr-master-Linux/solr/build.xml:689: The following error occurred while executing this line:
/home/jenkins/workspace/Lucene-Solr-master-Linux/lucene/common-build.xml:2007: The following error occurred while executing this line:
/home/jenkins/workspace/Lucene-Solr-master-Linux/lucene/common-build.xml:2046: Compile failed; see the compiler error output for details.

Total time: 69 minutes 58 seconds
Build step 'Invoke Ant' marked build as failure
Archiving artifacts
[WARNINGS] Skipping publisher since build result is FAILURE
Recording test results
Email was triggered for: Failure - Any
Sending email for trigger: Failure - Any

[JENKINS-EA] Lucene-Solr-master-Linux (64bit/jdk-9-ea+178) - Build # 20209 - Still unstable!

Posted by Policeman Jenkins Server <je...@thetaphi.de>.
Build: https://jenkins.thetaphi.de/job/Lucene-Solr-master-Linux/20209/
Java: 64bit/jdk-9-ea+178 -XX:-UseCompressedOops -XX:+UseG1GC --illegal-access=deny

1 tests failed.
FAILED:  org.apache.solr.update.processor.AtomicUpdateProcessorFactoryTest.testMultipleThreads

Error Message:
Exception during query

Stack Trace:
java.lang.RuntimeException: Exception during query
	at __randomizedtesting.SeedInfo.seed([4C84BF0BB100789D:60B6C8863DC40E19]:0)
	at org.apache.solr.SolrTestCaseJ4.assertQ(SolrTestCaseJ4.java:886)
	at org.apache.solr.update.processor.AtomicUpdateProcessorFactoryTest.testMultipleThreads(AtomicUpdateProcessorFactoryTest.java:264)
	at java.base/jdk.internal.reflect.NativeMethodAccessorImpl.invoke0(Native Method)
	at java.base/jdk.internal.reflect.NativeMethodAccessorImpl.invoke(NativeMethodAccessorImpl.java:62)
	at java.base/jdk.internal.reflect.DelegatingMethodAccessorImpl.invoke(DelegatingMethodAccessorImpl.java:43)
	at java.base/java.lang.reflect.Method.invoke(Method.java:564)
	at com.carrotsearch.randomizedtesting.RandomizedRunner.invoke(RandomizedRunner.java:1713)
	at com.carrotsearch.randomizedtesting.RandomizedRunner$8.evaluate(RandomizedRunner.java:907)
	at com.carrotsearch.randomizedtesting.RandomizedRunner$9.evaluate(RandomizedRunner.java:943)
	at com.carrotsearch.randomizedtesting.RandomizedRunner$10.evaluate(RandomizedRunner.java:957)
	at com.carrotsearch.randomizedtesting.rules.SystemPropertiesRestoreRule$1.evaluate(SystemPropertiesRestoreRule.java:57)
	at org.apache.lucene.util.TestRuleSetupTeardownChained$1.evaluate(TestRuleSetupTeardownChained.java:49)
	at org.apache.lucene.util.AbstractBeforeAfterRule$1.evaluate(AbstractBeforeAfterRule.java:45)
	at org.apache.lucene.util.TestRuleThreadAndTestName$1.evaluate(TestRuleThreadAndTestName.java:48)
	at org.apache.lucene.util.TestRuleIgnoreAfterMaxFailures$1.evaluate(TestRuleIgnoreAfterMaxFailures.java:64)
	at org.apache.lucene.util.TestRuleMarkFailure$1.evaluate(TestRuleMarkFailure.java:47)
	at com.carrotsearch.randomizedtesting.rules.StatementAdapter.evaluate(StatementAdapter.java:36)
	at com.carrotsearch.randomizedtesting.ThreadLeakControl$StatementRunner.run(ThreadLeakControl.java:368)
	at com.carrotsearch.randomizedtesting.ThreadLeakControl.forkTimeoutingTask(ThreadLeakControl.java:817)
	at com.carrotsearch.randomizedtesting.ThreadLeakControl$3.evaluate(ThreadLeakControl.java:468)
	at com.carrotsearch.randomizedtesting.RandomizedRunner.runSingleTest(RandomizedRunner.java:916)
	at com.carrotsearch.randomizedtesting.RandomizedRunner$5.evaluate(RandomizedRunner.java:802)
	at com.carrotsearch.randomizedtesting.RandomizedRunner$6.evaluate(RandomizedRunner.java:852)
	at com.carrotsearch.randomizedtesting.RandomizedRunner$7.evaluate(RandomizedRunner.java:863)
	at com.carrotsearch.randomizedtesting.rules.StatementAdapter.evaluate(StatementAdapter.java:36)
	at com.carrotsearch.randomizedtesting.rules.SystemPropertiesRestoreRule$1.evaluate(SystemPropertiesRestoreRule.java:57)
	at org.apache.lucene.util.AbstractBeforeAfterRule$1.evaluate(AbstractBeforeAfterRule.java:45)
	at com.carrotsearch.randomizedtesting.rules.StatementAdapter.evaluate(StatementAdapter.java:36)
	at org.apache.lucene.util.TestRuleStoreClassName$1.evaluate(TestRuleStoreClassName.java:41)
	at com.carrotsearch.randomizedtesting.rules.NoShadowingOrOverridesOnMethodsRule$1.evaluate(NoShadowingOrOverridesOnMethodsRule.java:40)
	at com.carrotsearch.randomizedtesting.rules.NoShadowingOrOverridesOnMethodsRule$1.evaluate(NoShadowingOrOverridesOnMethodsRule.java:40)
	at com.carrotsearch.randomizedtesting.rules.StatementAdapter.evaluate(StatementAdapter.java:36)
	at com.carrotsearch.randomizedtesting.rules.StatementAdapter.evaluate(StatementAdapter.java:36)
	at org.apache.lucene.util.TestRuleAssertionsRequired$1.evaluate(TestRuleAssertionsRequired.java:53)
	at org.apache.lucene.util.TestRuleMarkFailure$1.evaluate(TestRuleMarkFailure.java:47)
	at org.apache.lucene.util.TestRuleIgnoreAfterMaxFailures$1.evaluate(TestRuleIgnoreAfterMaxFailures.java:64)
	at org.apache.lucene.util.TestRuleIgnoreTestSuites$1.evaluate(TestRuleIgnoreTestSuites.java:54)
	at com.carrotsearch.randomizedtesting.rules.StatementAdapter.evaluate(StatementAdapter.java:36)
	at com.carrotsearch.randomizedtesting.ThreadLeakControl$StatementRunner.run(ThreadLeakControl.java:368)
	at java.base/java.lang.Thread.run(Thread.java:844)
Caused by: java.lang.RuntimeException: REQUEST FAILED: xpath=//result[@numFound=1]
	xml response was: <?xml version="1.0" encoding="UTF-8"?>
<response>
<lst name="responseHeader"><int name="status">0</int><int name="QTime">0</int></lst><result name="response" numFound="0" start="0"></result>
</response>

	request was:q=int_i:25&wt=xml
	at org.apache.solr.SolrTestCaseJ4.assertQ(SolrTestCaseJ4.java:879)
	... 39 more




Build Log:
[...truncated 13167 lines...]
   [junit4] Suite: org.apache.solr.update.processor.AtomicUpdateProcessorFactoryTest
   [junit4]   2> Creating dataDir: /home/jenkins/workspace/Lucene-Solr-master-Linux/solr/build/solr-core/test/J1/temp/solr.update.processor.AtomicUpdateProcessorFactoryTest_4C84BF0BB100789D-001/init-core-data-001
   [junit4]   2> 2007752 WARN  (SUITE-AtomicUpdateProcessorFactoryTest-seed#[4C84BF0BB100789D]-worker) [    ] o.a.s.SolrTestCaseJ4 startTrackingSearchers: numOpens=17 numCloses=17
   [junit4]   2> 2007752 INFO  (SUITE-AtomicUpdateProcessorFactoryTest-seed#[4C84BF0BB100789D]-worker) [    ] o.a.s.SolrTestCaseJ4 Using PointFields (NUMERIC_POINTS_SYSPROP=true) w/NUMERIC_DOCVALUES_SYSPROP=false
   [junit4]   2> 2007753 INFO  (SUITE-AtomicUpdateProcessorFactoryTest-seed#[4C84BF0BB100789D]-worker) [    ] o.a.s.SolrTestCaseJ4 Randomized ssl (false) and clientAuth (true) via: @org.apache.solr.util.RandomizeSSL(reason="", ssl=0.0/0.0, value=0.0/0.0, clientAuth=0.0/0.0)
   [junit4]   2> 2007753 INFO  (SUITE-AtomicUpdateProcessorFactoryTest-seed#[4C84BF0BB100789D]-worker) [    ] o.a.s.SolrTestCaseJ4 SecureRandom sanity checks: test.solr.allowed.securerandom=null & java.security.egd=file:/dev/./urandom
   [junit4]   2> 2007753 INFO  (SUITE-AtomicUpdateProcessorFactoryTest-seed#[4C84BF0BB100789D]-worker) [    ] o.a.s.SolrTestCaseJ4 ####initCore
   [junit4]   2> 2007753 INFO  (SUITE-AtomicUpdateProcessorFactoryTest-seed#[4C84BF0BB100789D]-worker) [    ] o.a.s.c.SolrResourceLoader [null] Added 2 libs to classloader, from paths: [/home/jenkins/workspace/Lucene-Solr-master-Linux/solr/core/src/test-files/solr/collection1/lib, /home/jenkins/workspace/Lucene-Solr-master-Linux/solr/core/src/test-files/solr/collection1/lib/classes]
   [junit4]   2> 2007769 INFO  (SUITE-AtomicUpdateProcessorFactoryTest-seed#[4C84BF0BB100789D]-worker) [    ] o.a.s.c.SolrConfig Using Lucene MatchVersion: 8.0.0
   [junit4]   2> 2007784 INFO  (SUITE-AtomicUpdateProcessorFactoryTest-seed#[4C84BF0BB100789D]-worker) [    ] o.a.s.s.IndexSchema [null] Schema name=test
   [junit4]   2> 2007844 INFO  (SUITE-AtomicUpdateProcessorFactoryTest-seed#[4C84BF0BB100789D]-worker) [    ] o.a.s.s.IndexSchema Loaded schema test/1.0 with uniqueid field id
   [junit4]   2> 2007869 INFO  (SUITE-AtomicUpdateProcessorFactoryTest-seed#[4C84BF0BB100789D]-worker) [    ] o.a.s.m.r.SolrJmxReporter JMX monitoring for 'solr.node' (registry 'solr.node') enabled at server: com.sun.jmx.mbeanserver.JmxMBeanServer@421464d4
   [junit4]   2> 2007871 INFO  (SUITE-AtomicUpdateProcessorFactoryTest-seed#[4C84BF0BB100789D]-worker) [    ] o.a.s.m.r.SolrJmxReporter JMX monitoring for 'solr.jvm' (registry 'solr.jvm') enabled at server: com.sun.jmx.mbeanserver.JmxMBeanServer@421464d4
   [junit4]   2> 2007871 INFO  (SUITE-AtomicUpdateProcessorFactoryTest-seed#[4C84BF0BB100789D]-worker) [    ] o.a.s.m.r.SolrJmxReporter JMX monitoring for 'solr.jetty' (registry 'solr.jetty') enabled at server: com.sun.jmx.mbeanserver.JmxMBeanServer@421464d4
   [junit4]   2> 2007872 INFO  (coreLoadExecutor-8918-thread-1) [    ] o.a.s.c.SolrResourceLoader [null] Added 2 libs to classloader, from paths: [/home/jenkins/workspace/Lucene-Solr-master-Linux/solr/core/src/test-files/solr/collection1/lib, /home/jenkins/workspace/Lucene-Solr-master-Linux/solr/core/src/test-files/solr/collection1/lib/classes]
   [junit4]   2> 2007892 INFO  (coreLoadExecutor-8918-thread-1) [    ] o.a.s.c.SolrConfig Using Lucene MatchVersion: 8.0.0
   [junit4]   2> 2007905 INFO  (coreLoadExecutor-8918-thread-1) [    ] o.a.s.s.IndexSchema [collection1] Schema name=test
   [junit4]   2> 2007958 INFO  (coreLoadExecutor-8918-thread-1) [    ] o.a.s.s.IndexSchema Loaded schema test/1.0 with uniqueid field id
   [junit4]   2> 2007962 INFO  (coreLoadExecutor-8918-thread-1) [    ] o.a.s.c.CoreContainer Creating SolrCore 'collection1' using configuration from instancedir /home/jenkins/workspace/Lucene-Solr-master-Linux/solr/core/src/test-files/solr/collection1, trusted=true
   [junit4]   2> 2007962 INFO  (coreLoadExecutor-8918-thread-1) [    ] o.a.s.m.r.SolrJmxReporter JMX monitoring for 'solr.core.collection1' (registry 'solr.core.collection1') enabled at server: com.sun.jmx.mbeanserver.JmxMBeanServer@421464d4
   [junit4]   2> 2007963 INFO  (coreLoadExecutor-8918-thread-1) [    ] o.a.s.c.SolrCore solr.RecoveryStrategy.Builder
   [junit4]   2> 2007963 INFO  (coreLoadExecutor-8918-thread-1) [    ] o.a.s.c.SolrCore [[collection1] ] Opening new SolrCore at [/home/jenkins/workspace/Lucene-Solr-master-Linux/solr/core/src/test-files/solr/collection1], dataDir=[/home/jenkins/workspace/Lucene-Solr-master-Linux/solr/build/solr-core/test/J1/temp/solr.update.processor.AtomicUpdateProcessorFactoryTest_4C84BF0BB100789D-001/init-core-data-001/]
   [junit4]   2> 2007963 INFO  (coreLoadExecutor-8918-thread-1) [    ] o.a.s.u.RandomMergePolicy RandomMergePolicy wrapping class org.apache.lucene.index.TieredMergePolicy: [TieredMergePolicy: maxMergeAtOnce=48, maxMergeAtOnceExplicit=29, maxMergedSegmentMB=5.4013671875, floorSegmentMB=0.6142578125, forceMergeDeletesPctAllowed=17.65561888550195, segmentsPerTier=38.0, maxCFSSegmentSizeMB=8.796093022207999E12, noCFSRatio=1.0
   [junit4]   2> 2008064 INFO  (coreLoadExecutor-8918-thread-1) [    ] o.a.s.u.UpdateHandler Using UpdateLog implementation: org.apache.solr.update.UpdateLog
   [junit4]   2> 2008064 INFO  (coreLoadExecutor-8918-thread-1) [    ] o.a.s.u.UpdateLog Initializing UpdateLog: dataDir= defaultSyncLevel=FLUSH numRecordsToKeep=100 maxNumLogsToKeep=10 numVersionBuckets=65536
   [junit4]   2> 2008071 INFO  (coreLoadExecutor-8918-thread-1) [    ] o.a.s.u.CommitTracker Hard AutoCommit: disabled
   [junit4]   2> 2008071 INFO  (coreLoadExecutor-8918-thread-1) [    ] o.a.s.u.CommitTracker Soft AutoCommit: disabled
   [junit4]   2> 2008072 INFO  (coreLoadExecutor-8918-thread-1) [    ] o.a.s.u.RandomMergePolicy RandomMergePolicy wrapping class org.apache.lucene.index.TieredMergePolicy: [TieredMergePolicy: maxMergeAtOnce=48, maxMergeAtOnceExplicit=31, maxMergedSegmentMB=77.6650390625, floorSegmentMB=1.826171875, forceMergeDeletesPctAllowed=11.35378777386126, segmentsPerTier=10.0, maxCFSSegmentSizeMB=8.796093022207999E12, noCFSRatio=0.33004404873376025
   [junit4]   2> 2008072 INFO  (coreLoadExecutor-8918-thread-1) [    ] o.a.s.s.SolrIndexSearcher Opening [Searcher@1c25abb7[collection1] main]
   [junit4]   2> 2008073 INFO  (coreLoadExecutor-8918-thread-1) [    ] o.a.s.h.c.SpellCheckComponent Initializing spell checkers
   [junit4]   2> 2008091 INFO  (coreLoadExecutor-8918-thread-1) [    ] o.a.s.s.DirectSolrSpellChecker init: {name=direct,classname=DirectSolrSpellChecker,field=lowerfilt,minQueryLength=3}
   [junit4]   2> 2008187 INFO  (coreLoadExecutor-8918-thread-1) [    ] o.a.s.h.ReplicationHandler Commits will be reserved for  10000
   [junit4]   2> 2008187 INFO  (searcherExecutor-8919-thread-1) [    ] o.a.s.h.c.SpellCheckComponent Loading spell index for spellchecker: default
   [junit4]   2> 2008187 INFO  (coreLoadExecutor-8918-thread-1) [    ] o.a.s.u.UpdateLog Could not find max version in index or recent updates, using new clock 1574082610414485504
   [junit4]   2> 2008188 INFO  (searcherExecutor-8919-thread-1) [    ] o.a.s.h.c.SpellCheckComponent Loading spell index for spellchecker: direct
   [junit4]   2> 2008188 INFO  (searcherExecutor-8919-thread-1) [    ] o.a.s.h.c.SpellCheckComponent Loading spell index for spellchecker: wordbreak
   [junit4]   2> 2008188 INFO  (searcherExecutor-8919-thread-1) [    ] o.a.s.h.c.SpellCheckComponent Loading spell index for spellchecker: multipleFields
   [junit4]   2> 2008188 INFO  (searcherExecutor-8919-thread-1) [    ] o.a.s.h.c.SpellCheckComponent Loading spell index for spellchecker: jarowinkler
   [junit4]   2> 2008188 INFO  (searcherExecutor-8919-thread-1) [    ] o.a.s.h.c.SpellCheckComponent Loading spell index for spellchecker: external
   [junit4]   2> 2008188 INFO  (searcherExecutor-8919-thread-1) [    ] o.a.s.h.c.SpellCheckComponent Loading spell index for spellchecker: freq
   [junit4]   2> 2008188 INFO  (searcherExecutor-8919-thread-1) [    ] o.a.s.h.c.SpellCheckComponent Loading spell index for spellchecker: fqcn
   [junit4]   2> 2008189 INFO  (searcherExecutor-8919-thread-1) [    ] o.a.s.h.c.SpellCheckComponent Loading spell index for spellchecker: perDict
   [junit4]   2> 2008189 INFO  (searcherExecutor-8919-thread-1) [    ] o.a.s.c.SolrCore [collection1] Registered new searcher Searcher@1c25abb7[collection1] main{ExitableDirectoryReader(UninvertingDirectoryReader())}
   [junit4]   2> 2008189 INFO  (SUITE-AtomicUpdateProcessorFactoryTest-seed#[4C84BF0BB100789D]-worker) [    ] o.a.s.SolrTestCaseJ4 ####initCore end
   [junit4]   2> 2008191 INFO  (TEST-AtomicUpdateProcessorFactoryTest.testMultipleThreads-seed#[4C84BF0BB100789D]) [    ] o.a.s.SolrTestCaseJ4 ###Starting testMultipleThreads
   [junit4]   2> 2008191 INFO  (TEST-AtomicUpdateProcessorFactoryTest.testMultipleThreads-seed#[4C84BF0BB100789D]) [    ] o.a.s.u.DirectUpdateHandler2 [collection1] REMOVING ALL DOCUMENTS FROM INDEX
   [junit4]   2> 2008191 INFO  (TEST-AtomicUpdateProcessorFactoryTest.testMultipleThreads-seed#[4C84BF0BB100789D]) [    ] o.a.s.s.SolrIndexSearcher Opening [Searcher@48dfe77a[collection1] realtime]
   [junit4]   2> 2008192 INFO  (TEST-AtomicUpdateProcessorFactoryTest.testMultipleThreads-seed#[4C84BF0BB100789D]) [    ] o.a.s.u.p.LogUpdateProcessorFactory [collection1]  webapp=null path=null params={_version_=-9223372036854775807&update.distrib=FROMLEADER&versions=true&wt=json&indent=true}{deleteByQuery=*:* (-9223372036854775807)} 0 0
   [junit4]   2> 2008201 WARN  (Thread-9425) [    ] o.a.s.u.p.AtomicUpdateProcessorFactory Atomic update failed due to version conflict for 10 expected=1574082610424971265 actual=1574082610429165569Retrying with new version .... (1)
   [junit4]   2> 2008201 WARN  (Thread-9424) [    ] o.a.s.u.p.AtomicUpdateProcessorFactory Atomic update failed due to version conflict for 10 expected=1574082610424971264 actual=1574082610429165569Retrying with new version .... (1)
   [junit4]   2> 2008201 WARN  (Thread-9423) [    ] o.a.s.u.p.AtomicUpdateProcessorFactory Atomic update failed due to version conflict for 10 expected=1574082610424971264 actual=1574082610429165569Retrying with new version .... (1)
   [junit4]   2> 2008206 INFO  (TEST-AtomicUpdateProcessorFactoryTest.testMultipleThreads-seed#[4C84BF0BB100789D]) [    ] o.a.s.u.DirectUpdateHandler2 start commit{_version_=1574082610434408448,optimize=false,openSearcher=true,waitSearcher=true,expungeDeletes=false,softCommit=false,prepareCommit=false}
   [junit4]   2> 2008206 INFO  (TEST-AtomicUpdateProcessorFactoryTest.testMultipleThreads-seed#[4C84BF0BB100789D]) [    ] o.a.s.u.SolrIndexWriter Calling setCommitData with IW:org.apache.solr.update.SolrIndexWriter@5e09a893 commitCommandVersion:1574082610434408448
   [junit4]   2> 2008209 INFO  (TEST-AtomicUpdateProcessorFactoryTest.testMultipleThreads-seed#[4C84BF0BB100789D]) [    ] o.a.s.s.SolrIndexSearcher Opening [Searcher@539ece9c[collection1] main]
   [junit4]   2> 2008209 INFO  (TEST-AtomicUpdateProcessorFactoryTest.testMultipleThreads-seed#[4C84BF0BB100789D]) [    ] o.a.s.u.DirectUpdateHandler2 end_commit_flush
   [junit4]   2> 2008210 INFO  (searcherExecutor-8919-thread-1) [    ] o.a.s.c.SolrCore [collection1] Registered new searcher Searcher@539ece9c[collection1] main{ExitableDirectoryReader(UninvertingDirectoryReader(Uninverting(_0(8.0.0):c10/9:delGen=1)))}
   [junit4]   2> 2008210 INFO  (TEST-AtomicUpdateProcessorFactoryTest.testMultipleThreads-seed#[4C84BF0BB100789D]) [    ] o.a.s.u.p.LogUpdateProcessorFactory [collection1]  webapp=null path=null params={}{commit=} 0 4
   [junit4]   2> 2008212 INFO  (TEST-AtomicUpdateProcessorFactoryTest.testMultipleThreads-seed#[4C84BF0BB100789D]) [    ] o.a.s.c.S.Request [collection1]  webapp=null path=null params={q=id:10&wt=xml} hits=1 status=0 QTime=0
   [junit4]   2> 2008213 INFO  (TEST-AtomicUpdateProcessorFactoryTest.testMultipleThreads-seed#[4C84BF0BB100789D]) [    ] o.a.s.c.S.Request [collection1]  webapp=null path=null params={q=cat:p5cva73f0iey2pzbd6dq+nstm14ps7cz8sw6xtjkd+62ax5rof62pin2j9ei1c+1f2mb4z7zrh4ezgfscnw+klp9uv8o6hiqds1ad304&wt=xml} hits=1 status=0 QTime=0
   [junit4]   2> 2008214 INFO  (TEST-AtomicUpdateProcessorFactoryTest.testMultipleThreads-seed#[4C84BF0BB100789D]) [    ] o.a.s.c.S.Request [collection1]  webapp=null path=null params={q=int_i:25&wt=xml} hits=0 status=0 QTime=0
   [junit4]   2> 2008214 ERROR (TEST-AtomicUpdateProcessorFactoryTest.testMultipleThreads-seed#[4C84BF0BB100789D]) [    ] o.a.s.SolrTestCaseJ4 REQUEST FAILED: xpath=//result[@numFound=1]
   [junit4]   2> 	xml response was: <?xml version="1.0" encoding="UTF-8"?>
   [junit4]   2> <response>
   [junit4]   2> <lst name="responseHeader"><int name="status">0</int><int name="QTime">0</int></lst><result name="response" numFound="0" start="0"></result>
   [junit4]   2> </response>
   [junit4]   2> 
   [junit4]   2> 	request was:q=int_i:25&wt=xml
   [junit4]   2> 2008215 ERROR (TEST-AtomicUpdateProcessorFactoryTest.testMultipleThreads-seed#[4C84BF0BB100789D]) [    ] o.a.s.SolrTestCaseJ4 REQUEST FAILED: q=int_i:25&wt=xml:java.lang.RuntimeException: REQUEST FAILED: xpath=//result[@numFound=1]
   [junit4]   2> 	xml response was: <?xml version="1.0" encoding="UTF-8"?>
   [junit4]   2> <response>
   [junit4]   2> <lst name="responseHeader"><int name="status">0</int><int name="QTime">0</int></lst><result name="response" numFound="0" start="0"></result>
   [junit4]   2> </response>
   [junit4]   2> 
   [junit4]   2> 	request was:q=int_i:25&wt=xml
   [junit4]   2> 	at org.apache.solr.SolrTestCaseJ4.assertQ(SolrTestCaseJ4.java:879)
   [junit4]   2> 	at org.apache.solr.update.processor.AtomicUpdateProcessorFactoryTest.testMultipleThreads(AtomicUpdateProcessorFactoryTest.java:264)
   [junit4]   2> 	at java.base/jdk.internal.reflect.NativeMethodAccessorImpl.invoke0(Native Method)
   [junit4]   2> 	at java.base/jdk.internal.reflect.NativeMethodAccessorImpl.invoke(NativeMethodAccessorImpl.java:62)
   [junit4]   2> 	at java.base/jdk.internal.reflect.DelegatingMethodAccessorImpl.invoke(DelegatingMethodAccessorImpl.java:43)
   [junit4]   2> 	at java.base/java.lang.reflect.Method.invoke(Method.java:564)
   [junit4]   2> 	at com.carrotsearch.randomizedtesting.RandomizedRunner.invoke(RandomizedRunner.java:1713)
   [junit4]   2> 	at com.carrotsearch.randomizedtesting.RandomizedRunner$8.evaluate(RandomizedRunner.java:907)
   [junit4]   2> 	at com.carrotsearch.randomizedtesting.RandomizedRunner$9.evaluate(RandomizedRunner.java:943)
   [junit4]   2> 	at com.carrotsearch.randomizedtesting.RandomizedRunner$10.evaluate(RandomizedRunner.java:957)
   [junit4]   2> 	at com.carrotsearch.randomizedtesting.rules.SystemPropertiesRestoreRule$1.evaluate(SystemPropertiesRestoreRule.java:57)
   [junit4]   2> 	at org.apache.lucene.util.TestRuleSetupTeardownChained$1.evaluate(TestRuleSetupTeardownChained.java:49)
   [junit4]   2> 	at org.apache.lucene.util.AbstractBeforeAfterRule$1.evaluate(AbstractBeforeAfterRule.java:45)
   [junit4]   2> 	at org.apache.lucene.util.TestRuleThreadAndTestName$1.evaluate(TestRuleThreadAndTestName.java:48)
   [junit4]   2> 	at org.apache.lucene.util.TestRuleIgnoreAfterMaxFailures$1.evaluate(TestRuleIgnoreAfterMaxFailures.java:64)
   [junit4]   2> 	at org.apache.lucene.util.TestRuleMarkFailure$1.evaluate(TestRuleMarkFailure.java:47)
   [junit4]   2> 	at com.carrotsearch.randomizedtesting.rules.StatementAdapter.evaluate(StatementAdapter.java:36)
   [junit4]   2> 	at com.carrotsearch.randomizedtesting.ThreadLeakControl$StatementRunner.run(ThreadLeakControl.java:368)
   [junit4]   2> 	at com.carrotsearch.randomizedtesting.ThreadLeakControl.forkTimeoutingTask(ThreadLeakControl.java:817)
   [junit4]   2> 	at com.carrotsearch.randomizedtesting.ThreadLeakControl$3.evaluate(ThreadLeakControl.java:468)
   [junit4]   2> 	at com.carrotsearch.randomizedtesting.RandomizedRunner.runSingleTest(RandomizedRunner.java:916)
   [junit4]   2> 	at com.carrotsearch.randomizedtesting.RandomizedRunner$5.evaluate(RandomizedRunner.java:802)
   [junit4]   2> 	at com.carrotsearch.randomizedtesting.RandomizedRunner$6.evaluate(RandomizedRunner.java:852)
   [junit4]   2> 	at com.carrotsearch.randomizedtesting.RandomizedRunner$7.evaluate(RandomizedRunner.java:863)
   [junit4]   2> 	at com.carrotsearch.randomizedtesting.rules.StatementAdapter.evaluate(StatementAdapter.java:36)
   [junit4]   2> 	at com.carrotsearch.randomizedtesting.rules.SystemPropertiesRestoreRule$1.evaluate(SystemPropertiesRestoreRule.java:57)
   [junit4]   2> 	at org.apache.lucene.util.AbstractBeforeAfterRule$1.evaluate(AbstractBeforeAfterRule.java:45)
   [junit4]   2> 	at com.carrotsearch.randomizedtesting.rules.StatementAdapter.evaluate(StatementAdapter.java:36)
   [junit4]   2> 	at org.apache.lucene.util.TestRuleStoreClassName$1.evaluate(TestRuleStoreClassName.java:41)
   [junit4]   2> 	at com.carrotsearch.randomizedtesting.rules.NoShadowingOrOverridesOnMethodsRule$1.evaluate(NoShadowingOrOverridesOnMethodsRule.java:40)
   [junit4]   2> 	at com.carrotsearch.randomizedtesting.rules.NoShadowingOrOverridesOnMethodsRule$1.evaluate(NoShadowingOrOverridesOnMethodsRule.java:40)
   [junit4]   2> 	at com.carrotsearch.randomizedtesting.rules.StatementAdapter.evaluate(StatementAdapter.java:36)
   [junit4]   2> 	at com.carrotsearch.randomizedtesting.rules.StatementAdapter.evaluate(StatementAdapter.java:36)
   [junit4]   2> 	at org.apache.lucene.util.TestRuleAssertionsRequired$1.evaluate(TestRuleAssertionsRequired.java:53)
   [junit4]   2> 	at org.apache.lucene.util.TestRuleMarkFailure$1.evaluate(TestRuleMarkFailure.java:47)
   [junit4]   2> 	at org.apache.lucene.util.TestRuleIgnoreAfterMaxFailures$1.evaluate(TestRuleIgnoreAfterMaxFailures.java:64)
   [junit4]   2> 	at org.apache.lucene.util.TestRuleIgnoreTestSuites$1.evaluate(TestRuleIgnoreTestSuites.java:54)
   [junit4]   2> 	at com.carrotsearch.randomizedtesting.rules.StatementAdapter.evaluate(StatementAdapter.java:36)
   [junit4]   2> 	at com.carrotsearch.randomizedtesting.ThreadLeakControl$StatementRunner.run(ThreadLeakControl.java:368)
   [junit4]   2> 	at java.base/java.lang.Thread.run(Thread.java:844)
   [junit4]   2> 
   [junit4]   2> 2008215 INFO  (TEST-AtomicUpdateProcessorFactoryTest.testMultipleThreads-seed#[4C84BF0BB100789D]) [    ] o.a.s.SolrTestCaseJ4 ###Ending testMultipleThreads
   [junit4]   2> NOTE: reproduce with: ant test  -Dtestcase=AtomicUpdateProcessorFactoryTest -Dtests.method=testMultipleThreads -Dtests.seed=4C84BF0BB100789D -Dtests.multiplier=3 -Dtests.slow=true -Dtests.locale=om-KE -Dtests.timezone=Asia/Brunei -Dtests.asserts=true -Dtests.file.encoding=US-ASCII
   [junit4] ERROR   0.03s J1 | AtomicUpdateProcessorFactoryTest.testMultipleThreads <<<
   [junit4]    > Throwable #1: java.lang.RuntimeException: Exception during query
   [junit4]    > 	at __randomizedtesting.SeedInfo.seed([4C84BF0BB100789D:60B6C8863DC40E19]:0)
   [junit4]    > 	at org.apache.solr.SolrTestCaseJ4.assertQ(SolrTestCaseJ4.java:886)
   [junit4]    > 	at org.apache.solr.update.processor.AtomicUpdateProcessorFactoryTest.testMultipleThreads(AtomicUpdateProcessorFactoryTest.java:264)
   [junit4]    > 	at java.base/jdk.internal.reflect.NativeMethodAccessorImpl.invoke0(Native Method)
   [junit4]    > 	at java.base/jdk.internal.reflect.NativeMethodAccessorImpl.invoke(NativeMethodAccessorImpl.java:62)
   [junit4]    > 	at java.base/jdk.internal.reflect.DelegatingMethodAccessorImpl.invoke(DelegatingMethodAccessorImpl.java:43)
   [junit4]    > 	at java.base/java.lang.reflect.Method.invoke(Method.java:564)
   [junit4]    > 	at java.base/java.lang.Thread.run(Thread.java:844)
   [junit4]    > Caused by: java.lang.RuntimeException: REQUEST FAILED: xpath=//result[@numFound=1]
   [junit4]    > 	xml response was: <?xml version="1.0" encoding="UTF-8"?>
   [junit4]    > <response>
   [junit4]    > <lst name="responseHeader"><int name="status">0</int><int name="QTime">0</int></lst><result name="response" numFound="0" start="0"></result>
   [junit4]    > </response>
   [junit4]    > 	request was:q=int_i:25&wt=xml
   [junit4]    > 	at org.apache.solr.SolrTestCaseJ4.assertQ(SolrTestCaseJ4.java:879)
   [junit4]    > 	... 39 more
   [junit4]   2> 2008218 INFO  (TEST-AtomicUpdateProcessorFactoryTest.testBasics-seed#[4C84BF0BB100789D]) [    ] o.a.s.SolrTestCaseJ4 ###Starting testBasics
   [junit4]   2> 2008219 INFO  (TEST-AtomicUpdateProcessorFactoryTest.testBasics-seed#[4C84BF0BB100789D]) [    ] o.a.s.u.DirectUpdateHandler2 start commit{_version_=1574082610448039936,optimize=false,openSearcher=true,waitSearcher=true,expungeDeletes=false,softCommit=false,prepareCommit=false}
   [junit4]   2> 2008219 INFO  (TEST-AtomicUpdateProcessorFactoryTest.testBasics-seed#[4C84BF0BB100789D]) [    ] o.a.s.u.SolrIndexWriter Calling setCommitData with IW:org.apache.solr.update.SolrIndexWriter@5e09a893 commitCommandVersion:1574082610448039936
   [junit4]   2> 2008221 INFO  (TEST-AtomicUpdateProcessorFactoryTest.testBasics-seed#[4C84BF0BB100789D]) [    ] o.a.s.s.SolrIndexSearcher Opening [Searcher@5a06feec[collection1] main]
   [junit4]   2> 2008222 INFO  (TEST-AtomicUpdateProcessorFactoryTest.testBasics-seed#[4C84BF0BB100789D]) [    ] o.a.s.u.DirectUpdateHandler2 end_commit_flush
   [junit4]   2> 2008223 INFO  (searcherExecutor-8919-thread-1) [    ] o.a.s.c.SolrCore [collection1] Registered new searcher Searcher@5a06feec[collection1] main{ExitableDirectoryReader(UninvertingDirectoryReader(Uninverting(_0(8.0.0):c10/9:delGen=1) Uninverting(_1(8.0.0):c1)))}
   [junit4]   2> 2008223 INFO  (TEST-AtomicUpdateProcessorFactoryTest.testBasics-seed#[4C84BF0BB100789D]) [    ] o.a.s.u.p.LogUpdateProcessorFactory [collection1]  webapp=null path=null params={}{commit=} 0 3
   [junit4]   2> 2008224 INFO  (TEST-AtomicUpdateProcessorFactoryTest.testBasics-seed#[4C84BF0BB100789D]) [    ] o.a.s.c.S.Request [collection1]  webapp=null path=null params={q=id:1&wt=xml} hits=1 status=0 QTime=0
   [junit4]   2> 2008224 INFO  (TEST-AtomicUpdateProcessorFactoryTest.testBasics-seed#[4C84BF0BB100789D]) [    ] o.a.s.c.S.Request [collection1]  webapp=null path=null params={q=cat:human&wt=xml} hits=1 status=0 QTime=0
   [junit4]   2> 2008225 INFO  (TEST-AtomicUpdateProcessorFactoryTest.testBasics-seed#[4C84BF0BB100789D]) [    ] o.a.s.c.S.Request [collection1]  webapp=null path=null params={q=title:Mr&wt=xml} hits=1 status=0 QTime=0
   [junit4]   2> 2008225 INFO  (TEST-AtomicUpdateProcessorFactoryTest.testBasics-seed#[4C84BF0BB100789D]) [    ] o.a.s.c.S.Request [collection1]  webapp=null path=null params={q=count_i:20&wt=xml} hits=1 status=0 QTime=0
   [junit4]   2> 2008225 INFO  (TEST-AtomicUpdateProcessorFactoryTest.testBasics-seed#[4C84BF0BB100789D]) [    ] o.a.s.c.S.Request [collection1]  webapp=null path=null params={q=name_s:Virat&wt=xml} hits=1 status=0 QTime=0
   [junit4]   2> 2008226 INFO  (TEST-AtomicUpdateProcessorFactoryTest.testBasics-seed#[4C84BF0BB100789D]) [    ] o.a.s.c.S.Request [collection1]  webapp=null path=null params={q=multiDefault:Delhi&wt=xml} hits=1 status=0 QTime=0
   [junit4]   2> 2008227 INFO  (TEST-AtomicUpdateProcessorFactoryTest.testBasics-seed#[4C84BF0BB100789D]) [    ] o.a.s.u.DirectUpdateHandler2 start commit{_version_=1574082610456428544,optimize=false,openSearcher=true,waitSearcher=true,expungeDeletes=false,softCommit=false,prepareCommit=false}
   [junit4]   2> 2008227 INFO  (TEST-AtomicUpdateProcessorFactoryTest.testBasics-seed#[4C84BF0BB100789D]) [    ] o.a.s.u.SolrIndexWriter Calling setCommitData with IW:org.apache.solr.update.SolrIndexWriter@5e09a893 commitCommandVersion:1574082610456428544
   [junit4]   2> 2008229 INFO  (TEST-AtomicUpdateProcessorFactoryTest.testBasics-seed#[4C84BF0BB100789D]) [    ] o.a.s.s.SolrIndexSearcher Opening [Searcher@a241d81[collection1] main]
   [junit4]   2> 2008229 INFO  (TEST-AtomicUpdateProcessorFactoryTest.testBasics-seed#[4C84BF0BB100789D]) [    ] o.a.s.u.DirectUpdateHandler2 end_commit_flush
   [junit4]   2> 2008230 INFO  (searcherExecutor-8919-thread-1) [    ] o.a.s.c.SolrCore [collection1] Registered new searcher Searcher@a241d81[collection1] main{ExitableDirectoryReader(UninvertingDirectoryReader(Uninverting(_0(8.0.0):c10/9:delGen=1) Uninverting(_2(8.0.0):c1)))}
   [junit4]   2> 2008230 INFO  (TEST-AtomicUpdateProcessorFactoryTest.testBasics-seed#[4C84BF0BB100789D]) [    ] o.a.s.u.p.LogUpdateProcessorFactory [collection1]  webapp=null path=null params={}{commit=} 0 2
   [junit4]   2> 2008230 INFO  (TEST-AtomicUpdateProcessorFactoryTest.testBasics-seed#[4C84BF0BB100789D]) [    ] o.a.s.c.S.Request [collection1]  webapp=null path=null params={q=id:1&wt=xml} hits=1 status=0 QTime=0
   [junit4]   2> 2008230 INFO  (TEST-AtomicUpdateProcessorFactoryTest.testBasics-seed#[4C84BF0BB100789D]) [    ] o.a.s.c.S.Request [collection1]  webapp=null path=null params={q=cat:human&wt=xml} hits=1 status=0 QTime=0
   [junit4]   2> 2008231 INFO  (TEST-AtomicUpdateProcessorFactoryTest.testBasics-seed#[4C84BF0BB100789D]) [    ] o.a.s.c.S.Request [collection1]  webapp=null path=null params={q=cat:animal&wt=xml} hits=1 status=0 QTime=0
   [junit4]   2> 2008231 INFO  (TEST-AtomicUpdateProcessorFactoryTest.testBasics-seed#[4C84BF0BB100789D]) [    ] o.a.s.c.S.Request [collection1]  webapp=null path=null params={q=title:Mr&wt=xml} hits=0 status=0 QTime=0
   [junit4]   2> 2008231 INFO  (TEST-AtomicUpdateProcessorFactoryTest.testBasics-seed#[4C84BF0BB100789D]) [    ] o.a.s.c.S.Request [collection1]  webapp=null path=null params={q=title:Dr&wt=xml} hits=1 status=0 QTime=0
   [junit4]   2> 2008231 INFO  (TEST-AtomicUpdateProcessorFactoryTest.testBasics-seed#[4C84BF0BB100789D]) [    ] o.a.s.c.S.Request [collection1]  webapp=null path=null params={q=count_i:20&wt=xml} hits=0 status=0 QTime=0
   [junit4]   2> 2008232 INFO  (TEST-AtomicUpdateProcessorFactoryTest.testBasics-seed#[4C84BF0BB100789D]) [    ] o.a.s.c.S.Request [collection1]  webapp=null path=null params={q=count_i:40&wt=xml} hits=1 status=0 QTime=0
   [junit4]   2> 2008232 INFO  (TEST-AtomicUpdateProcessorFactoryTest.testBasics-seed#[4C84BF0BB100789D]) [    ] o.a.s.c.S.Request [collection1]  webapp=null path=null params={q=name_s:Virat&wt=xml} hits=0 status=0 QTime=0
   [junit4]   2> 2008232 INFO  (TEST-AtomicUpdateProcessorFactoryTest.testBasics-seed#[4C84BF0BB100789D]) [    ] o.a.s.c.S.Request [collection1]  webapp=null path=null params={q=multiDefault:Delhi&wt=xml} hits=0 status=0 QTime=0
   [junit4]   2> 2008232 INFO  (TEST-AtomicUpdateProcessorFactoryTest.testBasics-seed#[4C84BF0BB100789D]) [    ] o.a.s.SolrTestCaseJ4 ###Ending testBasics
   [junit4]   2> 2008234 INFO  (TEST-AtomicUpdateProcessorFactoryTest.testNoUniqueIdPassed-seed#[4C84BF0BB100789D]) [    ] o.a.s.SolrTestCaseJ4 ###Starting testNoUniqueIdPassed
   [junit4]   2> 2008234 INFO  (TEST-AtomicUpdateProcessorFactoryTest.testNoUniqueIdPassed-seed#[4C84BF0BB100789D]) [    ] o.a.s.SolrTestCaseJ4 ###Ending testNoUniqueIdPassed
   [junit4]   2> 2008235 INFO  (TEST-AtomicUpdateProcessorFactoryTest.testWrongAtomicOpPassed-seed#[4C84BF0BB100789D]) [    ] o.a.s.SolrTestCaseJ4 ###Starting testWrongAtomicOpPassed
   [junit4]   2> 2008235 INFO  (TEST-AtomicUpdateProcessorFactoryTest.testWrongAtomicOpPassed-seed#[4C84BF0BB100789D]) [    ] o.a.s.SolrTestCaseJ4 ###Ending testWrongAtomicOpPassed
   [junit4]   2> 2008235 INFO  (SUITE-AtomicUpdateProcessorFactoryTest-seed#[4C84BF0BB100789D]-worker) [    ] o.a.s.SolrTestCaseJ4 ###deleteCore
   [junit4]   2> 2008235 INFO  (SUITE-AtomicUpdateProcessorFactoryTest-seed#[4C84BF0BB100789D]-worker) [    ] o.a.s.c.CoreContainer Shutting down CoreContainer instance=249557967
   [junit4]   2> 2008236 INFO  (SUITE-AtomicUpdateProcessorFactoryTest-seed#[4C84BF0BB100789D]-worker) [    ] o.a.s.m.SolrMetricManager Closing metric reporters for registry=solr.node, tag=null
   [junit4]   2> 2008236 INFO  (SUITE-AtomicUpdateProcessorFactoryTest-seed#[4C84BF0BB100789D]-worker) [    ] o.a.s.m.SolrMetricManager Closing metric reporters for registry=solr.jvm, tag=null
   [junit4]   2> 2008237 INFO  (SUITE-AtomicUpdateProcessorFactoryTest-seed#[4C84BF0BB100789D]-worker) [    ] o.a.s.m.SolrMetricManager Closing metric reporters for registry=solr.jetty, tag=null
   [junit4]   2> 2008237 INFO  (SUITE-AtomicUpdateProcessorFactoryTest-seed#[4C84BF0BB100789D]-worker) [    ] o.a.s.c.TransientSolrCoreCacheDefault Allocating transient cache for 2147483647 transient cores
   [junit4]   2> 2008238 INFO  (coreCloseExecutor-8924-thread-1) [    ] o.a.s.c.SolrCore [collection1]  CLOSING SolrCore org.apache.solr.core.SolrCore@4e2b4023
   [junit4]   2> 2008239 INFO  (coreCloseExecutor-8924-thread-1) [    ] o.a.s.m.SolrMetricManager Closing metric reporters for registry=solr.core.collection1, tag=1311457315
   [junit4]   2> NOTE: leaving temporary files on disk at: /home/jenkins/workspace/Lucene-Solr-master-Linux/solr/build/solr-core/test/J1/temp/solr.update.processor.AtomicUpdateProcessorFactoryTest_4C84BF0BB100789D-001
   [junit4]   2> NOTE: test params are: codec=Lucene70, sim=RandomSimilarity(queryNorm=false): {}, locale=om-KE, timezone=Asia/Brunei
   [junit4]   2> NOTE: Linux 4.10.0-27-generic amd64/Oracle Corporation 9 (64-bit)/cpus=8,threads=1,free=323634024,total=536870912
   [junit4]   2> NOTE: All tests run in this JVM: [TestFieldCacheVsDocValues, TestRecoveryHdfs, CdcrRequestHandlerTest, TestSubQueryTransformerCrossCore, TestSolrIndexConfig, TestCollationFieldDocValues, OverseerCollectionConfigSetProcessorTest, TestSolrQueryResponse, TestCoreAdminApis, OpenCloseCoreStressTest, TestManagedSchemaAPI, SystemInfoHandlerTest, SchemaVersionSpecificBehaviorTest, TestPullReplica, TestDynamicLoading, TestSolrJ, TestXIncludeConfig, TestStressCloudBlindAtomicUpdates, TestXmlQParserPlugin, TestRTGBase, IndexSchemaRuntimeFieldTest, LukeRequestHandlerTest, DirectSolrSpellCheckerTest, TestUpdate, TestInPlaceUpdatesDistrib, CheckHdfsIndexTest, HLLSerializationTest, TestApiFramework, SharedFSAutoReplicaFailoverTest, TestSchemaManager, StatelessScriptUpdateProcessorFactoryTest, TestStressVersions, TestStressUserVersions, AddBlockUpdateTest, TestSolrCloudWithDelegationTokens, TestSystemIdResolver, DistribDocExpirationUpdateProcessorTest, MoreLikeThisHandlerTest, HttpPartitionTest, TestClassicSimilarityFactory, InfoHandlerTest, ZkStateReaderTest, TestSegmentSorting, TestMinMaxOnMultiValuedField, RequestLoggingTest, LeaderFailureAfterFreshStartTest, CoreAdminCreateDiscoverTest, TestEmbeddedSolrServerSchemaAPI, SOLR749Test, TestHashPartitioner, TestRequestForwarding, TestBM25SimilarityFactory, TestSearchPerf, TestCustomSort, ResourceLoaderTest, TestMultiWordSynonyms, CloudExitableDirectoryReaderTest, DistributedFacetExistsSmallTest, TestFiltering, TestFieldCacheReopen, TestSchemaSimilarityResource, BlockDirectoryTest, FileBasedSpellCheckerTest, DocValuesMissingTest, SolrCmdDistributorTest, SuggesterTSTTest, TestAnalyzeInfixSuggestions, ConvertedLegacyTest, TestFreeTextSuggestions, TestCursorMarkWithoutUniqueKey, PKIAuthenticationIntegrationTest, RankQueryTest, SecurityConfHandlerTest, MetricUtilsTest, TestCoreContainer, MigrateRouteKeyTest, TestAuthenticationFramework, TestCoreDiscovery, TestUniqueKeyFieldResource, CSVRequestHandlerTest, TestIntervalFaceting, TestQueryTypes, CollectionsAPIDistributedZkTest, SliceStateTest, SoftAutoCommitTest, TestPartialUpdateDeduplication, TestRandomCollapseQParserPlugin, TestManagedResourceStorage, TermVectorComponentTest, DisMaxRequestHandlerTest, DistributedFacetPivotSmallAdvancedTest, TestDistribIDF, ReplicationFactorTest, TestAtomicUpdateErrorCases, SolrJmxReporterTest, TestDistribDocBasedVersion, ConcurrentDeleteAndCreateCollectionTest, TestPerFieldSimilarityWithDefaultOverride, MoveReplicaHDFSUlogDirTest, HdfsThreadLeakTest, HdfsWriteToMultipleCollectionsTest, TestFuzzyAnalyzedSuggestions, ShardRoutingCustomTest, TestCollapseQParserPlugin, AutoScalingHandlerTest, ClusterStateUpdateTest, HdfsDirectoryFactoryTest, TestPostingsSolrHighlighter, TestLegacyNumericUtils, ScriptEngineTest, NodeMutatorTest, BitVectorTest, IgnoreCommitOptimizeUpdateProcessorFactoryTest, ChangedSchemaMergeTest, TestHttpShardHandlerFactory, BasicFunctionalityTest, SuggestComponentTest, DeleteLastCustomShardedReplicaTest, TestPushWriter, LeaderElectionTest, ZkSolrClientTest, TestDistributedGrouping, TestFaceting, DistributedSpellCheckComponentTest, TermVectorComponentDistributedTest, TestStressReorder, DistributedTermsComponentTest, SimpleFacetsTest, TestSolr4Spatial, StatsComponentTest, SpellCheckComponentTest, BadIndexSchemaTest, TestFunctionQuery, TestLazyCores, TestIndexSearcher, HighlighterTest, DistributedQueryElevationComponentTest, SolrIndexSplitterTest, AnalysisAfterCoreReloadTest, CoreAdminHandlerTest, SolrRequestParserTest, TestFoldingMultitermQuery, DocValuesTest, TestTrie, SpatialFilterTest, SuggesterWFSTTest, TestCSVLoader, NoCacheHeaderTest, WordBreakSolrSpellCheckerTest, FieldMutatingUpdateProcessorTest, DefaultValueUpdateProcessorTest, TestRemoteStreaming, DocValuesMultiTest, DistanceFunctionTest, SolrInfoBeanTest, CacheHeaderTest, TestSurroundQueryParser, TestQueryUtils, TestWriterPerf, TestReversedWildcardFilterFactory, DocumentAnalysisRequestHandlerTest, PrimitiveFieldTypeTest, TermsComponentTest, RequestHandlersTest, DocumentBuilderTest, TestValueSourceCache, PathHierarchyTokenizerFactoryTest, TestSolrQueryParser, FastVectorHighlighterTest, LoggingHandlerTest, RegexBoostProcessorTest, IndexSchemaTest, TestCollationField, UpdateRequestProcessorFactoryTest, MBeansHandlerTest, QueryParsingTest, UniqFieldsUpdateProcessorFactoryTest, JsonLoaderTest, PingRequestHandlerTest, TestComponentsName, SearchHandlerTest, TestQuerySenderListener, UpdateParamsTest, AlternateDirectoryTest, TestQuerySenderNoQuery, SolrIndexConfigTest, BadComponentTest, TestStressRecovery, TestMergePolicyConfig, TestDocSet, TestElisionMultitermQuery, OutputWriterTest, DirectSolrConnectionTest, TestPhraseSuggestions, EchoParamsTest, TestPerFieldSimilarity, TestFastOutputStream, URLClassifyProcessorTest, PrimUtilsTest, DOMUtilTest, TestDocumentBuilder, FileUtilsTest, CursorPagingTest, SolrTestCaseJ4Test, TestCrossCoreJoin, TestDistributedMissingSort, TestSimpleTrackingShardHandler, ActionThrottleTest, AliasIntegrationTest, BaseCdcrDistributedZkTest, CdcrBootstrapTest, ChaosMonkeySafeLeaderWithPullReplicasTest, CollectionsAPIAsyncDistributedZkTest, DistribCursorPagingTest, LeaderElectionContextKeyTest, OutOfBoxZkACLAndCredentialsProvidersTest, OverriddenZkACLAndCredentialsProvidersTest, OverseerStatusTest, RecoveryAfterSoftCommitTest, SSLMigrationTest, SaslZkACLProviderTest, ShardSplitTest, VMParamsZkACLAndCredentialsProvidersTest, HdfsBasicDistributedZk2Test, HdfsBasicDistributedZkTest, HdfsChaosMonkeySafeLeaderTest, HdfsCollectionsAPIDistributedZkTest, HdfsRecoveryZkTest, TestClusterStateMutator, ZkStateWriterTest, RuleEngineTest, ConfigureRecoveryStrategyTest, CoreSorterTest, DirectoryFactoryTest, ExitableDirectoryReaderTest, QueryResultKeyTest, TestBackupRepositoryFactory, TestConfigOverlay, TestConfigSetProperties, TestConfigSets, TestInitParams, TestNRTOpen, TestReloadAndDeleteDocs, TestShardHandlerFactory, TestSimpleTextCodec, TestSolrConfigHandler, TestHdfsBackupRestoreCore, TestSystemCollAutoCreate, TestExpandComponent, JavabinLoaderTest, TestUnifiedSolrHighlighter, WrapperMergePolicyFactoryTest, TestLegacyFieldReuse, TestLegacyTerms, TestMultiValuedNumericRangeQuery, TestNumericTokenStream, MetricsConfigTest, SolrCoreMetricManagerTest, TestMacroExpander, TestMacros, JSONWriterTest, SmileWriterTest, TestBinaryResponseWriter, TestCustomDocTransformer, TestGeoJSONResponseWriter, TestJavabinTupleStreamParser, TestRawResponseWriter, TestRawTransformer, TestChildDocTransformer, TestSubQueryTransformer, TestBulkSchemaAPI, TestCopyFieldCollectionResource, TestFieldCollectionResource, TestFieldTypeResource, TestSerializedLuceneMatchVersion, TestManagedSynonymFilterFactory, PreAnalyzedFieldManagedSchemaCloudTest, TestManagedSchemaThreadSafety, TestPointFields, TestUseDocValuesAsStored2, AnalyticsQueryTest, CursorMarkTest, LargeFieldTest, TestComplexPhraseLeadingWildcard, TestGraphTermsQParserPlugin, TestLegacyNumericRangeQueryBuilder, TestMaxScoreQueryParser, TestMissingGroups, TestOverriddenPrefixQueryForCustomFieldType, TestPayloadCheckQParserPlugin, TestPayloadScoreQParserPlugin, TestReloadDeadlock, TestSearcherReuse, TestSimpleQParserPlugin, TestSolrCoreParser, TestXmlQParser, TestJsonFacetRefinement, BJQParserTest, BlockJoinFacetDistribTest, TestNestedDocsSort, TestJsonRequest, TestDFISimilarityFactory, TestLRUStatsCache, TestPKIAuthenticationPlugin, TestRuleBasedAuthorizationPlugin, TestImpersonationWithHadoopAuth, TestSolrCloudWithHadoopAuthPlugin, ResponseHeaderTest, TestFileDictionaryLookup, BlockCacheTest, TestFieldCacheSort, TestFieldCacheSortRandom, TestFieldCacheWithThreads, TestNumericTerms32, TestNumericTerms64, VersionInfoTest, AddSchemaFieldsUpdateProcessorFactoryTest, AtomicUpdateProcessorFactoryTest]
   [junit4] Completed [707/726 (1!)] on J1 in 0.50s, 4 tests, 1 error <<< FAILURES!

[...truncated 36510 lines...]