You are viewing a plain text version of this content. The canonical link for it is here.
Posted to commits@myfaces.apache.org by "Continuum@myfaces.zones.apache.org" <mr...@myfaces.zones.apache.org> on 2006/09/20 19:02:48 UTC
[continuum] BUILD FAILURE: Impl
Online report : http://myfaces.zones.apache.org:8080/continuum/servlet/continuum/target/ProjectBuild.vm/view/ProjectBuild/id/9/buildId/4218
Build statistics:
State: Failed
Previous State: Ok
Started at: Wed, 20 Sep 2006 17:02:19 +0000
Finished at: Wed, 20 Sep 2006 17:02:47 +0000
Total time: 28s
Build Trigger: Forced
Exit code: 1
Building machine hostname: myfaces.zones.apache.org
Operating system : SunOS(unknown)
Java version : 1.5.0_07(Sun Microsystems Inc.)
Changes
tomsp MYFACES-1405 reopened and fixed
/myfaces/core/trunk/impl/src/main/java/org/apache/myfaces/application/jsp/JspStateManagerImpl.java
/myfaces/core/trunk/impl/src/main/java/org/apache/myfaces/renderkit/html/HtmlResponseStateManager.java
/myfaces/shared/trunk/core/src/main/java/org/apache/myfaces/shared/renderkit/RendererUtils.java
/myfaces/shared/trunk/core/src/main/java/org/apache/myfaces/shared/renderkit/ViewSequenceUtils.java
/myfaces/shared/trunk/core/src/main/java/org/apache/myfaces/shared/renderkit/html/HtmlLinkRendererBase.java
/myfaces/tomahawk/trunk/core/src/main/java/org/apache/myfaces/renderkit/html/util/DummyFormUtils.java
****************************************************************************
Output:
****************************************************************************
[INFO] Scanning for projects...
[INFO] Searching repository for plugin with prefix: 'source'.
[INFO] ----------------------------------------------------------------------------
[INFO] Building Impl
[INFO] task-segment: [clean, install, source:jar, deploy, site-deploy]
[INFO] ----------------------------------------------------------------------------
[INFO] [clean:clean]
[INFO] Deleting directory /local/continuum-1.0.3-SNAPSHOT/apps/continuum/working-directory/9/target
[INFO] Deleting directory /local/continuum-1.0.3-SNAPSHOT/apps/continuum/working-directory/9/target/classes
[INFO] Deleting directory /local/continuum-1.0.3-SNAPSHOT/apps/continuum/working-directory/9/target/test-classes
[INFO] [dependency:unpack {execution: unpack-shared-impl-sources}]
[INFO] Configured Artifact: org.apache.myfaces.shared:myfaces-shared-impl:sources:2.0.4-SNAPSHOT:jar
[INFO] Expanding: /export/home/mrmaven/.m2/repository/org/apache/myfaces/shared/myfaces-shared-impl/2.0.4-SNAPSHOT/myfaces-shared-impl-2.0.4-SNAPSHOT-sources.jar into /local/continuum-1.0.3-SNAPSHOT/apps/continuum/working-directory/9/target/shared_sources
[INFO] [xslt:transform {execution: default}]
[INFO] # of XML files: 2
[INFO] transform, srcFile: /local/continuum-1.0.3-SNAPSHOT/apps/continuum/working-directory/9/src/main/tld/myfaces_core.tld, destFile: /local/continuum-1.0.3-SNAPSHOT/apps/continuum/working-directory/9/target/classes/META-INF/myfaces_core.tld
[INFO] transform, srcFile: /local/continuum-1.0.3-SNAPSHOT/apps/continuum/working-directory/9/src/main/tld/myfaces_html.tld, destFile: /local/continuum-1.0.3-SNAPSHOT/apps/continuum/working-directory/9/target/classes/META-INF/myfaces_html.tld
[INFO] [xslt:transform {execution: generate-tld-for-jar}]
[INFO] # of XML files: 2
[INFO] file up-to-date: /local/continuum-1.0.3-SNAPSHOT/apps/continuum/working-directory/9/target/classes/META-INF/myfaces_core.tld
[INFO] file up-to-date: /local/continuum-1.0.3-SNAPSHOT/apps/continuum/working-directory/9/target/classes/META-INF/myfaces_html.tld
[INFO] [xslt:transform {execution: generate-tld-for-tlddoc}]
[INFO] # of XML files: 2
[INFO] transform, srcFile: /local/continuum-1.0.3-SNAPSHOT/apps/continuum/working-directory/9/src/main/tld/myfaces_core.tld, destFile: /local/continuum-1.0.3-SNAPSHOT/apps/continuum/working-directory/9/target/tlddoc-site/myfaces_core.tld
[INFO] transform, srcFile: /local/continuum-1.0.3-SNAPSHOT/apps/continuum/working-directory/9/src/main/tld/myfaces_html.tld, destFile: /local/continuum-1.0.3-SNAPSHOT/apps/continuum/working-directory/9/target/tlddoc-site/myfaces_html.tld
[INFO] [build-helper:add-source {execution: add-source}]
[INFO] Source directory: /local/continuum-1.0.3-SNAPSHOT/apps/continuum/working-directory/9/target/shared_sources added.
[INFO] [resources:resources]
[INFO] Using default encoding to copy filtered resources.
[INFO] [compiler:compile]
Compiling 244 source files to /local/continuum-1.0.3-SNAPSHOT/apps/continuum/working-directory/9/target/classes
[INFO] ------------------------------------------------------------------------
[ERROR] BUILD FAILURE
[INFO] ------------------------------------------------------------------------
[INFO] Compilation failure
/local/continuum-1.0.3-SNAPSHOT/apps/continuum/working-directory/9/src/main/java/org/apache/myfaces/application/jsp/JspStateManagerImpl.java:[26,48] cannot find symbol
symbol : class ViewSequenceUtils
location: package org.apache.myfaces.shared_impl.renderkit
/local/continuum-1.0.3-SNAPSHOT/apps/continuum/working-directory/9/src/main/java/org/apache/myfaces/application/jsp/JspStateManagerImpl.java:[312,31] cannot find symbol
symbol : variable ViewSequenceUtils
location: class org.apache.myfaces.application.jsp.JspStateManagerImpl
/local/continuum-1.0.3-SNAPSHOT/apps/continuum/working-directory/9/src/main/java/org/apache/myfaces/application/jsp/JspStateManagerImpl.java:[469,31] cannot find symbol
symbol : variable ViewSequenceUtils
location: class org.apache.myfaces.application.jsp.JspStateManagerImpl
/local/continuum-1.0.3-SNAPSHOT/apps/continuum/working-directory/9/src/main/java/org/apache/myfaces/application/jsp/JspStateManagerImpl.java:[482,12] cannot find symbol
symbol : variable ViewSequenceUtils
location: class org.apache.myfaces.application.jsp.JspStateManagerImpl
/local/continuum-1.0.3-SNAPSHOT/apps/continuum/working-directory/9/src/main/java/org/apache/myfaces/application/jsp/JspStateManagerImpl.java:[692,26] cannot find symbol
symbol : variable ViewSequenceUtils
location: class org.apache.myfaces.application.jsp.JspStateManagerImpl.SerializedViewKey
[INFO] ------------------------------------------------------------------------
[INFO] For more information, run Maven with the -e switch
[INFO] ------------------------------------------------------------------------
[INFO] Total time: 27 seconds
[INFO] Finished at: Wed Sep 20 17:02:47 GMT+00:00 2006
[INFO] Final Memory: 11M/324M
[INFO] ------------------------------------------------------------------------
****************************************************************************