You are viewing a plain text version of this content. The canonical link for it is here.
Posted to builds@cassandra.apache.org by Apache Jenkins Server <je...@builds.apache.org> on 2025/03/13 19:04:47 UTC
Build complete: Cassandra-5.0 #404 [UNSTABLE] 14f2b67493abe7390a6ec44eca4efeefe51de0c3
-------------------------------------------------------------------------------
Build Cassandra-5.0 #404 Unstable
URL: https://ci-cassandra.apache.org/job/Cassandra-5.0/404/
-------------------------------------------------------------------------------
Changes:
[Brandon Williams] Suppress CVE-2024-12798
[Brandon Williams] Suppress CVE-2024-12798
[Brandon Williams] Suppress CVE-2024-12801
[Brandon Williams] Suppress CVE-2024-12801
[Brandon Williams] Update changes for 20408/20412
-------------------------------------------------------------------------------
Failed Tests:
7 tests failed.
FAILED: dtest-upgrade.upgrade_tests.cql_tests.TestCQLNodes3RF3_Upgrade_current_4_0_x_To_indev_5_0_x.Tests / dtest-upgrade jdk11 13/128 / test_select_count_paging
FAILED: dtest.bootstrap_test.TestBootstrap.Tests / dtest jdk17 2/64 / test_read_from_bootstrapped_node
FAILED: dtest.disk_balance_test.TestDiskBalance.Tests / dtest jdk17 48/64 / test_disk_balance_after_boundary_change_stcs
FAILED: org.apache.cassandra.auth.GrantAndRevokeTest.Tests / test-oa jdk17 8/16 / testGrantOnAllKeyspaces-oa_jdk17_x86_64
FAILED: org.apache.cassandra.auth.GrantAndRevokeTest.Tests / test-system-keyspace-directory jdk11 8/16 / testGrantOnAllKeyspaces-system_keyspace_directory_jdk11_x86_64
FAILED: org.apache.cassandra.db.commitlog.CommitLogSegmentManagerCDCTest.Tests / test-latest jdk17 15/16 / testSegmentFlaggingWithNonblockingOnCreation-latest_jdk17_x86_64
FAILED: org.apache.cassandra.transport.AuthMessageSizeLimitTest.Tests / test-latest jdk17 13/16 / sendTooBigAuthMultiFrameMessage-latest_jdk17_x86_64
-------------------------------------------------------------------------------
For complete test report and logs see https://nightlies.apache.org/cassandra/Cassandra-5.0/404/