You are viewing a plain text version of this content. The canonical link for it is here.
Posted to builds@beam.apache.org by Apache Jenkins Server <je...@builds.apache.org> on 2023/10/07 05:26:53 UTC

Build failed in Jenkins: beam_PostCommit_XVR_Flink #7438

See <https://ci-beam.apache.org/job/beam_PostCommit_XVR_Flink/7438/display/redirect>

Changes:


------------------------------------------
[...truncated 2.11 MB...]
    return self._hookexec(self.name, self._hookimpls, kwargs, firstresult)
           ^^^^^^^^^^^^^^^^^^^^^^^^^^^^^^^^^^^^^^^^^^^^^^^^^^^^^^^^^^^^^^^
  File "<https://ci-beam.apache.org/job/beam_PostCommit_XVR_Flink/ws/src/build/gradleenv/1922375555/lib/python3.11/site-packages/pluggy/_manager.py",> line 115, in _hookexec
    return self._inner_hookexec(hook_name, methods, kwargs, firstresult)
           ^^^^^^^^^^^^^^^^^^^^^^^^^^^^^^^^^^^^^^^^^^^^^^^^^^^^^^^^^^^^^
  File "<https://ci-beam.apache.org/job/beam_PostCommit_XVR_Flink/ws/src/build/gradleenv/1922375555/lib/python3.11/site-packages/pluggy/_callers.py",> line 130, in _multicall
    teardown[0].send(outcome)
  File "<https://ci-beam.apache.org/job/beam_PostCommit_XVR_Flink/ws/src/build/gradleenv/1922375555/lib/python3.11/site-packages/_pytest/terminal.py",> line 857, in pytest_sessionfinish
    outcome.get_result()
  File "<https://ci-beam.apache.org/job/beam_PostCommit_XVR_Flink/ws/src/build/gradleenv/1922375555/lib/python3.11/site-packages/pluggy/_result.py",> line 114, in get_result
    raise exc.with_traceback(exc.__traceback__)
  File "<https://ci-beam.apache.org/job/beam_PostCommit_XVR_Flink/ws/src/build/gradleenv/1922375555/lib/python3.11/site-packages/pluggy/_callers.py",> line 77, in _multicall
    res = hook_impl.function(*args)
          ^^^^^^^^^^^^^^^^^^^^^^^^^
  File "<https://ci-beam.apache.org/job/beam_PostCommit_XVR_Flink/ws/src/build/gradleenv/1922375555/lib/python3.11/site-packages/_pytest/junitxml.py",> line 683, in pytest_sessionfinish
    logfile.write(ET.tostring(testsuites, encoding="unicode"))
OSError: [Errno 28] No space left on device

> Task :runners:flink:1.15:job-server:validatesCrossLanguageRunnerPythonUsingJava FAILED

> Task :runners:flink:1.15:job-server:validatesCrossLanguageRunnerPythonUsingSql FAILED
>>> RUNNING integration tests with pipeline options: --runner=PortableRunner --job_endpoint=localhost:38693 --environment_cache_millis=10000 --experiments=beam_fn_api --parallelism=2
>>>   pytest options: 
>>>   collect markers: -m=xlang_sql_expansion_service
Traceback (most recent call last):
  File "<https://ci-beam.apache.org/job/beam_PostCommit_XVR_Flink/ws/src/build/gradleenv/1922375555/bin/pytest",> line 8, in <module>
    sys.exit(console_main())
             ^^^^^^^^^^^^^^
  File "<https://ci-beam.apache.org/job/beam_PostCommit_XVR_Flink/ws/src/build/gradleenv/1922375555/lib/python3.11/site-packages/_pytest/config/__init__.py",> line 192, in console_main
    code = main()
           ^^^^^^
  File "<https://ci-beam.apache.org/job/beam_PostCommit_XVR_Flink/ws/src/build/gradleenv/1922375555/lib/python3.11/site-packages/_pytest/config/__init__.py",> line 150, in main
    config = _prepareconfig(args, plugins)
             ^^^^^^^^^^^^^^^^^^^^^^^^^^^^^
  File "<https://ci-beam.apache.org/job/beam_PostCommit_XVR_Flink/ws/src/build/gradleenv/1922375555/lib/python3.11/site-packages/_pytest/config/__init__.py",> line 331, in _prepareconfig
    config = pluginmanager.hook.pytest_cmdline_parse(
             ^^^^^^^^^^^^^^^^^^^^^^^^^^^^^^^^^^^^^^^^
  File "<https://ci-beam.apache.org/job/beam_PostCommit_XVR_Flink/ws/src/build/gradleenv/1922375555/lib/python3.11/site-packages/pluggy/_hooks.py",> line 493, in __call__
    return self._hookexec(self.name, self._hookimpls, kwargs, firstresult)
           ^^^^^^^^^^^^^^^^^^^^^^^^^^^^^^^^^^^^^^^^^^^^^^^^^^^^^^^^^^^^^^^
  File "<https://ci-beam.apache.org/job/beam_PostCommit_XVR_Flink/ws/src/build/gradleenv/1922375555/lib/python3.11/site-packages/pluggy/_manager.py",> line 115, in _hookexec
    return self._inner_hookexec(hook_name, methods, kwargs, firstresult)
           ^^^^^^^^^^^^^^^^^^^^^^^^^^^^^^^^^^^^^^^^^^^^^^^^^^^^^^^^^^^^^
  File "<https://ci-beam.apache.org/job/beam_PostCommit_XVR_Flink/ws/src/build/gradleenv/1922375555/lib/python3.11/site-packages/pluggy/_callers.py",> line 130, in _multicall
    teardown[0].send(outcome)
  File "<https://ci-beam.apache.org/job/beam_PostCommit_XVR_Flink/ws/src/build/gradleenv/1922375555/lib/python3.11/site-packages/_pytest/helpconfig.py",> line 104, in pytest_cmdline_parse
    config: Config = outcome.get_result()
                     ^^^^^^^^^^^^^^^^^^^^
  File "<https://ci-beam.apache.org/job/beam_PostCommit_XVR_Flink/ws/src/build/gradleenv/1922375555/lib/python3.11/site-packages/pluggy/_result.py",> line 114, in get_result
    raise exc.with_traceback(exc.__traceback__)
  File "<https://ci-beam.apache.org/job/beam_PostCommit_XVR_Flink/ws/src/build/gradleenv/1922375555/lib/python3.11/site-packages/pluggy/_callers.py",> line 77, in _multicall
    res = hook_impl.function(*args)
          ^^^^^^^^^^^^^^^^^^^^^^^^^
  File "<https://ci-beam.apache.org/job/beam_PostCommit_XVR_Flink/ws/src/build/gradleenv/1922375555/lib/python3.11/site-packages/_pytest/config/__init__.py",> line 1075, in pytest_cmdline_parse
    self.parse(args)
  File "<https://ci-beam.apache.org/job/beam_PostCommit_XVR_Flink/ws/src/build/gradleenv/1922375555/lib/python3.11/site-packages/_pytest/config/__init__.py",> line 1425, in parse
    self._preparse(args, addopts=addopts)
  File "<https://ci-beam.apache.org/job/beam_PostCommit_XVR_Flink/ws/src/build/gradleenv/1922375555/lib/python3.11/site-packages/_pytest/config/__init__.py",> line 1327, in _preparse
    self.hook.pytest_load_initial_conftests(
  File "<https://ci-beam.apache.org/job/beam_PostCommit_XVR_Flink/ws/src/build/gradleenv/1922375555/lib/python3.11/site-packages/pluggy/_hooks.py",> line 493, in __call__
    return self._hookexec(self.name, self._hookimpls, kwargs, firstresult)
           ^^^^^^^^^^^^^^^^^^^^^^^^^^^^^^^^^^^^^^^^^^^^^^^^^^^^^^^^^^^^^^^
  File "<https://ci-beam.apache.org/job/beam_PostCommit_XVR_Flink/ws/src/build/gradleenv/1922375555/lib/python3.11/site-packages/pluggy/_manager.py",> line 115, in _hookexec
    return self._inner_hookexec(hook_name, methods, kwargs, firstresult)
           ^^^^^^^^^^^^^^^^^^^^^^^^^^^^^^^^^^^^^^^^^^^^^^^^^^^^^^^^^^^^^
  File "<https://ci-beam.apache.org/job/beam_PostCommit_XVR_Flink/ws/src/build/gradleenv/1922375555/lib/python3.11/site-packages/pluggy/_callers.py",> line 152, in _multicall
    return outcome.get_result()
           ^^^^^^^^^^^^^^^^^^^^
  File "<https://ci-beam.apache.org/job/beam_PostCommit_XVR_Flink/ws/src/build/gradleenv/1922375555/lib/python3.11/site-packages/pluggy/_result.py",> line 114, in get_result
    raise exc.with_traceback(exc.__traceback__)
  File "<https://ci-beam.apache.org/job/beam_PostCommit_XVR_Flink/ws/src/build/gradleenv/1922375555/lib/python3.11/site-packages/pluggy/_callers.py",> line 62, in _multicall
    next(wrapper_gen)  # first yield
    ^^^^^^^^^^^^^^^^^
  File "<https://ci-beam.apache.org/job/beam_PostCommit_XVR_Flink/ws/src/build/gradleenv/1922375555/lib/python3.11/site-packages/_pytest/capture.py",> line 149, in pytest_load_initial_conftests
    capman.start_global_capturing()
  File "<https://ci-beam.apache.org/job/beam_PostCommit_XVR_Flink/ws/src/build/gradleenv/1922375555/lib/python3.11/site-packages/_pytest/capture.py",> line 750, in start_global_capturing
    self._global_capturing = _get_multicapture(self._method)
                             ^^^^^^^^^^^^^^^^^^^^^^^^^^^^^^^
  File "<https://ci-beam.apache.org/job/beam_PostCommit_XVR_Flink/ws/src/build/gradleenv/1922375555/lib/python3.11/site-packages/_pytest/capture.py",> line 692, in _get_multicapture
    return MultiCapture(in_=FDCapture(0), out=FDCapture(1), err=FDCapture(2))
                                              ^^^^^^^^^^^^
  File "<https://ci-beam.apache.org/job/beam_PostCommit_XVR_Flink/ws/src/build/gradleenv/1922375555/lib/python3.11/site-packages/_pytest/capture.py",> line 466, in __init__
    TemporaryFile(buffering=0),
    ^^^^^^^^^^^^^^^^^^^^^^^^^^
  File "/usr/lib/python3.11/tempfile.py", line 750, in TemporaryFile
    prefix, suffix, dir, output_type = _sanitize_params(prefix, suffix, dir)
                                       ^^^^^^^^^^^^^^^^^^^^^^^^^^^^^^^^^^^^^
  File "/usr/lib/python3.11/tempfile.py", line 265, in _sanitize_params
    dir = gettempdir()
          ^^^^^^^^^^^^
  File "/usr/lib/python3.11/tempfile.py", line 438, in gettempdir
    return _os.fsdecode(_gettempdir())
                        ^^^^^^^^^^^^^
  File "/usr/lib/python3.11/tempfile.py", line 431, in _gettempdir
    tempdir = _get_default_tempdir()
              ^^^^^^^^^^^^^^^^^^^^^^
  File "/usr/lib/python3.11/tempfile.py", line 362, in _get_default_tempdir
    raise FileNotFoundError(_errno.ENOENT,
FileNotFoundError: [Errno 2] No usable temporary directory found in ['/tmp', '/var/tmp', '/usr/tmp', '<https://ci-beam.apache.org/job/beam_PostCommit_XVR_Flink/ws/src/sdks/python']>

> Task :runners:flink:1.15:job-server:flinkJobServerCleanup
<https://ci-beam.apache.org/job/beam_PostCommit_XVR_Flink/ws/src/sdks/python/scripts/run_job_server.sh>: line 19: cannot create temp file for here-document: No space left on device
Stopping job server pid: 3918270.

> Task :runners:flink:1.15:job-server:validatesCrossLanguageRunnerCleanup
Stopping expansion service pid: 3922740.
Stopping expansion service pid: 3922741.

FAILURE: Build completed with 3 failures.

1: Task failed with an exception.
-----------
* What went wrong:
Execution failed for task ':runners:flink:1.15:job-server:validatesCrossLanguageRunnerJavaUsingPython'.
> There were failing tests. See the report at: file://<https://ci-beam.apache.org/job/beam_PostCommit_XVR_Flink/ws/src/runners/flink/1.15/job-server/build/reports/tests/validatesCrossLanguageRunnerJavaUsingPython/index.html>
==============================================================================

2: Task failed with an exception.
-----------
* What went wrong:
Execution failed for task ':runners:flink:1.15:job-server:validatesCrossLanguageRunnerPythonUsingJava'.
> Process 'command 'sh'' finished with non-zero exit value 1

* Try:
> Run with --stacktrace option to get the stack trace.
> Run with --info or --debug option to get more log output.
> Get more help at https://help.gradle.org.
==============================================================================

3: Task failed with an exception.
-----------
* What went wrong:
Execution failed for task ':runners:flink:1.15:job-server:validatesCrossLanguageRunnerPythonUsingSql'.
> Process 'command 'sh'' finished with non-zero exit value 1

* Try:
> Run with --stacktrace option to get the stack trace.
> Run with --info or --debug option to get more log output.
> Get more help at https://help.gradle.org.
==============================================================================

Deprecated Gradle features were used in this build, making it incompatible with Gradle 9.0.

You can use '--warning-mode all' to show the individual deprecation warnings and determine if they come from your own scripts or plugins.

For more on this, please refer to https://docs.gradle.org/8.3/userguide/command_line_interface.html#sec:command_line_warnings in the Gradle documentation.

BUILD FAILED in 27m 23s
189 actionable tasks: 26 executed, 163 up-to-date

A build scan cannot be produced as an error occurred gathering build data.
Please report this problem via https://gradle.com/help/plugin and include the following via copy/paste:

----------
Gradle version: 8.3
Plugin version: 3.13.2

java.lang.RuntimeException: Could not serialize event class 'com.gradle.scan.agent.serialization.scan.a.b'.
	at com.gradle.scan.plugin.internal.h.c.c.a(SourceFile:112)
	at com.gradle.scan.plugin.internal.h.a.a(SourceFile:42)
	at com.gradle.scan.plugin.internal.h.a.b(SourceFile:34)
	at com.gradle.scan.plugin.internal.c.c.a(SourceFile:46)
	at com.gradle.scan.plugin.internal.p.d.a(SourceFile:55)
	at com.gradle.scan.plugin.internal.r.a.b(SourceFile:111)
	at com.gradle.scan.plugin.internal.p.d.a(SourceFile:54)
	at com.gradle.scan.plugin.internal.p.b.a(SourceFile:23)
	at org.gradle.internal.enterprise.impl.DefaultGradleEnterprisePluginAdapter.buildFinished(DefaultGradleEnterprisePluginAdapter.java:79)
	at org.gradle.internal.enterprise.core.GradleEnterprisePluginManager.buildFinished(GradleEnterprisePluginManager.java:76)
	at org.gradle.launcher.exec.BuildCompletionNotifyingBuildActionRunner.notifyEnterprisePluginManager(BuildCompletionNotifyingBuildActionRunner.java:53)
	at org.gradle.launcher.exec.BuildCompletionNotifyingBuildActionRunner.run(BuildCompletionNotifyingBuildActionRunner.java:48)
	at org.gradle.launcher.exec.RootBuildLifecycleBuildActionExecutor.lambda$execute$0(RootBuildLifecycleBuildActionExecutor.java:40)
	at org.gradle.composite.internal.DefaultRootBuildState.run(DefaultRootBuildState.java:123)
	at org.gradle.launcher.exec.RootBuildLifecycleBuildActionExecutor.execute(RootBuildLifecycleBuildActionExecutor.java:40)
	at org.gradle.internal.buildtree.InitDeprecationLoggingActionExecutor.execute(InitDeprecationLoggingActionExecutor.java:58)
	at org.gradle.internal.buildtree.DefaultBuildTreeContext.execute(DefaultBuildTreeContext.java:40)
	at org.gradle.launcher.exec.BuildTreeLifecycleBuildActionExecutor.lambda$execute$0(BuildTreeLifecycleBuildActionExecutor.java:65)
	at org.gradle.internal.buildtree.BuildTreeState.run(BuildTreeState.java:58)
	at org.gradle.launcher.exec.BuildTreeLifecycleBuildActionExecutor.execute(BuildTreeLifecycleBuildActionExecutor.java:65)
	at org.gradle.launcher.exec.RunAsBuildOperationBuildActionExecutor$3.call(RunAsBuildOperationBuildActionExecutor.java:61)
	at org.gradle.launcher.exec.RunAsBuildOperationBuildActionExecutor$3.call(RunAsBuildOperationBuildActionExecutor.java:57)
	at org.gradle.internal.operations.DefaultBuildOperationRunner$CallableBuildOperationWorker.execute(DefaultBuildOperationRunner.java:204)
	at org.gradle.internal.operations.DefaultBuildOperationRunner$CallableBuildOperationWorker.execute(DefaultBuildOperationRunner.java:199)
	at org.gradle.internal.operations.DefaultBuildOperationRunner$2.execute(DefaultBuildOperationRunner.java:66)
	at org.gradle.internal.operations.DefaultBuildOperationRunner$2.execute(DefaultBuildOperationRunner.java:59)
	at org.gradle.internal.operations.DefaultBuildOperationRunner.execute(DefaultBuildOperationRunner.java:157)
	at org.gradle.internal.operations.DefaultBuildOperationRunner.execute(DefaultBuildOperationRunner.java:59)
	at org.gradle.internal.operations.DefaultBuildOperationRunner.call(DefaultBuildOperationRunner.java:53)
	at org.gradle.internal.operations.DefaultBuildOperationExecutor.call(DefaultBuildOperationExecutor.java:73)
	at org.gradle.launcher.exec.RunAsBuildOperationBuildActionExecutor.execute(RunAsBuildOperationBuildActionExecutor.java:57)
	at org.gradle.launcher.exec.RunAsWorkerThreadBuildActionExecutor.lambda$execute$0(RunAsWorkerThreadBuildActionExecutor.java:36)
	at org.gradle.internal.work.DefaultWorkerLeaseService.withLocks(DefaultWorkerLeaseService.java:264)
	at org.gradle.internal.work.DefaultWorkerLeaseService.runAsWorkerThread(DefaultWorkerLeaseService.java:128)
	at org.gradle.launcher.exec.RunAsWorkerThreadBuildActionExecutor.execute(RunAsWorkerThreadBuildActionExecutor.java:36)
	at org.gradle.tooling.internal.provider.continuous.ContinuousBuildActionExecutor.execute(ContinuousBuildActionExecutor.java:110)
	at org.gradle.tooling.internal.provider.SubscribableBuildActionExecutor.execute(SubscribableBuildActionExecutor.java:64)
	at org.gradle.internal.session.DefaultBuildSessionContext.execute(DefaultBuildSessionContext.java:46)
	at org.gradle.tooling.internal.provider.BuildSessionLifecycleBuildActionExecuter$ActionImpl.apply(BuildSessionLifecycleBuildActionExecuter.java:92)
	at org.gradle.tooling.internal.provider.BuildSessionLifecycleBuildActionExecuter$ActionImpl.apply(BuildSessionLifecycleBuildActionExecuter.java:80)
	at org.gradle.internal.session.BuildSessionState.run(BuildSessionState.java:69)
	at org.gradle.tooling.internal.provider.BuildSessionLifecycleBuildActionExecuter.execute(BuildSessionLifecycleBuildActionExecuter.java:62)
	at org.gradle.tooling.internal.provider.BuildSessionLifecycleBuildActionExecuter.execute(BuildSessionLifecycleBuildActionExecuter.java:41)
	at org.gradle.tooling.internal.provider.StartParamsValidatingActionExecuter.execute(StartParamsValidatingActionExecuter.java:64)
	at org.gradle.tooling.internal.provider.StartParamsValidatingActionExecuter.execute(StartParamsValidatingActionExecuter.java:32)
	at org.gradle.tooling.internal.provider.SessionFailureReportingActionExecuter.execute(SessionFailureReportingActionExecuter.java:51)
	at org.gradle.tooling.internal.provider.SessionFailureReportingActionExecuter.execute(SessionFailureReportingActionExecuter.java:39)
	at org.gradle.tooling.internal.provider.SetupLoggingActionExecuter.execute(SetupLoggingActionExecuter.java:47)
	at org.gradle.tooling.internal.provider.SetupLoggingActionExecuter.execute(SetupLoggingActionExecuter.java:31)
	at org.gradle.launcher.daemon.server.exec.ExecuteBuild.doBuild(ExecuteBuild.java:65)
	at org.gradle.launcher.daemon.server.exec.BuildCommandOnly.execute(BuildCommandOnly.java:37)
	at org.gradle.launcher.daemon.server.api.DaemonCommandExecution.proceed(DaemonCommandExecution.java:104)
	at org.gradle.launcher.daemon.server.exec.WatchForDisconnection.execute(WatchForDisconnection.java:39)
	at org.gradle.launcher.daemon.server.api.DaemonCommandExecution.proceed(DaemonCommandExecution.java:104)
	at org.gradle.launcher.daemon.server.exec.ResetDeprecationLogger.execute(ResetDeprecationLogger.java:29)
	at org.gradle.launcher.daemon.server.api.DaemonCommandExecution.proceed(DaemonCommandExecution.java:104)
	at org.gradle.launcher.daemon.server.exec.RequestStopIfSingleUsedDaemon.execute(RequestStopIfSingleUsedDaemon.java:35)
	at org.gradle.launcher.daemon.server.api.DaemonCommandExecution.proceed(DaemonCommandExecution.java:104)
	at org.gradle.launcher.daemon.server.exec.ForwardClientInput$2.create(ForwardClientInput.java:78)
	at org.gradle.launcher.daemon.server.exec.ForwardClientInput$2.create(ForwardClientInput.java:75)
	at org.gradle.util.internal.Swapper.swap(Swapper.java:38)
	at org.gradle.launcher.daemon.server.exec.ForwardClientInput.execute(ForwardClientInput.java:75)
	at org.gradle.launcher.daemon.server.api.DaemonCommandExecution.proceed(DaemonCommandExecution.java:104)
	at org.gradle.launcher.daemon.server.exec.LogAndCheckHealth.execute(LogAndCheckHealth.java:53)
	at org.gradle.launcher.daemon.server.api.DaemonCommandExecution.proceed(DaemonCommandExecution.java:104)
	at org.gradle.launcher.daemon.server.exec.LogToClient.doBuild(LogToClient.java:63)
	at org.gradle.launcher.daemon.server.exec.BuildCommandOnly.execute(BuildCommandOnly.java:37)
	at org.gradle.launcher.daemon.server.api.DaemonCommandExecution.proceed(DaemonCommandExecution.java:104)
	at org.gradle.launcher.daemon.server.exec.EstablishBuildEnvironment.doBuild(EstablishBuildEnvironment.java:84)
	at org.gradle.launcher.daemon.server.exec.BuildCommandOnly.execute(BuildCommandOnly.java:37)
	at org.gradle.launcher.daemon.server.api.DaemonCommandExecution.proceed(DaemonCommandExecution.java:104)
	at org.gradle.launcher.daemon.server.exec.StartBuildOrRespondWithBusy$1.run(StartBuildOrRespondWithBusy.java:52)
	at org.gradle.launcher.daemon.server.DaemonStateCoordinator$1.run(DaemonStateCoordinator.java:297)
	at org.gradle.internal.concurrent.ExecutorPolicy$CatchAndRecordFailures.onExecute(ExecutorPolicy.java:64)
	at org.gradle.internal.concurrent.AbstractManagedExecutor$1.run(AbstractManagedExecutor.java:47)
Caused by: java.lang.RuntimeException: java.io.IOException: No space left on device
	at com.gradle.scan.agent.serialization.scan.serializer.d.flush(SourceFile:245)
	at com.gradle.scan.agent.serialization.scan.serializer.d.a(SourceFile:211)
	at com.gradle.scan.agent.serialization.scan.serializer.d.a(SourceFile:338)
	at com.gradle.scan.agent.serialization.scan.serializer.c.a(SourceFile:118)
	at com.gradle.scan.agent.serialization.scan.serializer.c.a(SourceFile:106)
	at com.gradle.scan.agent.serialization.scan.serializer.c.a(SourceFile:75)
	at com.gradle.scan.plugin.internal.h.c.c.a(SourceFile:110)
	... 74 more
Caused by: java.io.IOException: No space left on device
	at com.gradle.scan.agent.serialization.scan.serializer.d.flush(SourceFile:243)
	... 80 more
----------

Build step 'Invoke Gradle script' changed build result to FAILURE
Build step 'Invoke Gradle script' marked build as failure

---------------------------------------------------------------------
To unsubscribe, e-mail: builds-unsubscribe@beam.apache.org
For additional commands, e-mail: builds-help@beam.apache.org


Jenkins build is back to normal : beam_PostCommit_XVR_Flink #7439

Posted by Apache Jenkins Server <je...@builds.apache.org>.
See <https://ci-beam.apache.org/job/beam_PostCommit_XVR_Flink/7439/display/redirect>


---------------------------------------------------------------------
To unsubscribe, e-mail: builds-unsubscribe@beam.apache.org
For additional commands, e-mail: builds-help@beam.apache.org