You are viewing a plain text version of this content. The canonical link for it is here.
Posted to builds@hbase.apache.org by Apache Jenkins Server <je...@builds.apache.org> on 2013/12/20 15:15:59 UTC
Build failed in Jenkins: HBase-0.98 #26
See <https://builds.apache.org/job/HBase-0.98/26/changes>
Changes:
[apurtell] HBASE-10138. Incorrect or confusing test value is used in block caches (Sergey Shelukhin)
[apurtell] HBASE-10173. Need HFile version check in security coprocessors
[anoopsamjohn] HBASE-10207 ZKVisibilityLabelWatcher : Populate the labels cache on startup
------------------------------------------
[...truncated 4484 lines...]
Running org.apache.hadoop.hbase.security.token.TestZKSecretWatcher
Tests run: 1, Failures: 0, Errors: 0, Skipped: 0, Time elapsed: 14.979 sec
Running org.apache.hadoop.hbase.security.access.TestZKPermissionsWatcher
Tests run: 1, Failures: 0, Errors: 0, Skipped: 0, Time elapsed: 8.397 sec
Running org.apache.hadoop.hbase.security.access.TestTablePermissions
Tests run: 7, Failures: 0, Errors: 0, Skipped: 0, Time elapsed: 21.789 sec
Running org.apache.hadoop.hbase.security.access.TestNamespaceCommands
Tests run: 3, Failures: 0, Errors: 0, Skipped: 0, Time elapsed: 10.026 sec
Running org.apache.hadoop.hbase.security.access.TestAccessController
Tests run: 41, Failures: 0, Errors: 1, Skipped: 0, Time elapsed: 60.57 sec <<< FAILURE!
Running org.apache.hadoop.hbase.ipc.TestDelayedRpc
Tests run: 4, Failures: 0, Errors: 0, Skipped: 0, Time elapsed: 3.528 sec
Running org.apache.hadoop.hbase.ipc.TestHBaseClient
Tests run: 1, Failures: 0, Errors: 0, Skipped: 0, Time elapsed: 0.33 sec
Running org.apache.hadoop.hbase.ipc.TestProtoBufRpc
Tests run: 1, Failures: 0, Errors: 0, Skipped: 0, Time elapsed: 1.307 sec
Running org.apache.hadoop.hbase.TestFullLogReconstruction
Tests run: 1, Failures: 0, Errors: 0, Skipped: 0, Time elapsed: 44.216 sec
Running org.apache.hadoop.hbase.TestGlobalMemStoreSize
Tests run: 1, Failures: 0, Errors: 0, Skipped: 0, Time elapsed: 10.147 sec
Running org.apache.hadoop.hbase.constraint.TestConstraint
Tests run: 5, Failures: 0, Errors: 0, Skipped: 0, Time elapsed: 12.699 sec
Running org.apache.hadoop.hbase.rest.TestSchemaResource
Tests run: 2, Failures: 0, Errors: 0, Skipped: 0, Time elapsed: 10.571 sec
Running org.apache.hadoop.hbase.rest.client.TestRemoteTable
Tests run: 9, Failures: 0, Errors: 0, Skipped: 0, Time elapsed: 17.994 sec
Running org.apache.hadoop.hbase.rest.TestTableResource
Tests run: 8, Failures: 0, Errors: 0, Skipped: 0, Time elapsed: 22.052 sec
Running org.apache.hadoop.hbase.rest.TestMultiRowResource
Tests run: 3, Failures: 0, Errors: 0, Skipped: 0, Time elapsed: 11.067 sec
Running org.apache.hadoop.hbase.rest.TestGetAndPutResource
Tests run: 16, Failures: 0, Errors: 0, Skipped: 0, Time elapsed: 22.872 sec
Running org.apache.hadoop.hbase.rest.TestGzipFilter
Tests run: 2, Failures: 0, Errors: 0, Skipped: 0, Time elapsed: 10.465 sec
Running org.apache.hadoop.hbase.rest.TestResourceFilter
Tests run: 1, Failures: 0, Errors: 0, Skipped: 0, Time elapsed: 8.585 sec
Running org.apache.hadoop.hbase.rest.TestDeleteRow
Tests run: 2, Failures: 0, Errors: 0, Skipped: 0, Time elapsed: 11.564 sec
Running org.apache.hadoop.hbase.rest.TestVersionResource
Tests run: 7, Failures: 0, Errors: 0, Skipped: 0, Time elapsed: 10.801 sec
Running org.apache.hadoop.hbase.rest.TestScannerResource
Tests run: 5, Failures: 0, Errors: 0, Skipped: 0, Time elapsed: 23.564 sec
Running org.apache.hadoop.hbase.rest.TestStatusResource
Tests run: 2, Failures: 0, Errors: 0, Skipped: 0, Time elapsed: 9.323 sec
Running org.apache.hadoop.hbase.rest.TestScannersWithLabels
Tests run: 2, Failures: 0, Errors: 0, Skipped: 0, Time elapsed: 10.794 sec
Running org.apache.hadoop.hbase.trace.TestHTraceHooks
Tests run: 1, Failures: 0, Errors: 0, Skipped: 0, Time elapsed: 8.955 sec
Running org.apache.hadoop.hbase.rest.TestScannersWithFilters
Tests run: 10, Failures: 0, Errors: 0, Skipped: 0, Time elapsed: 13.818 sec
Running org.apache.hadoop.hbase.io.hfile.TestHFileSeek
Tests run: 1, Failures: 0, Errors: 0, Skipped: 0, Time elapsed: 3.209 sec
Running org.apache.hadoop.hbase.io.hfile.TestHFileBlockIndex
Tests run: 10, Failures: 0, Errors: 0, Skipped: 0, Time elapsed: 9.178 sec
Running org.apache.hadoop.hbase.io.hfile.TestForceCacheImportantBlocks
Tests run: 2, Failures: 0, Errors: 0, Skipped: 0, Time elapsed: 31.1 sec
Running org.apache.hadoop.hbase.io.hfile.TestCacheOnWrite
Tests run: 36, Failures: 0, Errors: 0, Skipped: 0, Time elapsed: 84.595 sec
Running org.apache.hadoop.hbase.io.hfile.TestScannerSelectionUsingTTL
Tests run: 6, Failures: 0, Errors: 0, Skipped: 0, Time elapsed: 62.156 sec
Running org.apache.hadoop.hbase.io.hfile.slab.TestSlabCache
Tests run: 7, Failures: 0, Errors: 0, Skipped: 0, Time elapsed: 16.775 sec
Running org.apache.hadoop.hbase.io.hfile.slab.TestSingleSizeCache
Tests run: 5, Failures: 0, Errors: 0, Skipped: 0, Time elapsed: 20.945 sec
Running org.apache.hadoop.hbase.io.TestFileLink
Tests run: 3, Failures: 0, Errors: 0, Skipped: 0, Time elapsed: 20.928 sec
Running org.apache.hadoop.hbase.io.hfile.TestHFileBlock
Tests run: 28, Failures: 0, Errors: 0, Skipped: 0, Time elapsed: 96.677 sec
Running org.apache.hadoop.hbase.io.encoding.TestChangingEncoding
Tests run: 3, Failures: 0, Errors: 0, Skipped: 0, Time elapsed: 63.097 sec
Running org.apache.hadoop.hbase.io.encoding.TestDataBlockEncoders
Tests run: 24, Failures: 0, Errors: 0, Skipped: 0, Time elapsed: 171.43 sec
Running org.apache.hadoop.hbase.io.encoding.TestBufferedDataBlockEncoder
Tests run: 1, Failures: 0, Errors: 0, Skipped: 0, Time elapsed: 17.218 sec
Running org.apache.hadoop.hbase.io.encoding.TestLoadAndSwitchEncodeOnDisk
Tests run: 1, Failures: 0, Errors: 0, Skipped: 0, Time elapsed: 19.915 sec
Running org.apache.hadoop.hbase.TestRegionRebalancing
Tests run: 2, Failures: 0, Errors: 0, Skipped: 0, Time elapsed: 27.951 sec
Running org.apache.hadoop.hbase.io.encoding.TestEncodedSeekers
Tests run: 40, Failures: 0, Errors: 0, Skipped: 0, Time elapsed: 379.183 sec
Running org.apache.hadoop.hbase.mapred.TestTableInputFormat
Tests run: 10, Failures: 0, Errors: 0, Skipped: 0, Time elapsed: 10.544 sec
Running org.apache.hadoop.hbase.mapred.TestTableMapReduceUtil
Tests run: 4, Failures: 0, Errors: 0, Skipped: 0, Time elapsed: 92.107 sec
Running org.apache.hadoop.hbase.replication.TestReplicationTrackerZKImpl
Tests run: 4, Failures: 0, Errors: 0, Skipped: 2, Time elapsed: 1.325 sec
Running org.apache.hadoop.hbase.replication.TestReplicationDisableInactivePeer
Tests run: 1, Failures: 0, Errors: 0, Skipped: 0, Time elapsed: 34.297 sec
Running org.apache.hadoop.hbase.mapred.TestTableMapReduce
Tests run: 2, Failures: 0, Errors: 0, Skipped: 0, Time elapsed: 98.831 sec
Running org.apache.hadoop.hbase.replication.TestReplicationKillMasterRSCompressed
Tests run: 1, Failures: 0, Errors: 0, Skipped: 0, Time elapsed: 29.404 sec
Running org.apache.hadoop.hbase.replication.regionserver.TestReplicationSink
Tests run: 5, Failures: 0, Errors: 0, Skipped: 0, Time elapsed: 10.402 sec
Running org.apache.hadoop.hbase.replication.regionserver.TestReplicationSourceManager
Tests run: 3, Failures: 0, Errors: 0, Skipped: 0, Time elapsed: 1.904 sec
Running org.apache.hadoop.hbase.replication.TestReplicationSource
Tests run: 1, Failures: 0, Errors: 0, Skipped: 0, Time elapsed: 4.053 sec
Running org.apache.hadoop.hbase.replication.TestReplicationChangingPeerRegionservers
Tests run: 1, Failures: 0, Errors: 0, Skipped: 0, Time elapsed: 19.746 sec
Running org.apache.hadoop.hbase.replication.TestReplicationSyncUpTool
Tests run: 1, Failures: 0, Errors: 0, Skipped: 0, Time elapsed: 64.979 sec
Running org.apache.hadoop.hbase.replication.TestReplicationKillMasterRS
Tests run: 1, Failures: 0, Errors: 0, Skipped: 0, Time elapsed: 29.49 sec
Running org.apache.hadoop.hbase.replication.TestMultiSlaveReplication
Tests run: 1, Failures: 0, Errors: 0, Skipped: 0, Time elapsed: 24.298 sec
Running org.apache.hadoop.hbase.replication.TestReplicationKillSlaveRS
Tests run: 1, Failures: 0, Errors: 0, Skipped: 0, Time elapsed: 29.681 sec
Running org.apache.hadoop.hbase.replication.TestReplicationStateZKImpl
Tests run: 6, Failures: 0, Errors: 0, Skipped: 0, Time elapsed: 2.554 sec
Running org.apache.hadoop.hbase.replication.TestReplicationSmallTests
Tests run: 9, Failures: 0, Errors: 0, Skipped: 0, Time elapsed: 49.179 sec
Running org.apache.hadoop.hbase.replication.regionserver.TestReplicationHLogReaderManager
Tests run: 8, Failures: 0, Errors: 0, Skipped: 0, Time elapsed: 247.575 sec
Running org.apache.hadoop.hbase.util.TestMergeTool
Tests run: 1, Failures: 0, Errors: 0, Skipped: 0, Time elapsed: 18.142 sec
Running org.apache.hadoop.hbase.util.TestFSTableDescriptors
Tests run: 12, Failures: 0, Errors: 0, Skipped: 0, Time elapsed: 1.926 sec
Running org.apache.hadoop.hbase.util.TestHBaseFsckEncryption
Tests run: 1, Failures: 0, Errors: 0, Skipped: 0, Time elapsed: 10.09 sec
Running org.apache.hadoop.hbase.util.TestIdLock
Tests run: 1, Failures: 0, Errors: 0, Skipped: 0, Time elapsed: 15.768 sec
Running org.apache.hadoop.hbase.replication.TestMasterReplication
Tests run: 3, Failures: 0, Errors: 0, Skipped: 0, Time elapsed: 52.199 sec
Running org.apache.hadoop.hbase.util.TestMergeTable
Tests run: 1, Failures: 0, Errors: 0, Skipped: 0, Time elapsed: 15.86 sec
Running org.apache.hadoop.hbase.util.TestMiniClusterLoadSequential
Tests run: 4, Failures: 0, Errors: 0, Skipped: 0, Time elapsed: 38.185 sec
Running org.apache.hadoop.hbase.util.TestMiniClusterLoadParallel
Tests run: 4, Failures: 0, Errors: 0, Skipped: 0, Time elapsed: 34.827 sec
Running org.apache.hadoop.hbase.util.TestFSUtils
Tests run: 7, Failures: 0, Errors: 0, Skipped: 0, Time elapsed: 10.506 sec
Running org.apache.hadoop.hbase.util.TestRegionSplitter
Tests run: 5, Failures: 0, Errors: 0, Skipped: 0, Time elapsed: 12.695 sec
Running org.apache.hadoop.hbase.util.TestProcessBasedCluster
Tests run: 1, Failures: 0, Errors: 0, Skipped: 0, Time elapsed: 0.573 sec
Running org.apache.hadoop.hbase.util.TestMiniClusterLoadEncoded
Tests run: 5, Failures: 0, Errors: 0, Skipped: 0, Time elapsed: 41.442 sec
Running org.apache.hadoop.hbase.util.TestCoprocessorScanPolicy
Tests run: 4, Failures: 0, Errors: 0, Skipped: 0, Time elapsed: 12.637 sec
Running org.apache.hadoop.hbase.util.TestFSVisitor
Tests run: 3, Failures: 0, Errors: 0, Skipped: 0, Time elapsed: 3.97 sec
Running org.apache.hadoop.hbase.util.hbck.TestOfflineMetaRebuildBase
Tests run: 1, Failures: 0, Errors: 0, Skipped: 0, Time elapsed: 17.897 sec
Running org.apache.hadoop.hbase.util.hbck.TestOfflineMetaRebuildOverlap
Tests run: 1, Failures: 0, Errors: 0, Skipped: 0, Time elapsed: 17.805 sec
Running org.apache.hadoop.hbase.util.hbck.TestOfflineMetaRebuildHole
Tests run: 1, Failures: 0, Errors: 0, Skipped: 0, Time elapsed: 18.306 sec
Running org.apache.hadoop.hbase.util.TestDefaultEnvironmentEdge
Tests run: 1, Failures: 0, Errors: 0, Skipped: 0, Time elapsed: 0.252 sec
Running org.apache.hadoop.hbase.util.TestHBaseFsck
Tests run: 39, Failures: 0, Errors: 0, Skipped: 1, Time elapsed: 157.316 sec
Running org.apache.hadoop.hbase.util.TestFSHDFSUtils
Tests run: 2, Failures: 0, Errors: 0, Skipped: 0, Time elapsed: 4.146 sec
Running org.apache.hadoop.hbase.migration.TestUpgradeTo96
Tests run: 5, Failures: 0, Errors: 0, Skipped: 0, Time elapsed: 7.724 sec
Running org.apache.hadoop.hbase.migration.TestNamespaceUpgrade
Tests run: 4, Failures: 0, Errors: 0, Skipped: 0, Time elapsed: 22.314 sec
Running org.apache.hadoop.hbase.TestNamespace
Tests run: 9, Failures: 0, Errors: 0, Skipped: 1, Time elapsed: 14.174 sec
Running org.apache.hadoop.hbase.TestInfoServers
Tests run: 3, Failures: 0, Errors: 0, Skipped: 0, Time elapsed: 9.713 sec
Results :
Tests in error:
testCellPermissions(org.apache.hadoop.hbase.security.access.TestAccessController): Failed 1 action: org.apache.hadoop.hbase.DoNotRetryIOException: Cell ACLs cannot be persisted(..)
Tests run: 1755, Failures: 0, Errors: 1, Skipped: 21
[INFO] ------------------------------------------------------------------------
[INFO] Reactor Summary:
[INFO]
[INFO] HBase ............................................. SUCCESS [10.957s]
[INFO] HBase - Common .................................... SUCCESS [28.400s]
[INFO] HBase - Protocol .................................. SUCCESS [15.795s]
[INFO] HBase - Client .................................... SUCCESS [38.537s]
[INFO] HBase - Hadoop Compatibility ...................... SUCCESS [5.646s]
[INFO] HBase - Hadoop Two Compatibility .................. SUCCESS [2.336s]
[INFO] HBase - Prefix Tree ............................... SUCCESS [3.368s]
[INFO] HBase - Server .................................... FAILURE [1:29:57.153s]
[INFO] HBase - Testing Util .............................. SKIPPED
[INFO] HBase - Thrift .................................... SKIPPED
[INFO] HBase - Shell ..................................... SKIPPED
[INFO] HBase - Integration Tests ......................... SKIPPED
[INFO] HBase - Examples .................................. SKIPPED
[INFO] HBase - Assembly .................................. SKIPPED
[INFO] ------------------------------------------------------------------------
[INFO] BUILD FAILURE
[INFO] ------------------------------------------------------------------------
[INFO] Total time: 1:31:42.865s
[INFO] Finished at: Fri Dec 20 14:14:55 UTC 2013
[INFO] Final Memory: 41M/781M
[INFO] ------------------------------------------------------------------------
[ERROR] Failed to execute goal org.apache.maven.plugins:maven-surefire-plugin:2.12-TRUNK-HBASE-2:test (secondPartTestsExecution) on project hbase-server: There are test failures.
[ERROR]
[ERROR] Please refer to /x1/jenkins/jenkins-slave/workspace/HBase-0.98/0.98/hbase-server/target/surefire-reports for the individual test results.
[ERROR] -> [Help 1]
[ERROR]
[ERROR] To see the full stack trace of the errors, re-run Maven with the -e switch.
[ERROR] Re-run Maven using the -X switch to enable full debug logging.
[ERROR]
[ERROR] For more information about the errors and possible solutions, please read the following articles:
[ERROR] [Help 1] http://cwiki.apache.org/confluence/display/MAVEN/MojoFailureException
[ERROR]
[ERROR] After correcting the problems, you can resume the build with the command
[ERROR] mvn <goals> -rf :hbase-server
Build step 'Invoke top-level Maven targets' marked build as failure
Performing Post build task...
Match found for :.* : True
Logical operation result is TRUE
Running script : ZOMBIE_TESTS_COUNT=`jps | grep surefirebooter | wc -l`
if [[ $ZOMBIE_TESTS_COUNT != 0 ]] ; then
#It seems sometimes the tests are not dying immediately. Let's give them 10s
echo "Suspicious java process found - waiting 10s to see if there are just slow to stop"
sleep 10
ZOMBIE_TESTS_COUNT=`jps | grep surefirebooter | wc -l`
if [[ $ZOMBIE_TESTS_COUNT != 0 ]] ; then
echo "There are $ZOMBIE_TESTS_COUNT zombie tests, they should have been killed by surefire but survived"
echo "************ BEGIN zombies jstack extract"
ZB_STACK=`jps | grep surefirebooter | cut -d ' ' -f 1 | xargs -n 1 jstack | grep ".test" | grep "\.java"`
jps | grep surefirebooter | cut -d ' ' -f 1 | xargs -n 1 jstack
echo "************ END zombies jstack extract"
JIRA_COMMENT="$JIRA_COMMENT
{color:red}-1 core zombie tests{color}. There are ${ZOMBIE_TESTS_COUNT} zombie test(s): ${ZB_STACK}"
BAD=1
jps | grep surefirebooter | cut -d ' ' -f 1 | xargs kill -9
else
echo "We're ok: there is no zombie test, but some tests took some time to stop"
fi
else
echo "We're ok: there is no zombie test"
fi
[HBase-0.98] $ /bin/bash -xe /tmp/hudson4603600976103838629.sh
++ jps
++ grep surefirebooter
++ wc -l
+ ZOMBIE_TESTS_COUNT=0
+ [[ 0 != 0 ]]
+ echo 'We'\''re ok: there is no zombie test'
We're ok: there is no zombie test
POST BUILD TASK : SUCCESS
END OF POST BUILD TASK : 0
Archiving artifacts
Recording test results
Updating HBASE-10138
Updating HBASE-10173
Updating HBASE-10207
Jenkins build is back to normal : HBase-0.98 #28
Posted by Apache Jenkins Server <je...@builds.apache.org>.
See <https://builds.apache.org/job/HBase-0.98/28/changes>
Build failed in Jenkins: HBase-0.98 #27
Posted by Apache Jenkins Server <je...@builds.apache.org>.
See <https://builds.apache.org/job/HBase-0.98/27/>
------------------------------------------
[...truncated 241 lines...]
at hudson.remoting.UserRequest.perform(UserRequest.java:118)
at hudson.remoting.UserRequest.perform(UserRequest.java:48)
at hudson.remoting.Request$2.run(Request.java:328)
at hudson.remoting.InterceptingExecutorService$1.call(InterceptingExecutorService.java:72)
at java.util.concurrent.FutureTask$Sync.innerRun(FutureTask.java:334)
at java.util.concurrent.FutureTask.run(FutureTask.java:166)
at java.util.concurrent.ThreadPoolExecutor.runWorker(ThreadPoolExecutor.java:1146)
at java.util.concurrent.ThreadPoolExecutor$Worker.run(ThreadPoolExecutor.java:615)
at java.lang.Thread.run(Thread.java:679)
Caused by: org.tmatesoft.svn.core.SVNException: svn: E175002: OPTIONS /repos/asf/hbase/branches/0.98 failed
at org.tmatesoft.svn.core.internal.io.dav.http.HTTPConnection.request(HTTPConnection.java:388)
at org.tmatesoft.svn.core.internal.io.dav.http.HTTPConnection.request(HTTPConnection.java:373)
at org.tmatesoft.svn.core.internal.io.dav.http.HTTPConnection.request(HTTPConnection.java:361)
at org.tmatesoft.svn.core.internal.io.dav.DAVConnection.performHttpRequest(DAVConnection.java:707)
at org.tmatesoft.svn.core.internal.io.dav.DAVConnection.exchangeCapabilities(DAVConnection.java:627)
at org.tmatesoft.svn.core.internal.io.dav.DAVConnection.open(DAVConnection.java:102)
at org.tmatesoft.svn.core.internal.io.dav.DAVRepository.openConnection(DAVRepository.java:1020)
at org.tmatesoft.svn.core.internal.io.dav.DAVRepository.getLatestRevision(DAVRepository.java:180)
at org.tmatesoft.svn.core.internal.wc16.SVNBasicDelegate.getRevisionNumber(SVNBasicDelegate.java:480)
at org.tmatesoft.svn.core.internal.wc16.SVNBasicDelegate.getLocations(SVNBasicDelegate.java:833)
at org.tmatesoft.svn.core.internal.wc16.SVNBasicDelegate.createRepository(SVNBasicDelegate.java:527)
at org.tmatesoft.svn.core.internal.wc16.SVNUpdateClient16.doCheckout(SVNUpdateClient16.java:875)
at org.tmatesoft.svn.core.internal.wc2.old.SvnOldCheckout.run(SvnOldCheckout.java:19)
at org.tmatesoft.svn.core.internal.wc2.old.SvnOldCheckout.run(SvnOldCheckout.java:8)
at org.tmatesoft.svn.core.internal.wc2.SvnOperationRunner.run(SvnOperationRunner.java:20)
at org.tmatesoft.svn.core.wc2.SvnOperationFactory.run(SvnOperationFactory.java:1238)
at org.tmatesoft.svn.core.wc2.SvnOperation.run(SvnOperation.java:294)
at org.tmatesoft.svn.core.wc.SVNUpdateClient.doCheckout(SVNUpdateClient.java:777)
at hudson.scm.subversion.CheckoutUpdater$1.perform(CheckoutUpdater.java:99)
... 14 more
Caused by: svn: E175002: OPTIONS /repos/asf/hbase/branches/0.98 failed
at org.tmatesoft.svn.core.SVNErrorMessage.create(SVNErrorMessage.java:208)
at org.tmatesoft.svn.core.SVNErrorMessage.create(SVNErrorMessage.java:154)
at org.tmatesoft.svn.core.SVNErrorMessage.create(SVNErrorMessage.java:97)
... 33 more
Caused by: org.tmatesoft.svn.core.SVNException: svn: E175002: OPTIONS request failed on '/repos/asf/hbase/branches/0.98'
svn: E175002: timed out waiting for server
at org.tmatesoft.svn.core.internal.wc.SVNErrorManager.error(SVNErrorManager.java:64)
at org.tmatesoft.svn.core.internal.wc.SVNErrorManager.error(SVNErrorManager.java:51)
at org.tmatesoft.svn.core.internal.io.dav.http.HTTPConnection._request(HTTPConnection.java:777)
at org.tmatesoft.svn.core.internal.io.dav.http.HTTPConnection.request(HTTPConnection.java:382)
... 32 more
Caused by: svn: E175002: OPTIONS request failed on '/repos/asf/hbase/branches/0.98'
at org.tmatesoft.svn.core.SVNErrorMessage.create(SVNErrorMessage.java:208)
at org.tmatesoft.svn.core.internal.io.dav.http.HTTPConnection._request(HTTPConnection.java:775)
... 33 more
Caused by: svn: E175002: timed out waiting for server
at org.tmatesoft.svn.core.SVNErrorMessage.create(SVNErrorMessage.java:208)
at org.tmatesoft.svn.core.internal.io.dav.http.HTTPConnection._request(HTTPConnection.java:514)
... 33 more
Caused by: java.net.SocketTimeoutException: connect timed out
at java.net.PlainSocketImpl.socketConnect(Native Method)
at java.net.AbstractPlainSocketImpl.doConnect(AbstractPlainSocketImpl.java:327)
at java.net.AbstractPlainSocketImpl.connectToAddress(AbstractPlainSocketImpl.java:193)
at java.net.AbstractPlainSocketImpl.connect(AbstractPlainSocketImpl.java:180)
at java.net.SocksSocketImpl.connect(SocksSocketImpl.java:385)
at java.net.Socket.connect(Socket.java:546)
at sun.security.ssl.SSLSocketImpl.connect(SSLSocketImpl.java:590)
at org.tmatesoft.svn.core.internal.util.SVNSocketConnection.run(SVNSocketConnection.java:57)
at java.util.concurrent.Executors$RunnableAdapter.call(Executors.java:471)
... 5 more
Retrying after 10 seconds
Cleaning local Directory 0.98
Checking out https://svn.apache.org/repos/asf/hbase/branches/0.98 at revision '2013-12-21T23:34:42.177 +0000'
ERROR: Failed to check out https://svn.apache.org/repos/asf/hbase/branches/0.98
org.tmatesoft.svn.core.SVNException: svn: E175002: OPTIONS /repos/asf/hbase/branches/0.98 failed
at org.tmatesoft.svn.core.internal.io.dav.http.HTTPConnection.request(HTTPConnection.java:388)
at org.tmatesoft.svn.core.internal.io.dav.http.HTTPConnection.request(HTTPConnection.java:373)
at org.tmatesoft.svn.core.internal.io.dav.http.HTTPConnection.request(HTTPConnection.java:361)
at org.tmatesoft.svn.core.internal.io.dav.DAVConnection.performHttpRequest(DAVConnection.java:707)
at org.tmatesoft.svn.core.internal.io.dav.DAVConnection.exchangeCapabilities(DAVConnection.java:627)
at org.tmatesoft.svn.core.internal.io.dav.DAVConnection.open(DAVConnection.java:102)
at org.tmatesoft.svn.core.internal.io.dav.DAVRepository.openConnection(DAVRepository.java:1020)
at org.tmatesoft.svn.core.internal.io.dav.DAVRepository.getLatestRevision(DAVRepository.java:180)
at org.tmatesoft.svn.core.internal.wc16.SVNBasicDelegate.getRevisionNumber(SVNBasicDelegate.java:480)
at org.tmatesoft.svn.core.internal.wc16.SVNBasicDelegate.getLocations(SVNBasicDelegate.java:833)
at org.tmatesoft.svn.core.internal.wc16.SVNBasicDelegate.createRepository(SVNBasicDelegate.java:527)
at org.tmatesoft.svn.core.internal.wc16.SVNUpdateClient16.doCheckout(SVNUpdateClient16.java:875)
at org.tmatesoft.svn.core.internal.wc2.old.SvnOldCheckout.run(SvnOldCheckout.java:19)
at org.tmatesoft.svn.core.internal.wc2.old.SvnOldCheckout.run(SvnOldCheckout.java:8)
at org.tmatesoft.svn.core.internal.wc2.SvnOperationRunner.run(SvnOperationRunner.java:20)
at org.tmatesoft.svn.core.wc2.SvnOperationFactory.run(SvnOperationFactory.java:1238)
at org.tmatesoft.svn.core.wc2.SvnOperation.run(SvnOperation.java:294)
at org.tmatesoft.svn.core.wc.SVNUpdateClient.doCheckout(SVNUpdateClient.java:777)
at hudson.scm.subversion.CheckoutUpdater$1.perform(CheckoutUpdater.java:99)
at hudson.scm.subversion.WorkspaceUpdater$UpdateTask.delegateTo(WorkspaceUpdater.java:161)
at hudson.scm.SubversionSCM$CheckOutTask.perform(SubversionSCM.java:908)
at hudson.scm.SubversionSCM$CheckOutTask.invoke(SubversionSCM.java:889)
at hudson.scm.SubversionSCM$CheckOutTask.invoke(SubversionSCM.java:872)
at hudson.FilePath$FileCallableWrapper.call(FilePath.java:2461)
at hudson.remoting.UserRequest.perform(UserRequest.java:118)
at hudson.remoting.UserRequest.perform(UserRequest.java:48)
at hudson.remoting.Request$2.run(Request.java:328)
at hudson.remoting.InterceptingExecutorService$1.call(InterceptingExecutorService.java:72)
at java.util.concurrent.FutureTask$Sync.innerRun(FutureTask.java:334)
at java.util.concurrent.FutureTask.run(FutureTask.java:166)
at java.util.concurrent.ThreadPoolExecutor.runWorker(ThreadPoolExecutor.java:1146)
at java.util.concurrent.ThreadPoolExecutor$Worker.run(ThreadPoolExecutor.java:615)
at java.lang.Thread.run(Thread.java:679)
Caused by: svn: E175002: OPTIONS /repos/asf/hbase/branches/0.98 failed
at org.tmatesoft.svn.core.SVNErrorMessage.create(SVNErrorMessage.java:208)
at org.tmatesoft.svn.core.SVNErrorMessage.create(SVNErrorMessage.java:154)
at org.tmatesoft.svn.core.SVNErrorMessage.create(SVNErrorMessage.java:97)
... 33 more
Caused by: org.tmatesoft.svn.core.SVNException: svn: E175002: OPTIONS request failed on '/repos/asf/hbase/branches/0.98'
svn: E175002: timed out waiting for server
at org.tmatesoft.svn.core.internal.wc.SVNErrorManager.error(SVNErrorManager.java:64)
at org.tmatesoft.svn.core.internal.wc.SVNErrorManager.error(SVNErrorManager.java:51)
at org.tmatesoft.svn.core.internal.io.dav.http.HTTPConnection._request(HTTPConnection.java:777)
at org.tmatesoft.svn.core.internal.io.dav.http.HTTPConnection.request(HTTPConnection.java:382)
... 32 more
Caused by: svn: E175002: OPTIONS request failed on '/repos/asf/hbase/branches/0.98'
at org.tmatesoft.svn.core.SVNErrorMessage.create(SVNErrorMessage.java:208)
at org.tmatesoft.svn.core.internal.io.dav.http.HTTPConnection._request(HTTPConnection.java:775)
... 33 more
Caused by: svn: E175002: timed out waiting for server
at org.tmatesoft.svn.core.SVNErrorMessage.create(SVNErrorMessage.java:208)
at org.tmatesoft.svn.core.internal.io.dav.http.HTTPConnection._request(HTTPConnection.java:514)
... 33 more
Caused by: java.net.SocketTimeoutException: connect timed out
at java.net.PlainSocketImpl.socketConnect(Native Method)
at java.net.AbstractPlainSocketImpl.doConnect(AbstractPlainSocketImpl.java:327)
at java.net.AbstractPlainSocketImpl.connectToAddress(AbstractPlainSocketImpl.java:193)
at java.net.AbstractPlainSocketImpl.connect(AbstractPlainSocketImpl.java:180)
at java.net.SocksSocketImpl.connect(SocksSocketImpl.java:385)
at java.net.Socket.connect(Socket.java:546)
at sun.security.ssl.SSLSocketImpl.connect(SSLSocketImpl.java:590)
at org.tmatesoft.svn.core.internal.util.SVNSocketConnection.run(SVNSocketConnection.java:57)
at java.util.concurrent.Executors$RunnableAdapter.call(Executors.java:471)
... 5 more
java.io.IOException: remote file operation failed: <https://builds.apache.org/job/HBase-0.98/ws/> at hudson.remoting.Channel@7eae9ae2:ubuntu5
at hudson.FilePath.act(FilePath.java:910)
at hudson.FilePath.act(FilePath.java:887)
at hudson.scm.SubversionSCM.checkout(SubversionSCM.java:848)
at hudson.scm.SubversionSCM.checkout(SubversionSCM.java:786)
at hudson.model.AbstractProject.checkout(AbstractProject.java:1414)
at hudson.model.AbstractBuild$AbstractBuildExecution.defaultCheckout(AbstractBuild.java:652)
at jenkins.scm.SCMCheckoutStrategy.checkout(SCMCheckoutStrategy.java:88)
at hudson.model.AbstractBuild$AbstractBuildExecution.run(AbstractBuild.java:561)
at hudson.model.Run.execute(Run.java:1677)
at hudson.model.FreeStyleBuild.run(FreeStyleBuild.java:46)
at hudson.model.ResourceController.execute(ResourceController.java:88)
at hudson.model.Executor.run(Executor.java:231)
Caused by: java.io.IOException: Failed to check out https://svn.apache.org/repos/asf/hbase/branches/0.98
at hudson.scm.subversion.CheckoutUpdater$1.perform(CheckoutUpdater.java:110)
at hudson.scm.subversion.WorkspaceUpdater$UpdateTask.delegateTo(WorkspaceUpdater.java:161)
at hudson.scm.SubversionSCM$CheckOutTask.perform(SubversionSCM.java:908)
at hudson.scm.SubversionSCM$CheckOutTask.invoke(SubversionSCM.java:889)
at hudson.scm.SubversionSCM$CheckOutTask.invoke(SubversionSCM.java:872)
at hudson.FilePath$FileCallableWrapper.call(FilePath.java:2461)
at hudson.remoting.UserRequest.perform(UserRequest.java:118)
at hudson.remoting.UserRequest.perform(UserRequest.java:48)
at hudson.remoting.Request$2.run(Request.java:328)
at hudson.remoting.InterceptingExecutorService$1.call(InterceptingExecutorService.java:72)
at java.util.concurrent.FutureTask$Sync.innerRun(FutureTask.java:334)
at java.util.concurrent.FutureTask.run(FutureTask.java:166)
at java.util.concurrent.ThreadPoolExecutor.runWorker(ThreadPoolExecutor.java:1146)
at java.util.concurrent.ThreadPoolExecutor$Worker.run(ThreadPoolExecutor.java:615)
at java.lang.Thread.run(Thread.java:679)
Caused by: org.tmatesoft.svn.core.SVNException: svn: E175002: OPTIONS /repos/asf/hbase/branches/0.98 failed
at org.tmatesoft.svn.core.internal.io.dav.http.HTTPConnection.request(HTTPConnection.java:388)
at org.tmatesoft.svn.core.internal.io.dav.http.HTTPConnection.request(HTTPConnection.java:373)
at org.tmatesoft.svn.core.internal.io.dav.http.HTTPConnection.request(HTTPConnection.java:361)
at org.tmatesoft.svn.core.internal.io.dav.DAVConnection.performHttpRequest(DAVConnection.java:707)
at org.tmatesoft.svn.core.internal.io.dav.DAVConnection.exchangeCapabilities(DAVConnection.java:627)
at org.tmatesoft.svn.core.internal.io.dav.DAVConnection.open(DAVConnection.java:102)
at org.tmatesoft.svn.core.internal.io.dav.DAVRepository.openConnection(DAVRepository.java:1020)
at org.tmatesoft.svn.core.internal.io.dav.DAVRepository.getLatestRevision(DAVRepository.java:180)
at org.tmatesoft.svn.core.internal.wc16.SVNBasicDelegate.getRevisionNumber(SVNBasicDelegate.java:480)
at org.tmatesoft.svn.core.internal.wc16.SVNBasicDelegate.getLocations(SVNBasicDelegate.java:833)
at org.tmatesoft.svn.core.internal.wc16.SVNBasicDelegate.createRepository(SVNBasicDelegate.java:527)
at org.tmatesoft.svn.core.internal.wc16.SVNUpdateClient16.doCheckout(SVNUpdateClient16.java:875)
at org.tmatesoft.svn.core.internal.wc2.old.SvnOldCheckout.run(SvnOldCheckout.java:19)
at org.tmatesoft.svn.core.internal.wc2.old.SvnOldCheckout.run(SvnOldCheckout.java:8)
at org.tmatesoft.svn.core.internal.wc2.SvnOperationRunner.run(SvnOperationRunner.java:20)
at org.tmatesoft.svn.core.wc2.SvnOperationFactory.run(SvnOperationFactory.java:1238)
at org.tmatesoft.svn.core.wc2.SvnOperation.run(SvnOperation.java:294)
at org.tmatesoft.svn.core.wc.SVNUpdateClient.doCheckout(SVNUpdateClient.java:777)
at hudson.scm.subversion.CheckoutUpdater$1.perform(CheckoutUpdater.java:99)
... 14 more
Caused by: svn: E175002: OPTIONS /repos/asf/hbase/branches/0.98 failed
at org.tmatesoft.svn.core.SVNErrorMessage.create(SVNErrorMessage.java:208)
at org.tmatesoft.svn.core.SVNErrorMessage.create(SVNErrorMessage.java:154)
at org.tmatesoft.svn.core.SVNErrorMessage.create(SVNErrorMessage.java:97)
... 33 more
Caused by: org.tmatesoft.svn.core.SVNException: svn: E175002: OPTIONS request failed on '/repos/asf/hbase/branches/0.98'
svn: E175002: timed out waiting for server
at org.tmatesoft.svn.core.internal.wc.SVNErrorManager.error(SVNErrorManager.java:64)
at org.tmatesoft.svn.core.internal.wc.SVNErrorManager.error(SVNErrorManager.java:51)
at org.tmatesoft.svn.core.internal.io.dav.http.HTTPConnection._request(HTTPConnection.java:777)
at org.tmatesoft.svn.core.internal.io.dav.http.HTTPConnection.request(HTTPConnection.java:382)
... 32 more
Caused by: svn: E175002: OPTIONS request failed on '/repos/asf/hbase/branches/0.98'
at org.tmatesoft.svn.core.SVNErrorMessage.create(SVNErrorMessage.java:208)
at org.tmatesoft.svn.core.internal.io.dav.http.HTTPConnection._request(HTTPConnection.java:775)
... 33 more
Caused by: svn: E175002: timed out waiting for server
at org.tmatesoft.svn.core.SVNErrorMessage.create(SVNErrorMessage.java:208)
at org.tmatesoft.svn.core.internal.io.dav.http.HTTPConnection._request(HTTPConnection.java:514)
... 33 more
Caused by: java.net.SocketTimeoutException: connect timed out
at java.net.PlainSocketImpl.socketConnect(Native Method)
at java.net.AbstractPlainSocketImpl.doConnect(AbstractPlainSocketImpl.java:327)
at java.net.AbstractPlainSocketImpl.connectToAddress(AbstractPlainSocketImpl.java:193)
at java.net.AbstractPlainSocketImpl.connect(AbstractPlainSocketImpl.java:180)
at java.net.SocksSocketImpl.connect(SocksSocketImpl.java:385)
at java.net.Socket.connect(Socket.java:546)
at sun.security.ssl.SSLSocketImpl.connect(SSLSocketImpl.java:590)
at org.tmatesoft.svn.core.internal.util.SVNSocketConnection.run(SVNSocketConnection.java:57)
at java.util.concurrent.Executors$RunnableAdapter.call(Executors.java:471)
... 5 more
Performing Post build task...
Match found for :.* : True
Logical operation result is TRUE
Running script : ZOMBIE_TESTS_COUNT=`jps | grep surefirebooter | wc -l`
if [[ $ZOMBIE_TESTS_COUNT != 0 ]] ; then
#It seems sometimes the tests are not dying immediately. Let's give them 10s
echo "Suspicious java process found - waiting 10s to see if there are just slow to stop"
sleep 10
ZOMBIE_TESTS_COUNT=`jps | grep surefirebooter | wc -l`
if [[ $ZOMBIE_TESTS_COUNT != 0 ]] ; then
echo "There are $ZOMBIE_TESTS_COUNT zombie tests, they should have been killed by surefire but survived"
echo "************ BEGIN zombies jstack extract"
ZB_STACK=`jps | grep surefirebooter | cut -d ' ' -f 1 | xargs -n 1 jstack | grep ".test" | grep "\.java"`
jps | grep surefirebooter | cut -d ' ' -f 1 | xargs -n 1 jstack
echo "************ END zombies jstack extract"
JIRA_COMMENT="$JIRA_COMMENT
{color:red}-1 core zombie tests{color}. There are ${ZOMBIE_TESTS_COUNT} zombie test(s): ${ZB_STACK}"
BAD=1
jps | grep surefirebooter | cut -d ' ' -f 1 | xargs kill -9
else
echo "We're ok: there is no zombie test, but some tests took some time to stop"
fi
else
echo "We're ok: there is no zombie test"
fi
[HBase-0.98] $ /bin/bash -xe /tmp/hudson564350372161825401.sh
++ jps
++ grep surefirebooter
++ wc -l
+ ZOMBIE_TESTS_COUNT=0
+ [[ 0 != 0 ]]
+ echo 'We'\''re ok: there is no zombie test'
We're ok: there is no zombie test
POST BUILD TASK : SUCCESS
END OF POST BUILD TASK : 0
Archiving artifacts
Recording test results