You are viewing a plain text version of this content. The canonical link for it is here.
Posted to yarn-dev@hadoop.apache.org by Apache Jenkins Server <je...@builds.apache.org> on 2015/07/06 17:20:21 UTC

Failed: YARN-3884 PreCommit Build #8441

Jira: https://issues.apache.org/jira/browse/YARN-3884
Build: https://builds.apache.org/job/PreCommit-YARN-Build/8441/

###################################################################################
########################## LAST 60 LINES OF THE CONSOLE ###########################
Started by remote host 0:0:0:0:0:0:0:1
Building remotely on H8 (Mapreduce Falcon Hadoop Pig Zookeeper Tez Hdfs) in workspace /home/jenkins/jenkins-slave/workspace/PreCommit-YARN-Build
 > git rev-parse --is-inside-work-tree # timeout=10
Fetching changes from the remote Git repository
 > git config remote.origin.url https://git-wip-us.apache.org/repos/asf/hadoop.git # timeout=10
Fetching upstream changes from https://git-wip-us.apache.org/repos/asf/hadoop.git
 > git --version # timeout=10
 > git fetch --tags --progress https://git-wip-us.apache.org/repos/asf/hadoop.git +refs/heads/*:refs/remotes/origin/*
 > git rev-parse refs/remotes/origin/trunk^{commit} # timeout=10
 > git rev-parse refs/remotes/origin/origin/trunk^{commit} # timeout=10
Checking out Revision fc92d3e6515a391847cb6170244b3d911712d96a (refs/remotes/origin/trunk)
 > git config core.sparsecheckout # timeout=10
 > git checkout -f fc92d3e6515a391847cb6170244b3d911712d96a
 > git rev-list fc92d3e6515a391847cb6170244b3d911712d96a # timeout=10
Cleaning workspace
 > git rev-parse --verify HEAD # timeout=10
Resetting working tree
 > git reset --hard # timeout=10
 > git clean -fdx # timeout=10
No emails were triggered.
[PreCommit-YARN-Build] $ /bin/bash /tmp/hudson1755144455182811156.sh


============================================================================
============================================================================
                        Bootstrapping test harness
============================================================================
============================================================================


Running in Jenkins mode
YARN-3884 patch is being downloaded at Mon Jul  6 15:20:25 UTC 2015 from
http://issues.apache.org/jira/secure/attachment/12743724/Test%20Result-Container%20status.jpg
ERROR: http://issues.apache.org/jira/secure/attachment/12743724/Test%20Result-Container%20status.jpg is not a patch file.


============================================================================
============================================================================
                              Finished build.
============================================================================
============================================================================


Build step 'Execute shell' marked build as failure
Archiving artifacts
Sending artifact delta relative to PreCommit-YARN-Build #8432
Archived 2 artifacts
Archive block size is 32768
Received 0 blocks and 83882 bytes
Compression is 0.0%
Took 0.23 sec
[description-setter] Could not determine description.
Recording test results
Email was triggered for: Failure
Sending email for trigger: Failure



###################################################################################
############################## FAILED TESTS (if any) ##############################
No tests ran.

Success: YARN-3445 PreCommit Build #8445

Posted by Apache Jenkins Server <je...@builds.apache.org>.
Jira: https://issues.apache.org/jira/browse/YARN-3445
Build: https://builds.apache.org/job/PreCommit-YARN-Build/8445/

###################################################################################
########################## LAST 60 LINES OF THE CONSOLE ###########################
[...truncated 312 lines...]
|      |                        |            | release audit warnings.
|  +1  |            checkstyle  |  1m 10s    | There were no new checkstyle 
|      |                        |            | issues.
|  +1  |            whitespace  |  0m 0s     | The patch has no lines that end 
|      |                        |            | in whitespace.
|  +1  |               install  |  1m 57s    | mvn install still works. 
|  +1  |       eclipse:eclipse  |  0m 38s    | The patch built with 
|      |                        |            | eclipse:eclipse.
|  +1  |              findbugs  |  2m 46s    | The patch does not introduce any 
|      |                        |            | new Findbugs (version 3.0.0)
|      |                        |            | warnings.
|  +1  |    tools/hadoop tests  |  0m 55s    | Tests passed in hadoop-sls. 
|  +1  |            yarn tests  |  53m 32s   | Tests passed in 
|      |                        |            | hadoop-yarn-server-resourcemanager
|      |                        |            | .
|      |                        |  98m 56s   | 


|| Subsystem || Report/Notes ||
============================================================================
| Patch URL | http://issues.apache.org/jira/secure/attachment/12743748/YARN-3445-v4.1.patch |
| Optional Tests | javadoc javac unit findbugs checkstyle |
| git revision | trunk / bf89ddb |
| hadoop-sls test log | /home/jenkins/jenkins-slave/workspace/PreCommit-YARN-Build/patchprocess/testrun_hadoop-sls.txt |
| hadoop-yarn-server-resourcemanager test log | /home/jenkins/jenkins-slave/workspace/PreCommit-YARN-Build/patchprocess/testrun_hadoop-yarn-server-resourcemanager.txt |
| Test Results | https://builds.apache.org/job/PreCommit-YARN-Build/8445/testReport/ |
| Java | 1.7.0_55 |
| uname | Linux asf908.gq1.ygridcore.net 3.13.0-36-lowlatency #63-Ubuntu SMP PREEMPT Wed Sep 3 21:56:12 UTC 2014 x86_64 x86_64 x86_64 GNU/Linux |


============================================================================
============================================================================
                          Adding comment to JIRA
============================================================================
============================================================================


Comment added.
030313a783747b888598fac66d68db8e3be924a8 logged out


============================================================================
============================================================================
                              Finished build.
============================================================================
============================================================================


Archiving artifacts
Sending artifact delta relative to PreCommit-YARN-Build #8432
Archived 43 artifacts
Archive block size is 32768
Received 220 blocks and 6135412 bytes
Compression is 54.0%
Took 2.1 sec
Description set: YARN-3445
Recording test results
Email was triggered for: Success
Sending email for trigger: Success



###################################################################################
############################## FAILED TESTS (if any) ##############################
All tests passed

Failed: YARN-3047 PreCommit Build #8444

Posted by Apache Jenkins Server <je...@builds.apache.org>.
Jira: https://issues.apache.org/jira/browse/YARN-3047
Build: https://builds.apache.org/job/PreCommit-YARN-Build/8444/

###################################################################################
########################## LAST 60 LINES OF THE CONSOLE ###########################
[...truncated 414 lines...]
|  +1  |         whitespace  |  0m 0s     | The patch has no lines that end in 
|      |                     |            | whitespace.
|  +1  |            install  |  1m 41s    | mvn install still works. 
|  +1  |    eclipse:eclipse  |  0m 39s    | The patch built with 
|      |                     |            | eclipse:eclipse.
|  +1  |           findbugs  |  3m 55s    | The patch does not introduce any 
|      |                     |            | new Findbugs (version 3.0.0)
|      |                     |            | warnings.
|  +1  |         yarn tests  |  0m 26s    | Tests passed in hadoop-yarn-api. 
|  +1  |         yarn tests  |  1m 58s    | Tests passed in hadoop-yarn-common. 
|  +1  |         yarn tests  |  1m 21s    | Tests passed in 
|      |                     |            | hadoop-yarn-server-timelineservice.
|      |                     |  53m 16s   | 


|| Subsystem || Report/Notes ||
============================================================================
| Patch URL | http://issues.apache.org/jira/secure/attachment/12743359/YARN-3047-YARN-2928.10.patch |
| Optional Tests | shellcheck javadoc javac unit findbugs checkstyle |
| git revision | YARN-2928 / 6837552 |
| checkstyle |  /home/jenkins/jenkins-slave/workspace/PreCommit-YARN-Build/patchprocess/diffcheckstylehadoop-yarn-api.txt |
| hadoop-yarn-api test log | /home/jenkins/jenkins-slave/workspace/PreCommit-YARN-Build/patchprocess/testrun_hadoop-yarn-api.txt |
| hadoop-yarn-common test log | /home/jenkins/jenkins-slave/workspace/PreCommit-YARN-Build/patchprocess/testrun_hadoop-yarn-common.txt |
| hadoop-yarn-server-timelineservice test log | /home/jenkins/jenkins-slave/workspace/PreCommit-YARN-Build/patchprocess/testrun_hadoop-yarn-server-timelineservice.txt |
| Test Results | https://builds.apache.org/job/PreCommit-YARN-Build/8444/testReport/ |
| Java | 1.7.0_55 |
| uname | Linux asf908.gq1.ygridcore.net 3.13.0-36-lowlatency #63-Ubuntu SMP PREEMPT Wed Sep 3 21:56:12 UTC 2014 x86_64 x86_64 x86_64 GNU/Linux |


============================================================================
============================================================================
                          Adding comment to JIRA
============================================================================
============================================================================


Comment added.
d1e40be5d8e9af32c63aa1fc1e58bb056f248a6d logged out


============================================================================
============================================================================
                              Finished build.
============================================================================
============================================================================


Build step 'Execute shell' marked build as failure
Archiving artifacts
Sending artifact delta relative to PreCommit-YARN-Build #8432
Archived 54 artifacts
Archive block size is 32768
Received 161 blocks and 23387583 bytes
Compression is 18.4%
Took 5 sec
[description-setter] Could not determine description.
Recording test results
Email was triggered for: Failure
Sending email for trigger: Failure



###################################################################################
############################## FAILED TESTS (if any) ##############################
All tests passed

Failed: YARN-3051 PreCommit Build #8443

Posted by Apache Jenkins Server <je...@builds.apache.org>.
Jira: https://issues.apache.org/jira/browse/YARN-3051
Build: https://builds.apache.org/job/PreCommit-YARN-Build/8443/

###################################################################################
########################## LAST 60 LINES OF THE CONSOLE ###########################
[...truncated 314 lines...]
|      |                     |            | warnings.
|  +1  |         checkstyle  |  1m 22s    | There were no new checkstyle 
|      |                     |            | issues.
|  +1  |         whitespace  |  0m 0s     | The patch has no lines that end in 
|      |                     |            | whitespace.
|  +1  |            install  |  1m 48s    | mvn install still works. 
|  +1  |    eclipse:eclipse  |  0m 46s    | The patch built with 
|      |                     |            | eclipse:eclipse.
|  +1  |           findbugs  |  2m 31s    | The patch does not introduce any 
|      |                     |            | new Findbugs (version 3.0.0)
|      |                     |            | warnings.
|  +1  |         yarn tests  |  0m 25s    | Tests passed in hadoop-yarn-api. 
|  +1  |         yarn tests  |  1m 21s    | Tests passed in 
|      |                     |            | hadoop-yarn-server-timelineservice.
|      |                     |  46m 23s   | 


|| Subsystem || Report/Notes ||
============================================================================
| Patch URL | http://issues.apache.org/jira/secure/attachment/12743797/YARN-3051-YARN-2928.08.patch |
| Optional Tests | javadoc javac unit findbugs checkstyle |
| git revision | YARN-2928 / 6837552 |
| hadoop-yarn-api test log | /home/jenkins/jenkins-slave/workspace/PreCommit-YARN-Build/patchprocess/testrun_hadoop-yarn-api.txt |
| hadoop-yarn-server-timelineservice test log | /home/jenkins/jenkins-slave/workspace/PreCommit-YARN-Build/patchprocess/testrun_hadoop-yarn-server-timelineservice.txt |
| Test Results | https://builds.apache.org/job/PreCommit-YARN-Build/8443/testReport/ |
| Java | 1.7.0_55 |
| uname | Linux asf902.gq1.ygridcore.net 3.13.0-36-lowlatency #63-Ubuntu SMP PREEMPT Wed Sep 3 21:56:12 UTC 2014 x86_64 x86_64 x86_64 GNU/Linux |


============================================================================
============================================================================
                          Adding comment to JIRA
============================================================================
============================================================================


Comment added.
8914eaa4d1f57b2d9cf4e6a148fec9819ff33053 logged out


============================================================================
============================================================================
                              Finished build.
============================================================================
============================================================================


Build step 'Execute shell' marked build as failure
Archiving artifacts
Sending artifact delta relative to PreCommit-YARN-Build #8432
Archived 41 artifacts
Archive block size is 32768
Received 35 blocks and 27559697 bytes
Compression is 4.0%
Took 5.8 sec
[description-setter] Could not determine description.
Recording test results
Email was triggered for: Failure
Sending email for trigger: Failure



###################################################################################
############################## FAILED TESTS (if any) ##############################
All tests passed

Failed: YARN-3445 PreCommit Build #8442

Posted by Apache Jenkins Server <je...@builds.apache.org>.
Jira: https://issues.apache.org/jira/browse/YARN-3445
Build: https://builds.apache.org/job/PreCommit-YARN-Build/8442/

###################################################################################
########################## LAST 60 LINES OF THE CONSOLE ###########################
[...truncated 317 lines...]
|  +1  |               install  |  1m 57s    | mvn install still works. 
|  +1  |       eclipse:eclipse  |  0m 39s    | The patch built with 
|      |                        |            | eclipse:eclipse.
|  +1  |              findbugs  |  2m 52s    | The patch does not introduce any 
|      |                        |            | new Findbugs (version 3.0.0)
|      |                        |            | warnings.
|  +1  |    tools/hadoop tests  |  0m 57s    | Tests passed in hadoop-sls. 
|  -1  |            yarn tests  |  54m 46s   | Tests failed in 
|      |                        |            | hadoop-yarn-server-resourcemanager
|      |                        |            | .
|      |                        |  98m 4s    | 


             Reason | Tests
 Failed unit tests  |  hadoop.yarn.server.resourcemanager.metrics.TestSystemMetricsPublisher 


|| Subsystem || Report/Notes ||
============================================================================
| Patch URL | http://issues.apache.org/jira/secure/attachment/12743748/YARN-3445-v4.1.patch |
| Optional Tests | javadoc javac unit findbugs checkstyle |
| git revision | trunk / fc92d3e |
| hadoop-sls test log | /home/jenkins/jenkins-slave/workspace/PreCommit-YARN-Build/patchprocess/testrun_hadoop-sls.txt |
| hadoop-yarn-server-resourcemanager test log | /home/jenkins/jenkins-slave/workspace/PreCommit-YARN-Build/patchprocess/testrun_hadoop-yarn-server-resourcemanager.txt |
| Test Results | https://builds.apache.org/job/PreCommit-YARN-Build/8442/testReport/ |
| Java | 1.7.0_55 |
| uname | Linux asf908.gq1.ygridcore.net 3.13.0-36-lowlatency #63-Ubuntu SMP PREEMPT Wed Sep 3 21:56:12 UTC 2014 x86_64 x86_64 x86_64 GNU/Linux |


============================================================================
============================================================================
                          Adding comment to JIRA
============================================================================
============================================================================


Comment added.
3a7b356cd2a81b41ed931805618cf49730008ff4 logged out


============================================================================
============================================================================
                              Finished build.
============================================================================
============================================================================


Build step 'Execute shell' marked build as failure
Archiving artifacts
Sending artifact delta relative to PreCommit-YARN-Build #8432
Archived 43 artifacts
Archive block size is 32768
Received 225 blocks and 5948414 bytes
Compression is 55.3%
Took 2 sec
[description-setter] Could not determine description.
Recording test results
Email was triggered for: Failure
Sending email for trigger: Failure



###################################################################################
############################## FAILED TESTS (if any) ##############################
1 tests failed.
REGRESSION:  org.apache.hadoop.yarn.server.resourcemanager.metrics.TestSystemMetricsPublisher.testPublishAppAttemptMetrics

Error Message:
null

Stack Trace:
java.lang.AssertionError: null
	at org.junit.Assert.fail(Assert.java:86)
	at org.junit.Assert.assertTrue(Assert.java:41)
	at org.junit.Assert.assertTrue(Assert.java:52)
	at org.apache.hadoop.yarn.server.resourcemanager.metrics.TestSystemMetricsPublisher.testPublishAppAttemptMetrics(TestSystemMetricsPublisher.java:267)