You are viewing a plain text version of this content. The canonical link for it is here.
Posted to notifications@logging.apache.org by Apache Jenkins Server <je...@builds.apache.org> on 2018/05/08 17:11:19 UTC
Build failed in Jenkins: logging-log4net » feature/cd-pipeline #193
See <https://builds.apache.org/job/logging-log4net/job/feature%252Fcd-pipeline/193/display/redirect>
------------------------------------------
Branch indexing
Connecting to https://api.github.com using dpsenner/****** (dpsenner at github)
Obtained Jenkinsfile from c5c984e2fd4bb63cb82ac48dc89b1bb4a985da97
Running in Durability level: MAX_SURVIVABILITY
[Pipeline] node
Still waiting to schedule task
H32 is offline; H8 doesn’t have label ubuntu; Jenkins doesn’t have label ubuntu; arm1 doesn’t have label ubuntu; beam10 doesn’t have label ubuntu; beam11 doesn’t have label ubuntu; beam12 doesn’t have label ubuntu; beam13 doesn’t have label ubuntu; beam14 doesn’t have label ubuntu; beam15 doesn’t have label ubuntu; beam16 doesn’t have label ubuntu; beam17 doesn’t have label ubuntu; beam18 doesn’t have label ubuntu; beam19 doesn’t have label ubuntu; beam2 doesn’t have label ubuntu; beam20 doesn’t have label ubuntu; beam21 doesn’t have label ubuntu; beam22 doesn’t have label ubuntu; beam23 doesn’t have label ubuntu; beam24 doesn’t have label ubuntu; beam4 doesn’t have label ubuntu; beam5 doesn’t have label ubuntu; beam6 doesn’t have label ubuntu; beam7 doesn’t have label ubuntu; beam8 doesn’t have label ubuntu; beam9 doesn’t have label ubuntu; cassandra1 doesn’t have label ubuntu; cassandra10 doesn’t have label ubuntu; cassandra11 doesn’t have label ubuntu; cassandra12 doesn’t have label ubuntu; cassandra13 doesn’t have label ubuntu; cassandra14 doesn’t have label ubuntu; cassandra15 doesn’t have label ubuntu; cassandra16 doesn’t have label ubuntu; cassandra2 doesn’t have label ubuntu; cassandra3 doesn’t have label ubuntu; cassandra4 doesn’t have label ubuntu; cassandra5 doesn’t have label ubuntu; cassandra6 doesn’t have label ubuntu; cassandra7 doesn’t have label ubuntu; cassandra8 doesn’t have label ubuntu; cassandra9 doesn’t have label ubuntu; couchdb-freebsd1 doesn’t have label ubuntu; couchdb-macos1 doesn’t have label ubuntu; hadoop-ppc64le-1 doesn’t have label ubuntu; hadoop-win1 doesn’t have label ubuntu; plc4x1 doesn’t have label ubuntu; tapestry doesn’t have label ubuntu; ubuntu-1 is offline; ubuntu-2 is offline; ubuntu-eu2 is offline; ubuntu-eu3 is offline; ubuntu-ppc64le doesn’t have label ubuntu; ubuntu-us1 is offline; windows-2012-1 doesn’t have label ubuntu; windows-2012-3 doesn’t have label ubuntu
Running on H23 in /home/jenkins/jenkins-slave/workspace/log4net_feature_cd-pipeline-76KUCPODUF6LCE45226EBUR4GNVLYPMYVC23Z4ITBOMNJT3CA2WA
[Pipeline] {
[Pipeline] timeout
Timeout set to expire in 4 hr 0 min
[Pipeline] {
[Pipeline] stage
[Pipeline] { (checkout)
[Pipeline] deleteDir
[Pipeline] checkout
Cloning the remote Git repository
Cloning with configured refspecs honoured and without tags
Cloning repository https://github.com/apache/logging-log4net.git
> git init /home/jenkins/jenkins-slave/workspace/log4net_feature_cd-pipeline-76KUCPODUF6LCE45226EBUR4GNVLYPMYVC23Z4ITBOMNJT3CA2WA # timeout=10
Fetching upstream changes from https://github.com/apache/logging-log4net.git
> git --version # timeout=10
using GIT_ASKPASS to set credentials dpsenner at github
> git fetch --no-tags --progress https://github.com/apache/logging-log4net.git +refs/heads/feature/cd-pipeline:refs/remotes/origin/feature/cd-pipeline
> git config remote.origin.url https://github.com/apache/logging-log4net.git # timeout=10
> git config --add remote.origin.fetch +refs/heads/feature/cd-pipeline:refs/remotes/origin/feature/cd-pipeline # timeout=10
> git config remote.origin.url https://github.com/apache/logging-log4net.git # timeout=10
Fetching without tags
Fetching upstream changes from https://github.com/apache/logging-log4net.git
using GIT_ASKPASS to set credentials dpsenner at github
> git fetch --no-tags --progress https://github.com/apache/logging-log4net.git +refs/heads/feature/cd-pipeline:refs/remotes/origin/feature/cd-pipeline
Checking out Revision c5c984e2fd4bb63cb82ac48dc89b1bb4a985da97 (feature/cd-pipeline)
> git config core.sparsecheckout # timeout=10
> git checkout -f c5c984e2fd4bb63cb82ac48dc89b1bb4a985da97
Commit message: "Bump netstandard-1.3 builder to be based on the docker dotnet:2.0-sdk"
> git rev-list --no-walk 933cf8a9705884b53bcf84b836917d270ffdd5c8 # timeout=10
[Pipeline] }
[Pipeline] // stage
[Pipeline] stage
[Pipeline] { (build netstandard-1.3)
[Pipeline] script
[Pipeline] {
[Pipeline] checkout
> git rev-parse --is-inside-work-tree # timeout=10
Fetching changes from the remote Git repository
> git config remote.origin.url https://github.com/apache/logging-log4net.git # timeout=10
Fetching without tags
Fetching upstream changes from https://github.com/apache/logging-log4net.git
> git --version # timeout=10
using GIT_ASKPASS to set credentials dpsenner at github
> git fetch --no-tags --progress https://github.com/apache/logging-log4net.git +refs/heads/feature/cd-pipeline:refs/remotes/origin/feature/cd-pipeline
Checking out Revision c5c984e2fd4bb63cb82ac48dc89b1bb4a985da97 (feature/cd-pipeline)
> git config core.sparsecheckout # timeout=10
> git checkout -f c5c984e2fd4bb63cb82ac48dc89b1bb4a985da97
Commit message: "Bump netstandard-1.3 builder to be based on the docker dotnet:2.0-sdk"
[Pipeline] sh
[log4net_feature_cd-pipeline-76KUCPODUF6LCE45226EBUR4GNVLYPMYVC23Z4ITBOMNJT3CA2WA] Running shell script
+ stat -c %u buildtools/docker/builder-netstandard-1.3
[Pipeline] sh
[log4net_feature_cd-pipeline-76KUCPODUF6LCE45226EBUR4GNVLYPMYVC23Z4ITBOMNJT3CA2WA] Running shell script
+ stat -c %g buildtools/docker/builder-netstandard-1.3
[Pipeline] sh
[log4net_feature_cd-pipeline-76KUCPODUF6LCE45226EBUR4GNVLYPMYVC23Z4ITBOMNJT3CA2WA] Running shell script
+ docker build -t builder-netstandard:latest --file buildtools/docker/builder-netstandard-1.3/Dockerfile --build-arg JENKINS_UID=910 --build-arg JENKINS_GID=910 buildtools/docker/builder-netstandard-1.3
Sending build context to Docker daemon 2.56kB
Step 1/8 : FROM microsoft/dotnet:2.0-sdk
2.0-sdk: Pulling from microsoft/dotnet
cc1a78bfd46b: Already exists
6861473222a6: Already exists
7e0b9c3b5ae0: Already exists
3ec98735f56f: Already exists
5c5570a35be0: Pulling fs layer
a541a15a1000: Pulling fs layer
e77739399a4a: Pulling fs layer
5c5570a35be0: Verifying Checksum
5c5570a35be0: Download complete
5c5570a35be0: Pull complete
a541a15a1000: Verifying Checksum
a541a15a1000: Download complete
e77739399a4a: Verifying Checksum
e77739399a4a: Download complete
a541a15a1000: Pull complete
e77739399a4a: Pull complete
Digest: sha256:d0da8067418acefe001791e6fb393e534c5b08dbb82a62678a708fc49fd840d7
Status: Downloaded newer image for microsoft/dotnet:2.0-sdk
---> a2a4cb00ae45
Step 2/8 : ARG JENKINS_UID
---> Running in dae95d05c007
---> 2618a29efeb5
Removing intermediate container dae95d05c007
Step 3/8 : ARG JENKINS_GID
---> Running in d2f2d13558c9
---> f92ed04f3a95
Removing intermediate container d2f2d13558c9
Step 4/8 : MAINTAINER "dev@logging.apache.org"
---> Running in f129e5b281ad
---> a043ec5beba5
Removing intermediate container f129e5b281ad
Step 5/8 : RUN mkdir -p /var/workspaces && chmod 0777 /var/workspaces
---> Running in 3e402e1822e7
---> d64ded44defe
Removing intermediate container 3e402e1822e7
Step 6/8 : RUN groupadd -r -g $JENKINS_GID jenkins-slave
---> Running in 05684e81aa83
---> 46861e2945e1
Removing intermediate container 05684e81aa83
Step 7/8 : RUN useradd --base-dir /var/workspaces --create-home --shell /bin/bash --uid $JENKINS_UID --gid $JENKINS_GID --groups $JENKINS_GID -p -M jenkins
---> Running in d5da61098956
---> 25ba037d0c39
Removing intermediate container d5da61098956
Step 8/8 : RUN apt-get update && apt-get install -y nant git
---> Running in 8d00c4dae966
Get:1 http://security.debian.org/debian-security stretch/updates InRelease [94.3 kB]
Ign:2 http://deb.debian.org/debian stretch InRelease
Get:3 http://deb.debian.org/debian stretch-updates InRelease [91.0 kB]
Get:4 http://deb.debian.org/debian stretch Release [118 kB]
Get:5 http://deb.debian.org/debian stretch Release.gpg [2434 B]
Get:6 http://deb.debian.org/debian stretch-updates/main amd64 Packages [12.1 kB]
Get:7 http://deb.debian.org/debian stretch/main amd64 Packages [9530 kB]
Get:8 http://security.debian.org/debian-security stretch/updates/main amd64 Packages [471 kB]
Fetched 10.3 MB in 1s (6468 kB/s)
Reading package lists...
Reading package lists...
Building dependency tree...
Reading state information...
[91mE: Unable to locate package nant
[0mThe command '/bin/sh -c apt-get update && apt-get install -y nant git' returned a non-zero code: 100
[Pipeline] }
[Pipeline] // script
[Pipeline] }
[Pipeline] // stage
[Pipeline] stage
[Pipeline] { (build net-2.0)
Stage 'build net-2.0' skipped due to earlier failure(s)
[Pipeline] }
[Pipeline] // stage
[Pipeline] stage
[Pipeline] { (build net-3.5)
Stage 'build net-3.5' skipped due to earlier failure(s)
[Pipeline] }
[Pipeline] // stage
[Pipeline] stage
[Pipeline] { (build net-3.5-cp)
Stage 'build net-3.5-cp' skipped due to earlier failure(s)
[Pipeline] }
[Pipeline] // stage
[Pipeline] stage
[Pipeline] { (build net-4.0)
Stage 'build net-4.0' skipped due to earlier failure(s)
[Pipeline] }
[Pipeline] // stage
[Pipeline] stage
[Pipeline] { (build net-4.0-cp)
Stage 'build net-4.0-cp' skipped due to earlier failure(s)
[Pipeline] }
[Pipeline] // stage
[Pipeline] stage
[Pipeline] { (build net-4.5)
Stage 'build net-4.5' skipped due to earlier failure(s)
[Pipeline] }
[Pipeline] // stage
[Pipeline] stage
[Pipeline] { (build mono-2.0)
Stage 'build mono-2.0' skipped due to earlier failure(s)
[Pipeline] }
[Pipeline] // stage
[Pipeline] stage
[Pipeline] { (build mono-3.5)
Stage 'build mono-3.5' skipped due to earlier failure(s)
[Pipeline] }
[Pipeline] // stage
[Pipeline] stage
[Pipeline] { (build mono-4.0)
Stage 'build mono-4.0' skipped due to earlier failure(s)
[Pipeline] }
[Pipeline] // stage
[Pipeline] stage
[Pipeline] { (build site)
Stage 'build site' skipped due to earlier failure(s)
[Pipeline] }
[Pipeline] // stage
[Pipeline] stage
[Pipeline] { (prepare package)
Stage 'prepare package' skipped due to earlier failure(s)
[Pipeline] }
[Pipeline] // stage
[Pipeline] stage
[Pipeline] { (check test results)
Stage 'check test results' skipped due to earlier failure(s)
[Pipeline] }
[Pipeline] // stage
[Pipeline] stage
[Pipeline] { (publish site)
Stage 'publish site' skipped due to earlier failure(s)
[Pipeline] }
[Pipeline] // stage
[Pipeline] stage
[Pipeline] { (Declarative: Post Actions)
[Pipeline] step
Build failed in Jenkins: logging-log4net » feature/cd-pipeline #209
Posted by Apache Jenkins Server <je...@builds.apache.org>.
See <https://builds.apache.org/job/logging-log4net/job/feature%252Fcd-pipeline/209/display/redirect>
------------------------------------------
[...truncated 8.01 KB...]
Step 2/8 : ARG JENKINS_UID
---> Using cache
---> d65b5107ef11
Step 3/8 : ARG JENKINS_GID
---> Using cache
---> b6020a8c63be
Step 4/8 : MAINTAINER "dev@logging.apache.org"
---> Using cache
---> e547e1e03f31
Step 5/8 : RUN mkdir -p /var/workspaces && chmod 0777 /var/workspaces
---> Using cache
---> 0381e939e8f7
Step 6/8 : RUN groupadd -r -g $JENKINS_GID jenkins-slave
---> Using cache
---> 41289c5f78d1
Step 7/8 : RUN useradd --base-dir /var/workspaces --create-home --shell /bin/bash --uid $JENKINS_UID --gid $JENKINS_GID --groups $JENKINS_GID -p -M jenkins
---> Using cache
---> 64fb4259b854
Step 8/8 : RUN apt-get update && apt-get install -y nant git
---> Using cache
---> 3f469df9b609
Successfully built 3f469df9b609
Successfully tagged builder-netstandard:latest
[Pipeline] dockerFingerprintFrom
[Pipeline] sh
[log4net_feature_cd-pipeline-76KUCPODUF6LCE45226EBUR4GNVLYPMYVC23Z4ITBOMNJT3CA2WA] Running shell script
+ docker inspect -f . builder-netstandard:latest
.
[Pipeline] withDockerContainer
H26 does not seem to be running inside a container
$ docker run -t -d -u 910:910 -w /home/jenkins/jenkins-slave/workspace/log4net_feature_cd-pipeline-76KUCPODUF6LCE45226EBUR4GNVLYPMYVC23Z4ITBOMNJT3CA2WA -v /home/jenkins/jenkins-slave/workspace/log4net_feature_cd-pipeline-76KUCPODUF6LCE45226EBUR4GNVLYPMYVC23Z4ITBOMNJT3CA2WA:/home/jenkins/jenkins-slave/workspace/log4net_feature_cd-pipeline-76KUCPODUF6LCE45226EBUR4GNVLYPMYVC23Z4ITBOMNJT3CA2WA:rw,z -v /home/jenkins/jenkins-slave/workspace/log4net_feature_cd-pipeline-76KUCPODUF6LCE45226EBUR4GNVLYPMYVC23Z4ITBOMNJT3CA2WA@tmp:/home/jenkins/jenkins-slave/workspace/log4net_feature_cd-pipeline-76KUCPODUF6LCE45226EBUR4GNVLYPMYVC23Z4ITBOMNJT3CA2WA@tmp:rw,z -e ******** -e ******** -e ******** -e ******** -e ******** -e ******** -e ******** -e ******** -e ******** -e ******** -e ******** -e ******** -e ******** -e ******** -e ******** -e ******** -e ******** -e ******** -e ******** -e ******** -e ******** -e ******** -e ******** -e ******** -e ******** -e ******** -e ******** builder-netstandard:latest cat
$ docker top 7d597f3d89b94947dd28c9a28bd85b703b2288dd6a509b48afad4db69f93fd6e -eo pid,comm
[Pipeline] {
[Pipeline] sh
[log4net_feature_cd-pipeline-76KUCPODUF6LCE45226EBUR4GNVLYPMYVC23Z4ITBOMNJT3CA2WA] Running shell script
+ nant compile-netstandard-1.3
NAnt 0.92 (Build 0.92.4526.0; rc1; 05/23/2012)
Copyright (C) 2001-2012 Gerry Shaw
http://nant.sourceforge.net
Buildfile: file:///home/jenkins/jenkins-slave/workspace/log4net_feature_cd-pipeline-76KUCPODUF6LCE45226EBUR4GNVLYPMYVC23Z4ITBOMNJT3CA2WA/log4net.build
Target framework: Mono 4.0 Profile
Target(s) specified: compile-netstandard-1.3
check-current-build-config:
set-build-configuration:
set-debug-build-configuration:
check-current-build-config:
set-build-configuration-flags:
compile-netstandard-1.3:
set-debug-build-configuration:
check-current-build-config:
set-build-configuration-flags:
compile-netstandard-1.3-current-configuration:
[echo] dotnet --version
[exec] 2.1.200
[echo] dotnet restore log4net.netstandard.sln
[exec]
[exec] Welcome to .NET Core!
[exec] ---------------------
[exec] Learn more about .NET Core @ https://aka.ms/dotnet-docs. Use dotnet --help to see available commands or go to https://aka.ms/dotnet-cli-docs.
[exec]
[exec] Telemetry
[exec] --------------
[exec] The .NET Core tools collect usage data in order to improve your experience. The data is anonymous and does not include command-line arguments. The data is collected by Microsoft and shared with the community.
[exec] You can opt out of telemetry by setting a DOTNET_CLI_TELEMETRY_OPTOUT environment variable to 1 using your favorite shell.
[exec] You can read more about .NET Core tools telemetry @ https://aka.ms/dotnet-cli-telemetry.
[exec] Restoring packages for /home/jenkins/jenkins-slave/workspace/log4net_feature_cd-pipeline-76KUCPODUF6LCE45226EBUR4GNVLYPMYVC23Z4ITBOMNJT3CA2WA/netstandard/1.3/log4net.tests/log4net.tests.csproj...
[exec] Restoring packages for /home/jenkins/jenkins-slave/workspace/log4net_feature_cd-pipeline-76KUCPODUF6LCE45226EBUR4GNVLYPMYVC23Z4ITBOMNJT3CA2WA/netstandard/1.3/log4net/log4net.csproj...
[exec] Installing System.Security.Claims 4.0.1.
[exec] Installing System.Security.Principal.Windows 4.0.0.
[exec] Installing System.Net.WebHeaderCollection 4.0.1.
[exec] Installing System.Net.NameResolution 4.0.0.
[exec] Installing System.Net.Requests 4.0.11.
[exec] Installing System.Diagnostics.StackTrace 4.0.1.
[exec] Installing System.IO.FileSystem.Watcher 4.0.0.
[exec] Generating MSBuild file /home/jenkins/jenkins-slave/workspace/log4net_feature_cd-pipeline-76KUCPODUF6LCE45226EBUR4GNVLYPMYVC23Z4ITBOMNJT3CA2WA/netstandard/1.3/log4net/obj/log4net.csproj.nuget.g.props.
[exec] Generating MSBuild file /home/jenkins/jenkins-slave/workspace/log4net_feature_cd-pipeline-76KUCPODUF6LCE45226EBUR4GNVLYPMYVC23Z4ITBOMNJT3CA2WA/netstandard/1.3/log4net/obj/log4net.csproj.nuget.g.targets.
[exec] Restore completed in 2.43 sec for /home/jenkins/jenkins-slave/workspace/log4net_feature_cd-pipeline-76KUCPODUF6LCE45226EBUR4GNVLYPMYVC23Z4ITBOMNJT3CA2WA/netstandard/1.3/log4net/log4net.csproj.
[exec] Installing System.ComponentModel 4.0.1.
[exec] Installing System.Collections.Specialized 4.0.1.
[exec] Installing System.ComponentModel.Primitives 4.1.0.
[exec] Installing System.ComponentModel.TypeConverter 4.1.0.
[exec] Installing System.Diagnostics.TextWriterTraceListener 4.0.0.
[exec] Installing System.ComponentModel.EventBasedAsync 4.0.11.
[exec] Installing Microsoft.DotNet.PlatformAbstractions 1.0.3.
[exec] Installing Microsoft.TestPlatform.ObjectModel 15.5.0.
[exec] Installing Microsoft.Extensions.DependencyModel 1.0.3.
[exec] Installing Microsoft.Win32.Registry 4.3.0.
[exec] Installing Microsoft.TestPlatform.TestHost 15.5.0.
[exec] Installing Microsoft.CodeCoverage 1.0.3.
[exec] Installing NUnit 3.10.1.
[exec] Installing NUnit3TestAdapter 3.10.0.
[exec] Installing System.Diagnostics.Process 4.3.0.
[exec] Installing System.Xml.XPath.XmlDocument 4.3.0.
[exec] Installing Microsoft.DotNet.InternalAbstractions 1.0.0.
[exec] Installing Microsoft.NET.Test.Sdk 15.5.0.
[exec] Installing System.ComponentModel.EventBasedAsync 4.3.0.
[exec] Generating MSBuild file /home/jenkins/jenkins-slave/workspace/log4net_feature_cd-pipeline-76KUCPODUF6LCE45226EBUR4GNVLYPMYVC23Z4ITBOMNJT3CA2WA/netstandard/1.3/log4net.tests/obj/log4net.tests.csproj.nuget.g.props.
[exec] Generating MSBuild file /home/jenkins/jenkins-slave/workspace/log4net_feature_cd-pipeline-76KUCPODUF6LCE45226EBUR4GNVLYPMYVC23Z4ITBOMNJT3CA2WA/netstandard/1.3/log4net.tests/obj/log4net.tests.csproj.nuget.g.targets.
[exec] Restore completed in 3.54 sec for /home/jenkins/jenkins-slave/workspace/log4net_feature_cd-pipeline-76KUCPODUF6LCE45226EBUR4GNVLYPMYVC23Z4ITBOMNJT3CA2WA/netstandard/1.3/log4net.tests/log4net.tests.csproj.
[echo] dotnet build log4net
[exec] Microsoft (R) Build Engine version 15.7.177.53362 for .NET Core
[exec] Copyright (C) Microsoft Corporation. All rights reserved.
[exec]
[exec] Restore completed in 86.97 ms for /home/jenkins/jenkins-slave/workspace/log4net_feature_cd-pipeline-76KUCPODUF6LCE45226EBUR4GNVLYPMYVC23Z4ITBOMNJT3CA2WA/netstandard/1.3/log4net/log4net.csproj.
[exec] log4net -> /home/jenkins/jenkins-slave/workspace/log4net_feature_cd-pipeline-76KUCPODUF6LCE45226EBUR4GNVLYPMYVC23Z4ITBOMNJT3CA2WA/netstandard/1.3/log4net/bin/Debug/netstandard1.3/log4net.dll
[exec]
[exec] Build succeeded.
[exec] 0 Warning(s)
[exec] 0 Error(s)
[exec]
[exec] Time Elapsed 00:00:05.44
[mkdir] Creating directory '/home/jenkins/jenkins-slave/workspace/log4net_feature_cd-pipeline-76KUCPODUF6LCE45226EBUR4GNVLYPMYVC23Z4ITBOMNJT3CA2WA/bin/netstandard/1.3'.
[move] 1 directory moved.
set-release-build-configuration:
check-current-build-config:
set-build-configuration-flags:
compile-netstandard-1.3-current-configuration:
[echo] dotnet --version
[exec] 2.1.200
[echo] dotnet restore log4net.netstandard.sln
[exec] Restore completed in 78.86 ms for /home/jenkins/jenkins-slave/workspace/log4net_feature_cd-pipeline-76KUCPODUF6LCE45226EBUR4GNVLYPMYVC23Z4ITBOMNJT3CA2WA/netstandard/1.3/log4net.tests/log4net.tests.csproj.
[exec] Restore completed in 84.1 ms for /home/jenkins/jenkins-slave/workspace/log4net_feature_cd-pipeline-76KUCPODUF6LCE45226EBUR4GNVLYPMYVC23Z4ITBOMNJT3CA2WA/netstandard/1.3/log4net/log4net.csproj.
[echo] dotnet build log4net
[exec] Microsoft (R) Build Engine version 15.7.177.53362 for .NET Core
[exec] Copyright (C) Microsoft Corporation. All rights reserved.
[exec]
[exec] Restore completed in 86.99 ms for /home/jenkins/jenkins-slave/workspace/log4net_feature_cd-pipeline-76KUCPODUF6LCE45226EBUR4GNVLYPMYVC23Z4ITBOMNJT3CA2WA/netstandard/1.3/log4net/log4net.csproj.
[exec] log4net -> /home/jenkins/jenkins-slave/workspace/log4net_feature_cd-pipeline-76KUCPODUF6LCE45226EBUR4GNVLYPMYVC23Z4ITBOMNJT3CA2WA/netstandard/1.3/log4net/bin/Release/netstandard1.3/log4net.dll
[exec]
[exec] Build succeeded.
[exec] 0 Warning(s)
[exec] 0 Error(s)
[exec]
[exec] Time Elapsed 00:00:03.36
[move] 1 directory moved.
BUILD SUCCEEDED
Total time: 19.8 seconds.
[Pipeline] stash
Stashed 6 file(s)
[Pipeline] sh
[log4net_feature_cd-pipeline-76KUCPODUF6LCE45226EBUR4GNVLYPMYVC23Z4ITBOMNJT3CA2WA] Running shell script
[Pipeline] }
$ docker stop --time=1 7d597f3d89b94947dd28c9a28bd85b703b2288dd6a509b48afad4db69f93fd6e
[Pipeline] // withDockerContainer
[Pipeline] }
[Pipeline] // script
[Pipeline] }
[Pipeline] // stage
[Pipeline] stage
[Pipeline] { (build net-2.0)
Stage 'build net-2.0' skipped due to earlier failure(s)
[Pipeline] }
[Pipeline] // stage
[Pipeline] stage
[Pipeline] { (build net-3.5)
Stage 'build net-3.5' skipped due to earlier failure(s)
[Pipeline] }
[Pipeline] // stage
[Pipeline] stage
[Pipeline] { (build net-3.5-cp)
Stage 'build net-3.5-cp' skipped due to earlier failure(s)
[Pipeline] }
[Pipeline] // stage
[Pipeline] stage
[Pipeline] { (build net-4.0)
Stage 'build net-4.0' skipped due to earlier failure(s)
[Pipeline] }
[Pipeline] // stage
[Pipeline] stage
[Pipeline] { (build net-4.0-cp)
Stage 'build net-4.0-cp' skipped due to earlier failure(s)
[Pipeline] }
[Pipeline] // stage
[Pipeline] stage
[Pipeline] { (build net-4.5)
Stage 'build net-4.5' skipped due to earlier failure(s)
[Pipeline] }
[Pipeline] // stage
[Pipeline] stage
[Pipeline] { (build mono-2.0)
Stage 'build mono-2.0' skipped due to earlier failure(s)
[Pipeline] }
[Pipeline] // stage
[Pipeline] stage
[Pipeline] { (build mono-3.5)
Stage 'build mono-3.5' skipped due to earlier failure(s)
[Pipeline] }
[Pipeline] // stage
[Pipeline] stage
[Pipeline] { (build mono-4.0)
Stage 'build mono-4.0' skipped due to earlier failure(s)
[Pipeline] }
[Pipeline] // stage
[Pipeline] stage
[Pipeline] { (build site)
Stage 'build site' skipped due to earlier failure(s)
[Pipeline] }
[Pipeline] // stage
[Pipeline] stage
[Pipeline] { (prepare package)
Stage 'prepare package' skipped due to earlier failure(s)
[Pipeline] }
[Pipeline] // stage
[Pipeline] stage
[Pipeline] { (check test results)
Stage 'check test results' skipped due to earlier failure(s)
[Pipeline] }
[Pipeline] // stage
[Pipeline] stage
[Pipeline] { (publish site)
Stage 'publish site' skipped due to earlier failure(s)
[Pipeline] }
[Pipeline] // stage
[Pipeline] stage
[Pipeline] { (Declarative: Post Actions)
[Pipeline] step
Build failed in Jenkins: logging-log4net » feature/cd-pipeline #208
Posted by Apache Jenkins Server <je...@builds.apache.org>.
See <https://builds.apache.org/job/logging-log4net/job/feature%252Fcd-pipeline/208/display/redirect>
------------------------------------------
Started by user dpsenner
Connecting to https://api.github.com using dpsenner/****** (dpsenner at github)
Obtained Jenkinsfile from d82a37f3cd20406ef72b447ed6cb359bdf04e667
Running in Durability level: MAX_SURVIVABILITY
[Pipeline] node
Running on H26 in /home/jenkins/jenkins-slave/workspace/log4net_feature_cd-pipeline-76KUCPODUF6LCE45226EBUR4GNVLYPMYVC23Z4ITBOMNJT3CA2WA
[Pipeline] {
[Pipeline] timeout
Timeout set to expire in 4 hr 0 min
[Pipeline] {
[Pipeline] stage
[Pipeline] { (checkout)
[Pipeline] deleteDir
[Pipeline] checkout
Cloning the remote Git repository
Cloning with configured refspecs honoured and without tags
Cloning repository https://github.com/apache/logging-log4net.git
> git init /home/jenkins/jenkins-slave/workspace/log4net_feature_cd-pipeline-76KUCPODUF6LCE45226EBUR4GNVLYPMYVC23Z4ITBOMNJT3CA2WA # timeout=10
Fetching upstream changes from https://github.com/apache/logging-log4net.git
> git --version # timeout=10
using GIT_ASKPASS to set credentials dpsenner at github
> git fetch --no-tags --progress https://github.com/apache/logging-log4net.git +refs/heads/feature/cd-pipeline:refs/remotes/origin/feature/cd-pipeline
> git config remote.origin.url https://github.com/apache/logging-log4net.git # timeout=10
> git config --add remote.origin.fetch +refs/heads/feature/cd-pipeline:refs/remotes/origin/feature/cd-pipeline # timeout=10
> git config remote.origin.url https://github.com/apache/logging-log4net.git # timeout=10
Fetching without tags
Fetching upstream changes from https://github.com/apache/logging-log4net.git
using GIT_ASKPASS to set credentials dpsenner at github
> git fetch --no-tags --progress https://github.com/apache/logging-log4net.git +refs/heads/feature/cd-pipeline:refs/remotes/origin/feature/cd-pipeline
Checking out Revision d82a37f3cd20406ef72b447ed6cb359bdf04e667 (feature/cd-pipeline)
> git config core.sparsecheckout # timeout=10
> git checkout -f d82a37f3cd20406ef72b447ed6cb359bdf04e667
Commit message: "netstandard-1.3: bump to nunit 3.10"
> git rev-list --no-walk d82a37f3cd20406ef72b447ed6cb359bdf04e667 # timeout=10
[Pipeline] }
[Pipeline] // stage
[Pipeline] stage
[Pipeline] { (build netstandard-1.3)
[Pipeline] script
[Pipeline] {
[Pipeline] checkout
> git rev-parse --is-inside-work-tree # timeout=10
Fetching changes from the remote Git repository
> git config remote.origin.url https://github.com/apache/logging-log4net.git # timeout=10
Fetching without tags
Fetching upstream changes from https://github.com/apache/logging-log4net.git
> git --version # timeout=10
using GIT_ASKPASS to set credentials dpsenner at github
> git fetch --no-tags --progress https://github.com/apache/logging-log4net.git +refs/heads/feature/cd-pipeline:refs/remotes/origin/feature/cd-pipeline
Checking out Revision d82a37f3cd20406ef72b447ed6cb359bdf04e667 (feature/cd-pipeline)
> git config core.sparsecheckout # timeout=10
> git checkout -f d82a37f3cd20406ef72b447ed6cb359bdf04e667
Commit message: "netstandard-1.3: bump to nunit 3.10"
[Pipeline] sh
[log4net_feature_cd-pipeline-76KUCPODUF6LCE45226EBUR4GNVLYPMYVC23Z4ITBOMNJT3CA2WA] Running shell script
+ stat -c %u buildtools/docker/builder-netstandard-1.3
[Pipeline] sh
[log4net_feature_cd-pipeline-76KUCPODUF6LCE45226EBUR4GNVLYPMYVC23Z4ITBOMNJT3CA2WA] Running shell script
+ stat -c %g buildtools/docker/builder-netstandard-1.3
[Pipeline] sh
[log4net_feature_cd-pipeline-76KUCPODUF6LCE45226EBUR4GNVLYPMYVC23Z4ITBOMNJT3CA2WA] Running shell script
+ docker build -t builder-netstandard:latest --file buildtools/docker/builder-netstandard-1.3/Dockerfile --build-arg JENKINS_UID=910 --build-arg JENKINS_GID=910 buildtools/docker/builder-netstandard-1.3
runtime/cgo: pthread_create failed: Resource temporarily unavailable
SIGABRT: abort
PC=0x7f043db9b428 m=10
goroutine 0 [idle]:
goroutine 1 [runnable]:
encoding/json.(*byIndex).Less(0xc420538040, 0xb, 0xa, 0x1)
<autogenerated>:38
sort.insertionSort(0x15241e0, 0xc420538040, 0x6, 0x11)
/usr/local/go/src/sort/sort.go:25 +0x6e
sort.quickSort(0x15241e0, 0xc420538040, 0x6, 0x11, 0x9)
/usr/local/go/src/sort/sort.go:207 +0x1eb
sort.Sort(0x15241e0, 0xc420538040)
/usr/local/go/src/sort/sort.go:222 +0x80
encoding/json.typeFields(0x152c4a0, 0xe2dbe0, 0xc4204e30f8, 0x157da00, 0xd92a80)
/usr/local/go/src/encoding/json/encode.go:1191 +0x1681
encoding/json.cachedTypeFields(0x152c4a0, 0xe2dbe0, 0x199, 0x152c4a0, 0xe2dbe0)
/usr/local/go/src/encoding/json/encode.go:1249 +0xc5
encoding/json.(*decodeState).object(0xc42049f3a8, 0xcb7b80, 0xc4204c2010, 0x16)
/usr/local/go/src/encoding/json/decode.go:651 +0x11d9
encoding/json.(*decodeState).value(0xc42049f3a8, 0xcb7b80, 0xc4204c2010, 0x16)
/usr/local/go/src/encoding/json/decode.go:368 +0x2cc
encoding/json.(*decodeState).unmarshal(0xc42049f3a8, 0xcb7b80, 0xc4204c2010, 0x0, 0x0)
/usr/local/go/src/encoding/json/decode.go:169 +0x1fa
encoding/json.(*Decoder).Decode(0xc42049f380, 0xcb7b80, 0xc4204c2010, 0x0, 0x4179b4)
/usr/local/go/src/encoding/json/stream.go:67 +0x15a
github.com/docker/docker/cli/config/configfile.(*ConfigFile).LoadFromReader(0xc4204f8000, 0x1517220, 0xc4204c2008, 0x0, 0x0)
/usr/src/docker/.gopath/src/github.com/docker/docker/cli/config/configfile/file.go:86 +0xe6
github.com/docker/docker/cli/config.Load(0xc420100be0, 0x15, 0x0, 0x0, 0x0)
/usr/src/docker/.gopath/src/github.com/docker/docker/cli/config/config.go:90 +0x9c7
github.com/docker/docker/cli/command.LoadDefaultConfigFile(0x1517260, 0xc4200a0010, 0xc42008c16c)
/usr/src/docker/.gopath/src/github.com/docker/docker/cli/command/cli.go:224 +0x45
github.com/docker/docker/cli/command.(*DockerCli).Initialize(0xc4203f3880, 0xc420392f00, 0x5, 0xc42046cb40)
/usr/src/docker/.gopath/src/github.com/docker/docker/cli/command/cli.go:153 +0x5d
main.newDockerCommand.func2(0xc420424fc0, 0xc42046cb40, 0x1, 0x9, 0x0, 0x0)
/usr/src/docker/.gopath/src/github.com/docker/docker/cmd/docker/docker.go:50 +0xa2
github.com/docker/docker/vendor/github.com/spf13/cobra.(*Command).execute(0xc420424fc0, 0xc4200a4020, 0x9, 0x9, 0xc420424fc0, 0xc4200a4020)
/usr/src/docker/.gopath/src/github.com/docker/docker/vendor/github.com/spf13/cobra/command.go:628 +0x571
github.com/docker/docker/vendor/github.com/spf13/cobra.(*Command).ExecuteC(0xc4200c1d40, 0xc4203f6240, 0xc4203a1dd0, 0xc4200a04c0)
/usr/src/docker/.gopath/src/github.com/docker/docker/vendor/github.com/spf13/cobra/command.go:742 +0x377
github.com/docker/docker/vendor/github.com/spf13/cobra.(*Command).Execute(0xc4200c1d40, 0xc4200c1d40, 0x1517260)
/usr/src/docker/.gopath/src/github.com/docker/docker/vendor/github.com/spf13/cobra/command.go:695 +0x2b
main.main()
/usr/src/docker/.gopath/src/github.com/docker/docker/cmd/docker/docker.go:169 +0xcb
goroutine 17 [syscall, locked to thread]:
runtime.goexit()
/usr/local/go/src/runtime/asm_amd64.s:2086 +0x1
goroutine 20 [syscall]:
os/signal.signal_recv(0x0)
/usr/local/go/src/runtime/sigqueue.go:116 +0x157
os/signal.loop()
/usr/local/go/src/os/signal/signal_unix.go:22 +0x22
created by os/signal.init.1
/usr/local/go/src/os/signal/signal_unix.go:28 +0x41
rax 0x0
rbx 0x7f043df2b700
rcx 0x7f043db9b428
rdx 0x6
rdi 0x1a43
rsi 0x1a4e
rbp 0xf1d11e
rsp 0x7f04356999b8
r8 0x7f043df2c770
r9 0x7f043569a700
r10 0x8
r11 0x202
r12 0x7f04240008c0
r13 0xf3
r14 0x30
r15 0x3
rip 0x7f043db9b428
rflags 0x202
cs 0x33
fs 0x0
gs 0x0
[Pipeline] }
[Pipeline] // script
[Pipeline] }
[Pipeline] // stage
[Pipeline] stage
[Pipeline] { (build net-2.0)
Stage 'build net-2.0' skipped due to earlier failure(s)
[Pipeline] }
[Pipeline] // stage
[Pipeline] stage
[Pipeline] { (build net-3.5)
Stage 'build net-3.5' skipped due to earlier failure(s)
[Pipeline] }
[Pipeline] // stage
[Pipeline] stage
[Pipeline] { (build net-3.5-cp)
Stage 'build net-3.5-cp' skipped due to earlier failure(s)
[Pipeline] }
[Pipeline] // stage
[Pipeline] stage
[Pipeline] { (build net-4.0)
Stage 'build net-4.0' skipped due to earlier failure(s)
[Pipeline] }
[Pipeline] // stage
[Pipeline] stage
[Pipeline] { (build net-4.0-cp)
Stage 'build net-4.0-cp' skipped due to earlier failure(s)
[Pipeline] }
[Pipeline] // stage
[Pipeline] stage
[Pipeline] { (build net-4.5)
Stage 'build net-4.5' skipped due to earlier failure(s)
[Pipeline] }
[Pipeline] // stage
[Pipeline] stage
[Pipeline] { (build mono-2.0)
Stage 'build mono-2.0' skipped due to earlier failure(s)
[Pipeline] }
[Pipeline] // stage
[Pipeline] stage
[Pipeline] { (build mono-3.5)
Stage 'build mono-3.5' skipped due to earlier failure(s)
[Pipeline] }
[Pipeline] // stage
[Pipeline] stage
[Pipeline] { (build mono-4.0)
Stage 'build mono-4.0' skipped due to earlier failure(s)
[Pipeline] }
[Pipeline] // stage
[Pipeline] stage
[Pipeline] { (build site)
Stage 'build site' skipped due to earlier failure(s)
[Pipeline] }
[Pipeline] // stage
[Pipeline] stage
[Pipeline] { (prepare package)
Stage 'prepare package' skipped due to earlier failure(s)
[Pipeline] }
[Pipeline] // stage
[Pipeline] stage
[Pipeline] { (check test results)
Stage 'check test results' skipped due to earlier failure(s)
[Pipeline] }
[Pipeline] // stage
[Pipeline] stage
[Pipeline] { (publish site)
Stage 'publish site' skipped due to earlier failure(s)
[Pipeline] }
[Pipeline] // stage
[Pipeline] stage
[Pipeline] { (Declarative: Post Actions)
[Pipeline] step
Build failed in Jenkins: logging-log4net » feature/cd-pipeline #207
Posted by Apache Jenkins Server <je...@builds.apache.org>.
See <https://builds.apache.org/job/logging-log4net/job/feature%252Fcd-pipeline/207/display/redirect>
------------------------------------------
[...truncated 8.01 KB...]
Step 2/8 : ARG JENKINS_UID
---> Using cache
---> d65b5107ef11
Step 3/8 : ARG JENKINS_GID
---> Using cache
---> b6020a8c63be
Step 4/8 : MAINTAINER "dev@logging.apache.org"
---> Using cache
---> e547e1e03f31
Step 5/8 : RUN mkdir -p /var/workspaces && chmod 0777 /var/workspaces
---> Using cache
---> 0381e939e8f7
Step 6/8 : RUN groupadd -r -g $JENKINS_GID jenkins-slave
---> Using cache
---> 41289c5f78d1
Step 7/8 : RUN useradd --base-dir /var/workspaces --create-home --shell /bin/bash --uid $JENKINS_UID --gid $JENKINS_GID --groups $JENKINS_GID -p -M jenkins
---> Using cache
---> 64fb4259b854
Step 8/8 : RUN apt-get update && apt-get install -y nant git
---> Using cache
---> 3f469df9b609
Successfully built 3f469df9b609
Successfully tagged builder-netstandard:latest
[Pipeline] dockerFingerprintFrom
[Pipeline] sh
[log4net_feature_cd-pipeline-76KUCPODUF6LCE45226EBUR4GNVLYPMYVC23Z4ITBOMNJT3CA2WA] Running shell script
+ docker inspect -f . builder-netstandard:latest
.
[Pipeline] withDockerContainer
H26 does not seem to be running inside a container
$ docker run -t -d -u 910:910 -w /home/jenkins/jenkins-slave/workspace/log4net_feature_cd-pipeline-76KUCPODUF6LCE45226EBUR4GNVLYPMYVC23Z4ITBOMNJT3CA2WA -v /home/jenkins/jenkins-slave/workspace/log4net_feature_cd-pipeline-76KUCPODUF6LCE45226EBUR4GNVLYPMYVC23Z4ITBOMNJT3CA2WA:/home/jenkins/jenkins-slave/workspace/log4net_feature_cd-pipeline-76KUCPODUF6LCE45226EBUR4GNVLYPMYVC23Z4ITBOMNJT3CA2WA:rw,z -v /home/jenkins/jenkins-slave/workspace/log4net_feature_cd-pipeline-76KUCPODUF6LCE45226EBUR4GNVLYPMYVC23Z4ITBOMNJT3CA2WA@tmp:/home/jenkins/jenkins-slave/workspace/log4net_feature_cd-pipeline-76KUCPODUF6LCE45226EBUR4GNVLYPMYVC23Z4ITBOMNJT3CA2WA@tmp:rw,z -e ******** -e ******** -e ******** -e ******** -e ******** -e ******** -e ******** -e ******** -e ******** -e ******** -e ******** -e ******** -e ******** -e ******** -e ******** -e ******** -e ******** -e ******** -e ******** -e ******** -e ******** -e ******** -e ******** -e ******** -e ******** -e ******** -e ******** builder-netstandard:latest cat
$ docker top 9debf06555455704837dc539ce84870be22e3791041a0c6adda1b588b5b89c2d -eo pid,comm
[Pipeline] {
[Pipeline] sh
[log4net_feature_cd-pipeline-76KUCPODUF6LCE45226EBUR4GNVLYPMYVC23Z4ITBOMNJT3CA2WA] Running shell script
+ nant compile-netstandard-1.3
NAnt 0.92 (Build 0.92.4526.0; rc1; 05/23/2012)
Copyright (C) 2001-2012 Gerry Shaw
http://nant.sourceforge.net
Buildfile: file:///home/jenkins/jenkins-slave/workspace/log4net_feature_cd-pipeline-76KUCPODUF6LCE45226EBUR4GNVLYPMYVC23Z4ITBOMNJT3CA2WA/log4net.build
Target framework: Mono 4.0 Profile
Target(s) specified: compile-netstandard-1.3
check-current-build-config:
set-build-configuration:
set-debug-build-configuration:
check-current-build-config:
set-build-configuration-flags:
compile-netstandard-1.3:
set-debug-build-configuration:
check-current-build-config:
set-build-configuration-flags:
compile-netstandard-1.3-current-configuration:
[echo] dotnet --version
[exec] 2.1.200
[echo] dotnet restore log4net.netstandard.sln
[exec]
[exec] Welcome to .NET Core!
[exec] ---------------------
[exec] Learn more about .NET Core @ https://aka.ms/dotnet-docs. Use dotnet --help to see available commands or go to https://aka.ms/dotnet-cli-docs.
[exec]
[exec] Telemetry
[exec] --------------
[exec] The .NET Core tools collect usage data in order to improve your experience. The data is anonymous and does not include command-line arguments. The data is collected by Microsoft and shared with the community.
[exec] You can opt out of telemetry by setting a DOTNET_CLI_TELEMETRY_OPTOUT environment variable to 1 using your favorite shell.
[exec] You can read more about .NET Core tools telemetry @ https://aka.ms/dotnet-cli-telemetry.
[exec] Restoring packages for /home/jenkins/jenkins-slave/workspace/log4net_feature_cd-pipeline-76KUCPODUF6LCE45226EBUR4GNVLYPMYVC23Z4ITBOMNJT3CA2WA/netstandard/1.3/log4net/log4net.csproj...
[exec] Restoring packages for /home/jenkins/jenkins-slave/workspace/log4net_feature_cd-pipeline-76KUCPODUF6LCE45226EBUR4GNVLYPMYVC23Z4ITBOMNJT3CA2WA/netstandard/1.3/log4net.tests/log4net.tests.csproj...
[exec] Installing System.Security.Claims 4.0.1.
[exec] Installing System.Security.Principal.Windows 4.0.0.
[exec] Installing System.Net.WebHeaderCollection 4.0.1.
[exec] Installing System.Net.NameResolution 4.0.0.
[exec] Installing System.Net.Requests 4.0.11.
[exec] Installing System.IO.FileSystem.Watcher 4.0.0.
[exec] Installing System.Diagnostics.StackTrace 4.0.1.
[exec] Generating MSBuild file /home/jenkins/jenkins-slave/workspace/log4net_feature_cd-pipeline-76KUCPODUF6LCE45226EBUR4GNVLYPMYVC23Z4ITBOMNJT3CA2WA/netstandard/1.3/log4net/obj/log4net.csproj.nuget.g.props.
[exec] Generating MSBuild file /home/jenkins/jenkins-slave/workspace/log4net_feature_cd-pipeline-76KUCPODUF6LCE45226EBUR4GNVLYPMYVC23Z4ITBOMNJT3CA2WA/netstandard/1.3/log4net/obj/log4net.csproj.nuget.g.targets.
[exec] Restore completed in 2.37 sec for /home/jenkins/jenkins-slave/workspace/log4net_feature_cd-pipeline-76KUCPODUF6LCE45226EBUR4GNVLYPMYVC23Z4ITBOMNJT3CA2WA/netstandard/1.3/log4net/log4net.csproj.
[exec] Installing System.ComponentModel 4.0.1.
[exec] Installing System.ComponentModel.Primitives 4.1.0.
[exec] Installing System.Collections.Specialized 4.0.1.
[exec] Installing System.ComponentModel.TypeConverter 4.1.0.
[exec] Installing System.Diagnostics.TextWriterTraceListener 4.0.0.
[exec] Installing System.ComponentModel.EventBasedAsync 4.0.11.
[exec] Installing Microsoft.DotNet.PlatformAbstractions 1.0.3.
[exec] Installing Microsoft.TestPlatform.ObjectModel 15.5.0.
[exec] Installing Microsoft.Extensions.DependencyModel 1.0.3.
[exec] Installing Microsoft.Win32.Registry 4.3.0.
[exec] Installing Microsoft.TestPlatform.TestHost 15.5.0.
[exec] Installing Microsoft.CodeCoverage 1.0.3.
[exec] Installing System.Diagnostics.Process 4.3.0.
[exec] Installing System.Xml.XPath.XmlDocument 4.3.0.
[exec] Installing Microsoft.NET.Test.Sdk 15.5.0.
[exec] Installing Microsoft.DotNet.InternalAbstractions 1.0.0.
[exec] Installing NUnit 3.10.1.
[exec] Installing NUnit3TestAdapter 3.10.0.
[exec] Installing System.ComponentModel.EventBasedAsync 4.3.0.
[exec] Generating MSBuild file /home/jenkins/jenkins-slave/workspace/log4net_feature_cd-pipeline-76KUCPODUF6LCE45226EBUR4GNVLYPMYVC23Z4ITBOMNJT3CA2WA/netstandard/1.3/log4net.tests/obj/log4net.tests.csproj.nuget.g.props.
[exec] Generating MSBuild file /home/jenkins/jenkins-slave/workspace/log4net_feature_cd-pipeline-76KUCPODUF6LCE45226EBUR4GNVLYPMYVC23Z4ITBOMNJT3CA2WA/netstandard/1.3/log4net.tests/obj/log4net.tests.csproj.nuget.g.targets.
[exec] Restore completed in 3.92 sec for /home/jenkins/jenkins-slave/workspace/log4net_feature_cd-pipeline-76KUCPODUF6LCE45226EBUR4GNVLYPMYVC23Z4ITBOMNJT3CA2WA/netstandard/1.3/log4net.tests/log4net.tests.csproj.
[echo] dotnet build log4net
[exec] Microsoft (R) Build Engine version 15.7.177.53362 for .NET Core
[exec] Copyright (C) Microsoft Corporation. All rights reserved.
[exec]
[exec] Restore completed in 77.78 ms for /home/jenkins/jenkins-slave/workspace/log4net_feature_cd-pipeline-76KUCPODUF6LCE45226EBUR4GNVLYPMYVC23Z4ITBOMNJT3CA2WA/netstandard/1.3/log4net/log4net.csproj.
[exec] log4net -> /home/jenkins/jenkins-slave/workspace/log4net_feature_cd-pipeline-76KUCPODUF6LCE45226EBUR4GNVLYPMYVC23Z4ITBOMNJT3CA2WA/netstandard/1.3/log4net/bin/Debug/netstandard1.3/log4net.dll
[exec]
[exec] Build succeeded.
[exec] 0 Warning(s)
[exec] 0 Error(s)
[exec]
[exec] Time Elapsed 00:00:05.38
[mkdir] Creating directory '/home/jenkins/jenkins-slave/workspace/log4net_feature_cd-pipeline-76KUCPODUF6LCE45226EBUR4GNVLYPMYVC23Z4ITBOMNJT3CA2WA/bin/netstandard/1.3'.
[move] 1 directory moved.
set-release-build-configuration:
check-current-build-config:
set-build-configuration-flags:
compile-netstandard-1.3-current-configuration:
[echo] dotnet --version
[exec] 2.1.200
[echo] dotnet restore log4net.netstandard.sln
[exec] Restore completed in 69.51 ms for /home/jenkins/jenkins-slave/workspace/log4net_feature_cd-pipeline-76KUCPODUF6LCE45226EBUR4GNVLYPMYVC23Z4ITBOMNJT3CA2WA/netstandard/1.3/log4net/log4net.csproj.
[exec] Restore completed in 65.28 ms for /home/jenkins/jenkins-slave/workspace/log4net_feature_cd-pipeline-76KUCPODUF6LCE45226EBUR4GNVLYPMYVC23Z4ITBOMNJT3CA2WA/netstandard/1.3/log4net.tests/log4net.tests.csproj.
[echo] dotnet build log4net
[exec] Microsoft (R) Build Engine version 15.7.177.53362 for .NET Core
[exec] Copyright (C) Microsoft Corporation. All rights reserved.
[exec]
[exec] Restore completed in 98.59 ms for /home/jenkins/jenkins-slave/workspace/log4net_feature_cd-pipeline-76KUCPODUF6LCE45226EBUR4GNVLYPMYVC23Z4ITBOMNJT3CA2WA/netstandard/1.3/log4net/log4net.csproj.
[exec] log4net -> /home/jenkins/jenkins-slave/workspace/log4net_feature_cd-pipeline-76KUCPODUF6LCE45226EBUR4GNVLYPMYVC23Z4ITBOMNJT3CA2WA/netstandard/1.3/log4net/bin/Release/netstandard1.3/log4net.dll
[exec]
[exec] Build succeeded.
[exec] 0 Warning(s)
[exec] 0 Error(s)
[exec]
[exec] Time Elapsed 00:00:03.63
[move] 1 directory moved.
BUILD SUCCEEDED
Total time: 20.3 seconds.
[Pipeline] stash
Stashed 6 file(s)
[Pipeline] sh
[log4net_feature_cd-pipeline-76KUCPODUF6LCE45226EBUR4GNVLYPMYVC23Z4ITBOMNJT3CA2WA] Running shell script
[Pipeline] }
$ docker stop --time=1 9debf06555455704837dc539ce84870be22e3791041a0c6adda1b588b5b89c2d
[Pipeline] // withDockerContainer
[Pipeline] }
[Pipeline] // script
[Pipeline] }
[Pipeline] // stage
[Pipeline] stage
[Pipeline] { (build net-2.0)
Stage 'build net-2.0' skipped due to earlier failure(s)
[Pipeline] }
[Pipeline] // stage
[Pipeline] stage
[Pipeline] { (build net-3.5)
Stage 'build net-3.5' skipped due to earlier failure(s)
[Pipeline] }
[Pipeline] // stage
[Pipeline] stage
[Pipeline] { (build net-3.5-cp)
Stage 'build net-3.5-cp' skipped due to earlier failure(s)
[Pipeline] }
[Pipeline] // stage
[Pipeline] stage
[Pipeline] { (build net-4.0)
Stage 'build net-4.0' skipped due to earlier failure(s)
[Pipeline] }
[Pipeline] // stage
[Pipeline] stage
[Pipeline] { (build net-4.0-cp)
Stage 'build net-4.0-cp' skipped due to earlier failure(s)
[Pipeline] }
[Pipeline] // stage
[Pipeline] stage
[Pipeline] { (build net-4.5)
Stage 'build net-4.5' skipped due to earlier failure(s)
[Pipeline] }
[Pipeline] // stage
[Pipeline] stage
[Pipeline] { (build mono-2.0)
Stage 'build mono-2.0' skipped due to earlier failure(s)
[Pipeline] }
[Pipeline] // stage
[Pipeline] stage
[Pipeline] { (build mono-3.5)
Stage 'build mono-3.5' skipped due to earlier failure(s)
[Pipeline] }
[Pipeline] // stage
[Pipeline] stage
[Pipeline] { (build mono-4.0)
Stage 'build mono-4.0' skipped due to earlier failure(s)
[Pipeline] }
[Pipeline] // stage
[Pipeline] stage
[Pipeline] { (build site)
Stage 'build site' skipped due to earlier failure(s)
[Pipeline] }
[Pipeline] // stage
[Pipeline] stage
[Pipeline] { (prepare package)
Stage 'prepare package' skipped due to earlier failure(s)
[Pipeline] }
[Pipeline] // stage
[Pipeline] stage
[Pipeline] { (check test results)
Stage 'check test results' skipped due to earlier failure(s)
[Pipeline] }
[Pipeline] // stage
[Pipeline] stage
[Pipeline] { (publish site)
Stage 'publish site' skipped due to earlier failure(s)
[Pipeline] }
[Pipeline] // stage
[Pipeline] stage
[Pipeline] { (Declarative: Post Actions)
[Pipeline] step
Build failed in Jenkins: logging-log4net » feature/cd-pipeline #206
Posted by Apache Jenkins Server <je...@builds.apache.org>.
See <https://builds.apache.org/job/logging-log4net/job/feature%252Fcd-pipeline/206/display/redirect>
------------------------------------------
Branch indexing
Connecting to https://api.github.com using dpsenner/****** (dpsenner at github)
Obtained Jenkinsfile from d82a37f3cd20406ef72b447ed6cb359bdf04e667
Running in Durability level: MAX_SURVIVABILITY
[Pipeline] node
Running on H26 in /home/jenkins/jenkins-slave/workspace/log4net_feature_cd-pipeline-76KUCPODUF6LCE45226EBUR4GNVLYPMYVC23Z4ITBOMNJT3CA2WA
[Pipeline] {
[Pipeline] timeout
Timeout set to expire in 4 hr 0 min
[Pipeline] {
[Pipeline] stage
[Pipeline] { (checkout)
[Pipeline] deleteDir
[Pipeline] checkout
Cloning the remote Git repository
Cloning with configured refspecs honoured and without tags
Cloning repository https://github.com/apache/logging-log4net.git
> git init /home/jenkins/jenkins-slave/workspace/log4net_feature_cd-pipeline-76KUCPODUF6LCE45226EBUR4GNVLYPMYVC23Z4ITBOMNJT3CA2WA # timeout=10
Fetching upstream changes from https://github.com/apache/logging-log4net.git
> git --version # timeout=10
using GIT_ASKPASS to set credentials dpsenner at github
> git fetch --no-tags --progress https://github.com/apache/logging-log4net.git +refs/heads/feature/cd-pipeline:refs/remotes/origin/feature/cd-pipeline
> git config remote.origin.url https://github.com/apache/logging-log4net.git # timeout=10
> git config --add remote.origin.fetch +refs/heads/feature/cd-pipeline:refs/remotes/origin/feature/cd-pipeline # timeout=10
> git config remote.origin.url https://github.com/apache/logging-log4net.git # timeout=10
Fetching without tags
Fetching upstream changes from https://github.com/apache/logging-log4net.git
using GIT_ASKPASS to set credentials dpsenner at github
> git fetch --no-tags --progress https://github.com/apache/logging-log4net.git +refs/heads/feature/cd-pipeline:refs/remotes/origin/feature/cd-pipeline
Checking out Revision d82a37f3cd20406ef72b447ed6cb359bdf04e667 (feature/cd-pipeline)
> git config core.sparsecheckout # timeout=10
> git checkout -f d82a37f3cd20406ef72b447ed6cb359bdf04e667
Commit message: "netstandard-1.3: bump to nunit 3.10"
> git rev-list --no-walk d82a37f3cd20406ef72b447ed6cb359bdf04e667 # timeout=10
[Pipeline] }
[Pipeline] // stage
[Pipeline] stage
[Pipeline] { (build netstandard-1.3)
[Pipeline] script
[Pipeline] {
[Pipeline] checkout
> git rev-parse --is-inside-work-tree # timeout=10
Fetching changes from the remote Git repository
> git config remote.origin.url https://github.com/apache/logging-log4net.git # timeout=10
Fetching without tags
Fetching upstream changes from https://github.com/apache/logging-log4net.git
> git --version # timeout=10
using GIT_ASKPASS to set credentials dpsenner at github
> git fetch --no-tags --progress https://github.com/apache/logging-log4net.git +refs/heads/feature/cd-pipeline:refs/remotes/origin/feature/cd-pipeline
Checking out Revision d82a37f3cd20406ef72b447ed6cb359bdf04e667 (feature/cd-pipeline)
> git config core.sparsecheckout # timeout=10
> git checkout -f d82a37f3cd20406ef72b447ed6cb359bdf04e667
Commit message: "netstandard-1.3: bump to nunit 3.10"
[Pipeline] sh
[log4net_feature_cd-pipeline-76KUCPODUF6LCE45226EBUR4GNVLYPMYVC23Z4ITBOMNJT3CA2WA] Running shell script
+ stat -c %u buildtools/docker/builder-netstandard-1.3
[Pipeline] sh
[log4net_feature_cd-pipeline-76KUCPODUF6LCE45226EBUR4GNVLYPMYVC23Z4ITBOMNJT3CA2WA] Running shell script
+ stat -c %g buildtools/docker/builder-netstandard-1.3
[Pipeline] sh
[log4net_feature_cd-pipeline-76KUCPODUF6LCE45226EBUR4GNVLYPMYVC23Z4ITBOMNJT3CA2WA] Running shell script
+ docker build -t builder-netstandard:latest --file buildtools/docker/builder-netstandard-1.3/Dockerfile --build-arg JENKINS_UID=910 --build-arg JENKINS_GID=910 buildtools/docker/builder-netstandard-1.3
runtime/cgo: pthread_create failed: Resource temporarily unavailable
runtime/cgo: pthread_create failed: Resource temporarily unavailable
SIGABRT: abort
PC=0x7f9234690428 m=4
goroutine 0 [idle]:
goroutine 8 [running]:
runtime.systemstack_switch()
/usr/local/go/src/runtime/asm_amd64.s:252 fp=0xc4200596a0 sp=0xc420059698
runtime.gcStart(0x0, 0x100)
/usr/local/go/src/runtime/mgc.go:1020 +0x29f fp=0xc4200596d0 sp=0xc4200596a0
runtime.mallocgc(0x160, 0xdb92e0, 0xc42004ac01, 0x44a425)
/usr/local/go/src/runtime/malloc.go:752 +0x48d fp=0xc420059770 sp=0xc4200596d0
runtime.newarray(0xdb92e0, 0x1, 0x6024de4f94729d85)
/usr/local/go/src/runtime/malloc.go:798 +0x68 fp=0xc4200597b8 sp=0xc420059770
runtime.mapassign1(0xdaf380, 0xc42048a030, 0xc420059990, 0xc4200599c8)
/usr/local/go/src/runtime/hashmap.go:466 +0x892 fp=0xc4200598a0 sp=0xc4200597b8
net/textproto.(*Reader).ReadMIMEHeader(0xc420059ac8, 0x8, 0x1, 0x1)
/usr/local/go/src/net/textproto/reader.go:520 +0x568 fp=0xc4200599f0 sp=0xc4200598a0
net/http.ReadResponse(0xc42045e8a0, 0xc4200eec30, 0xc420059b50, 0xc420059b58, 0x789b16)
/usr/local/go/src/net/http/response.go:178 +0x46d fp=0xc420059b00 sp=0xc4200599f0
net/http.(*persistConn).readResponse(0xc4202cfa00, 0xc4200eec30, 0xc42045e9c0, 0x0, 0x0, 0xc42045e900, 0x0, 0x0, 0x0, 0x0)
/usr/local/go/src/net/http/transport.go:1591 +0x81 fp=0xc420059b68 sp=0xc420059b00
net/http.(*persistConn).readLoop(0xc4202cfa00)
/usr/local/go/src/net/http/transport.go:1433 +0x1283 fp=0xc420059fa8 sp=0xc420059b68
runtime.goexit()
/usr/local/go/src/runtime/asm_amd64.s:2086 +0x1 fp=0xc420059fb0 sp=0xc420059fa8
created by net/http.(*Transport).dialConn
/usr/local/go/src/net/http/transport.go:1062 +0x4e9
goroutine 1 [select]:
net/http.(*persistConn).roundTrip(0xc4202cfa00, 0xc4204639a0, 0x0, 0x0, 0x0)
/usr/local/go/src/net/http/transport.go:1840 +0x93b
net/http.(*Transport).RoundTrip(0xc4200eea50, 0xc4200eec30, 0xc4200eea50, 0x0, 0xc400000000)
/usr/local/go/src/net/http/transport.go:380 +0x4fa
net/http.send(0xc4200eec30, 0x1516c20, 0xc4200eea50, 0x0, 0x0, 0x0, 0x8, 0xc420048628, 0x4165a8)
/usr/local/go/src/net/http/client.go:256 +0x15f
net/http.(*Client).send(0xc420469230, 0xc4200eec30, 0x0, 0x0, 0x0, 0xc420048628, 0x0, 0x1)
/usr/local/go/src/net/http/client.go:146 +0x102
net/http.(*Client).doFollowingRedirects(0xc420469230, 0xc4200eec30, 0xee92e8, 0x3, 0xc420199801, 0x413cff)
/usr/local/go/src/net/http/client.go:528 +0x5e5
net/http.(*Client).Do(0xc420469230, 0xc4200eec30, 0xc420018288, 0xc4200eec30, 0xc420018288)
/usr/local/go/src/net/http/client.go:184 +0x1ea
github.com/docker/docker/vendor/golang.org/x/net/context/ctxhttp.Do(0x7f9234fce028, 0xc420018288, 0xc420469230, 0xc4200eeb40, 0xc4200eeb40, 0xc4201999a8, 0x5bb9a5)
/usr/src/docker/.gopath/src/github.com/docker/docker/vendor/golang.org/x/net/context/ctxhttp/ctxhttp.go:30 +0x92
github.com/docker/docker/client.(*Client).doRequest(0xc4203b2880, 0x7f9234fce028, 0xc420018288, 0xc4200eeb40, 0x6, 0x0, 0x0, 0x0, 0xc4200eeb40, 0x0)
/usr/src/docker/.gopath/src/github.com/docker/docker/client/request.go:127 +0x6e
github.com/docker/docker/client.(*Client).Ping(0xc4203b2880, 0x7f9234fce028, 0xc420018288, 0x0, 0x0, 0x0, 0x0, 0x0, 0x0, 0x0)
/usr/src/docker/.gopath/src/github.com/docker/docker/client/ping.go:17 +0x22c
github.com/docker/docker/cli/command.(*DockerCli).Initialize(0xc4203df8f0, 0xc42036d0e0, 0x5, 0xc42045abd0)
/usr/src/docker/.gopath/src/github.com/docker/docker/cli/command/cli.go:189 +0x3e9
main.newDockerCommand.func2(0xc420416fc0, 0xc42045abd0, 0x1, 0x9, 0x0, 0x0)
/usr/src/docker/.gopath/src/github.com/docker/docker/cmd/docker/docker.go:50 +0xa2
github.com/docker/docker/vendor/github.com/spf13/cobra.(*Command).execute(0xc420416fc0, 0xc42000c0d0, 0x9, 0x9, 0xc420416fc0, 0xc42000c0d0)
/usr/src/docker/.gopath/src/github.com/docker/docker/vendor/github.com/spf13/cobra/command.go:628 +0x571
github.com/docker/docker/vendor/github.com/spf13/cobra.(*Command).ExecuteC(0xc4200afd40, 0xc4203e4240, 0xc42038ff20, 0xc4200484c8)
/usr/src/docker/.gopath/src/github.com/docker/docker/vendor/github.com/spf13/cobra/command.go:742 +0x377
github.com/docker/docker/vendor/github.com/spf13/cobra.(*Command).Execute(0xc4200afd40, 0xc4200afd40, 0x1517260)
/usr/src/docker/.gopath/src/github.com/docker/docker/vendor/github.com/spf13/cobra/command.go:695 +0x2b
main.main()
/usr/src/docker/.gopath/src/github.com/docker/docker/cmd/docker/docker.go:169 +0xcb
goroutine 17 [syscall, locked to thread]:
runtime.goexit()
/usr/local/go/src/runtime/asm_amd64.s:2086 +0x1
goroutine 5 [syscall]:
os/signal.signal_recv(0x0)
/usr/local/go/src/runtime/sigqueue.go:116 +0x157
os/signal.loop()
/usr/local/go/src/os/signal/signal_unix.go:22 +0x22
created by os/signal.init.1
/usr/local/go/src/os/signal/signal_unix.go:28 +0x41
goroutine 9 [select]:
net/http.(*persistConn).writeLoop(0xc4202cfa00)
/usr/local/go/src/net/http/transport.go:1646 +0x3bd
created by net/http.(*Transport).dialConn
/usr/local/go/src/net/http/transport.go:1063 +0x50e
rax 0x0
rbx 0x7f9234a20700
rcx 0x7f9234690428
rdx 0x6
rdi 0xabc
rsi 0xac0
rbp 0xf1d11e
rsp 0x7f9233453a38
r8 0x7f9234a21770
r9 0x7f9233454700
r10 0x8
r11 0x202
r12 0x7f9224000f50
r13 0xf3
r14 0x30
r15 0x3
rip 0x7f9234690428
rflags 0x202
cs 0x33
fs 0x0
gs 0x0
[Pipeline] }
[Pipeline] // script
[Pipeline] }
[Pipeline] // stage
[Pipeline] stage
[Pipeline] { (build net-2.0)
Stage 'build net-2.0' skipped due to earlier failure(s)
[Pipeline] }
[Pipeline] // stage
[Pipeline] stage
[Pipeline] { (build net-3.5)
Stage 'build net-3.5' skipped due to earlier failure(s)
[Pipeline] }
[Pipeline] // stage
[Pipeline] stage
[Pipeline] { (build net-3.5-cp)
Stage 'build net-3.5-cp' skipped due to earlier failure(s)
[Pipeline] }
[Pipeline] // stage
[Pipeline] stage
[Pipeline] { (build net-4.0)
Stage 'build net-4.0' skipped due to earlier failure(s)
[Pipeline] }
[Pipeline] // stage
[Pipeline] stage
[Pipeline] { (build net-4.0-cp)
Stage 'build net-4.0-cp' skipped due to earlier failure(s)
[Pipeline] }
[Pipeline] // stage
[Pipeline] stage
[Pipeline] { (build net-4.5)
Stage 'build net-4.5' skipped due to earlier failure(s)
[Pipeline] }
[Pipeline] // stage
[Pipeline] stage
[Pipeline] { (build mono-2.0)
Stage 'build mono-2.0' skipped due to earlier failure(s)
[Pipeline] }
[Pipeline] // stage
[Pipeline] stage
[Pipeline] { (build mono-3.5)
Stage 'build mono-3.5' skipped due to earlier failure(s)
[Pipeline] }
[Pipeline] // stage
[Pipeline] stage
[Pipeline] { (build mono-4.0)
Stage 'build mono-4.0' skipped due to earlier failure(s)
[Pipeline] }
[Pipeline] // stage
[Pipeline] stage
[Pipeline] { (build site)
Stage 'build site' skipped due to earlier failure(s)
[Pipeline] }
[Pipeline] // stage
[Pipeline] stage
[Pipeline] { (prepare package)
Stage 'prepare package' skipped due to earlier failure(s)
[Pipeline] }
[Pipeline] // stage
[Pipeline] stage
[Pipeline] { (check test results)
Stage 'check test results' skipped due to earlier failure(s)
[Pipeline] }
[Pipeline] // stage
[Pipeline] stage
[Pipeline] { (publish site)
Stage 'publish site' skipped due to earlier failure(s)
[Pipeline] }
[Pipeline] // stage
[Pipeline] stage
[Pipeline] { (Declarative: Post Actions)
[Pipeline] step
Build failed in Jenkins: logging-log4net » feature/cd-pipeline #205
Posted by Apache Jenkins Server <je...@builds.apache.org>.
See <https://builds.apache.org/job/logging-log4net/job/feature%252Fcd-pipeline/205/display/redirect>
------------------------------------------
[...truncated 7.74 KB...]
Step 2/8 : ARG JENKINS_UID
---> Using cache
---> d65b5107ef11
Step 3/8 : ARG JENKINS_GID
---> Using cache
---> b6020a8c63be
Step 4/8 : MAINTAINER "dev@logging.apache.org"
---> Using cache
---> e547e1e03f31
Step 5/8 : RUN mkdir -p /var/workspaces && chmod 0777 /var/workspaces
---> Using cache
---> 0381e939e8f7
Step 6/8 : RUN groupadd -r -g $JENKINS_GID jenkins-slave
---> Using cache
---> 41289c5f78d1
Step 7/8 : RUN useradd --base-dir /var/workspaces --create-home --shell /bin/bash --uid $JENKINS_UID --gid $JENKINS_GID --groups $JENKINS_GID -p -M jenkins
---> Using cache
---> 64fb4259b854
Step 8/8 : RUN apt-get update && apt-get install -y nant git
---> Using cache
---> 3f469df9b609
Successfully built 3f469df9b609
Successfully tagged builder-netstandard:latest
[Pipeline] dockerFingerprintFrom
[Pipeline] sh
[log4net_feature_cd-pipeline-76KUCPODUF6LCE45226EBUR4GNVLYPMYVC23Z4ITBOMNJT3CA2WA] Running shell script
+ docker inspect -f . builder-netstandard:latest
.
[Pipeline] withDockerContainer
H26 does not seem to be running inside a container
$ docker run -t -d -u 910:910 -w /home/jenkins/jenkins-slave/workspace/log4net_feature_cd-pipeline-76KUCPODUF6LCE45226EBUR4GNVLYPMYVC23Z4ITBOMNJT3CA2WA -v /home/jenkins/jenkins-slave/workspace/log4net_feature_cd-pipeline-76KUCPODUF6LCE45226EBUR4GNVLYPMYVC23Z4ITBOMNJT3CA2WA:/home/jenkins/jenkins-slave/workspace/log4net_feature_cd-pipeline-76KUCPODUF6LCE45226EBUR4GNVLYPMYVC23Z4ITBOMNJT3CA2WA:rw,z -v /home/jenkins/jenkins-slave/workspace/log4net_feature_cd-pipeline-76KUCPODUF6LCE45226EBUR4GNVLYPMYVC23Z4ITBOMNJT3CA2WA@tmp:/home/jenkins/jenkins-slave/workspace/log4net_feature_cd-pipeline-76KUCPODUF6LCE45226EBUR4GNVLYPMYVC23Z4ITBOMNJT3CA2WA@tmp:rw,z -e ******** -e ******** -e ******** -e ******** -e ******** -e ******** -e ******** -e ******** -e ******** -e ******** -e ******** -e ******** -e ******** -e ******** -e ******** -e ******** -e ******** -e ******** -e ******** -e ******** -e ******** -e ******** -e ******** -e ******** -e ******** -e ******** -e ******** builder-netstandard:latest cat
$ docker top 5581a74a8a63966bfcba1cbd93406f2ad4f6141489cee90facb3a86ebe8c0d52 -eo pid,comm
[Pipeline] {
[Pipeline] sh
[log4net_feature_cd-pipeline-76KUCPODUF6LCE45226EBUR4GNVLYPMYVC23Z4ITBOMNJT3CA2WA] Running shell script
+ nant compile-netstandard-1.3
NAnt 0.92 (Build 0.92.4526.0; rc1; 05/23/2012)
Copyright (C) 2001-2012 Gerry Shaw
http://nant.sourceforge.net
Buildfile: file:///home/jenkins/jenkins-slave/workspace/log4net_feature_cd-pipeline-76KUCPODUF6LCE45226EBUR4GNVLYPMYVC23Z4ITBOMNJT3CA2WA/log4net.build
Target framework: Mono 4.0 Profile
Target(s) specified: compile-netstandard-1.3
check-current-build-config:
set-build-configuration:
set-debug-build-configuration:
check-current-build-config:
set-build-configuration-flags:
compile-netstandard-1.3:
set-debug-build-configuration:
check-current-build-config:
set-build-configuration-flags:
compile-netstandard-1.3-current-configuration:
[echo] dotnet --version
[exec] 2.1.200
[echo] dotnet restore log4net.netstandard.sln
[exec]
[exec] Welcome to .NET Core!
[exec] ---------------------
[exec] Learn more about .NET Core @ https://aka.ms/dotnet-docs. Use dotnet --help to see available commands or go to https://aka.ms/dotnet-cli-docs.
[exec]
[exec] Telemetry
[exec] --------------
[exec] The .NET Core tools collect usage data in order to improve your experience. The data is anonymous and does not include command-line arguments. The data is collected by Microsoft and shared with the community.
[exec] You can opt out of telemetry by setting a DOTNET_CLI_TELEMETRY_OPTOUT environment variable to 1 using your favorite shell.
[exec] You can read more about .NET Core tools telemetry @ https://aka.ms/dotnet-cli-telemetry.
[exec] Restoring packages for /home/jenkins/jenkins-slave/workspace/log4net_feature_cd-pipeline-76KUCPODUF6LCE45226EBUR4GNVLYPMYVC23Z4ITBOMNJT3CA2WA/netstandard/1.3/log4net.tests/log4net.tests.csproj...
[exec] Restoring packages for /home/jenkins/jenkins-slave/workspace/log4net_feature_cd-pipeline-76KUCPODUF6LCE45226EBUR4GNVLYPMYVC23Z4ITBOMNJT3CA2WA/netstandard/1.3/log4net/log4net.csproj...
[exec] Installing System.Security.Claims 4.0.1.
[exec] Installing System.Security.Principal.Windows 4.0.0.
[exec] Installing System.Net.WebHeaderCollection 4.0.1.
[exec] Installing System.Net.NameResolution 4.0.0.
[exec] Installing System.Net.Requests 4.0.11.
[exec] Installing System.Diagnostics.StackTrace 4.0.1.
[exec] Installing System.IO.FileSystem.Watcher 4.0.0.
[exec] Generating MSBuild file /home/jenkins/jenkins-slave/workspace/log4net_feature_cd-pipeline-76KUCPODUF6LCE45226EBUR4GNVLYPMYVC23Z4ITBOMNJT3CA2WA/netstandard/1.3/log4net/obj/log4net.csproj.nuget.g.props.
[exec] Generating MSBuild file /home/jenkins/jenkins-slave/workspace/log4net_feature_cd-pipeline-76KUCPODUF6LCE45226EBUR4GNVLYPMYVC23Z4ITBOMNJT3CA2WA/netstandard/1.3/log4net/obj/log4net.csproj.nuget.g.targets.
[exec] Restore completed in 2.28 sec for /home/jenkins/jenkins-slave/workspace/log4net_feature_cd-pipeline-76KUCPODUF6LCE45226EBUR4GNVLYPMYVC23Z4ITBOMNJT3CA2WA/netstandard/1.3/log4net/log4net.csproj.
[exec] Installing System.Collections.Specialized 4.0.1.
[exec] Installing System.ComponentModel.Primitives 4.1.0.
[exec] Installing System.ComponentModel 4.0.1.
[exec] Installing System.ComponentModel.TypeConverter 4.1.0.
[exec] Installing System.Diagnostics.TextWriterTraceListener 4.0.0.
[exec] Installing System.ComponentModel.EventBasedAsync 4.0.11.
[exec] Installing Microsoft.DotNet.PlatformAbstractions 1.0.3.
[exec] Installing Microsoft.TestPlatform.ObjectModel 15.5.0.
[exec] Installing Microsoft.Extensions.DependencyModel 1.0.3.
[exec] Installing Microsoft.Win32.Registry 4.3.0.
[exec] Installing Microsoft.TestPlatform.TestHost 15.5.0.
[exec] Installing Microsoft.CodeCoverage 1.0.3.
[exec] Installing System.Diagnostics.Process 4.3.0.
[exec] Installing NUnit 3.10.1.
[exec] Installing NUnit3TestAdapter 3.10.0.
[exec] Installing System.Xml.XPath.XmlDocument 4.3.0.
[exec] Installing System.ComponentModel.EventBasedAsync 4.3.0.
[exec] Installing Microsoft.DotNet.InternalAbstractions 1.0.0.
[exec] Installing Microsoft.NET.Test.Sdk 15.5.0.
[exec] Generating MSBuild file /home/jenkins/jenkins-slave/workspace/log4net_feature_cd-pipeline-76KUCPODUF6LCE45226EBUR4GNVLYPMYVC23Z4ITBOMNJT3CA2WA/netstandard/1.3/log4net.tests/obj/log4net.tests.csproj.nuget.g.props.
[exec] Generating MSBuild file /home/jenkins/jenkins-slave/workspace/log4net_feature_cd-pipeline-76KUCPODUF6LCE45226EBUR4GNVLYPMYVC23Z4ITBOMNJT3CA2WA/netstandard/1.3/log4net.tests/obj/log4net.tests.csproj.nuget.g.targets.
[exec] Restore completed in 3.04 sec for /home/jenkins/jenkins-slave/workspace/log4net_feature_cd-pipeline-76KUCPODUF6LCE45226EBUR4GNVLYPMYVC23Z4ITBOMNJT3CA2WA/netstandard/1.3/log4net.tests/log4net.tests.csproj.
[echo] dotnet build log4net
[exec] Microsoft (R) Build Engine version 15.7.177.53362 for .NET Core
[exec] Copyright (C) Microsoft Corporation. All rights reserved.
[exec]
[exec] Restore completed in 89.1 ms for /home/jenkins/jenkins-slave/workspace/log4net_feature_cd-pipeline-76KUCPODUF6LCE45226EBUR4GNVLYPMYVC23Z4ITBOMNJT3CA2WA/netstandard/1.3/log4net/log4net.csproj.
[exec] log4net -> /home/jenkins/jenkins-slave/workspace/log4net_feature_cd-pipeline-76KUCPODUF6LCE45226EBUR4GNVLYPMYVC23Z4ITBOMNJT3CA2WA/netstandard/1.3/log4net/bin/Debug/netstandard1.3/log4net.dll
[exec]
[exec] Build succeeded.
[exec] 0 Warning(s)
[exec] 0 Error(s)
[exec]
[exec] Time Elapsed 00:00:05.09
[mkdir] Creating directory '/home/jenkins/jenkins-slave/workspace/log4net_feature_cd-pipeline-76KUCPODUF6LCE45226EBUR4GNVLYPMYVC23Z4ITBOMNJT3CA2WA/bin/netstandard/1.3'.
[move] 1 directory moved.
set-release-build-configuration:
check-current-build-config:
set-build-configuration-flags:
compile-netstandard-1.3-current-configuration:
[echo] dotnet --version
[exec] 2.1.200
[echo] dotnet restore log4net.netstandard.sln
[exec] Restore completed in 72.41 ms for /home/jenkins/jenkins-slave/workspace/log4net_feature_cd-pipeline-76KUCPODUF6LCE45226EBUR4GNVLYPMYVC23Z4ITBOMNJT3CA2WA/netstandard/1.3/log4net.tests/log4net.tests.csproj.
[exec] Restore completed in 80.86 ms for /home/jenkins/jenkins-slave/workspace/log4net_feature_cd-pipeline-76KUCPODUF6LCE45226EBUR4GNVLYPMYVC23Z4ITBOMNJT3CA2WA/netstandard/1.3/log4net/log4net.csproj.
[echo] dotnet build log4net
[exec] Microsoft (R) Build Engine version 15.7.177.53362 for .NET Core
[exec] Copyright (C) Microsoft Corporation. All rights reserved.
[exec]
[exec] Restore completed in 92.71 ms for /home/jenkins/jenkins-slave/workspace/log4net_feature_cd-pipeline-76KUCPODUF6LCE45226EBUR4GNVLYPMYVC23Z4ITBOMNJT3CA2WA/netstandard/1.3/log4net/log4net.csproj.
[exec] log4net -> /home/jenkins/jenkins-slave/workspace/log4net_feature_cd-pipeline-76KUCPODUF6LCE45226EBUR4GNVLYPMYVC23Z4ITBOMNJT3CA2WA/netstandard/1.3/log4net/bin/Release/netstandard1.3/log4net.dll
[exec]
[exec] Build succeeded.
[exec] 0 Warning(s)
[exec] 0 Error(s)
[exec]
[exec] Time Elapsed 00:00:03.41
[move] 1 directory moved.
BUILD SUCCEEDED
Total time: 18.7 seconds.
[Pipeline] stash
Stashed 6 file(s)
[Pipeline] sh
[log4net_feature_cd-pipeline-76KUCPODUF6LCE45226EBUR4GNVLYPMYVC23Z4ITBOMNJT3CA2WA] Running shell script
[Pipeline] }
$ docker stop --time=1 5581a74a8a63966bfcba1cbd93406f2ad4f6141489cee90facb3a86ebe8c0d52
[Pipeline] // withDockerContainer
[Pipeline] }
[Pipeline] // script
[Pipeline] }
[Pipeline] // stage
[Pipeline] stage
[Pipeline] { (build net-2.0)
Stage 'build net-2.0' skipped due to earlier failure(s)
[Pipeline] }
[Pipeline] // stage
[Pipeline] stage
[Pipeline] { (build net-3.5)
Stage 'build net-3.5' skipped due to earlier failure(s)
[Pipeline] }
[Pipeline] // stage
[Pipeline] stage
[Pipeline] { (build net-3.5-cp)
Stage 'build net-3.5-cp' skipped due to earlier failure(s)
[Pipeline] }
[Pipeline] // stage
[Pipeline] stage
[Pipeline] { (build net-4.0)
Stage 'build net-4.0' skipped due to earlier failure(s)
[Pipeline] }
[Pipeline] // stage
[Pipeline] stage
[Pipeline] { (build net-4.0-cp)
Stage 'build net-4.0-cp' skipped due to earlier failure(s)
[Pipeline] }
[Pipeline] // stage
[Pipeline] stage
[Pipeline] { (build net-4.5)
Stage 'build net-4.5' skipped due to earlier failure(s)
[Pipeline] }
[Pipeline] // stage
[Pipeline] stage
[Pipeline] { (build mono-2.0)
Stage 'build mono-2.0' skipped due to earlier failure(s)
[Pipeline] }
[Pipeline] // stage
[Pipeline] stage
[Pipeline] { (build mono-3.5)
Stage 'build mono-3.5' skipped due to earlier failure(s)
[Pipeline] }
[Pipeline] // stage
[Pipeline] stage
[Pipeline] { (build mono-4.0)
Stage 'build mono-4.0' skipped due to earlier failure(s)
[Pipeline] }
[Pipeline] // stage
[Pipeline] stage
[Pipeline] { (build site)
Stage 'build site' skipped due to earlier failure(s)
[Pipeline] }
[Pipeline] // stage
[Pipeline] stage
[Pipeline] { (prepare package)
Stage 'prepare package' skipped due to earlier failure(s)
[Pipeline] }
[Pipeline] // stage
[Pipeline] stage
[Pipeline] { (check test results)
Stage 'check test results' skipped due to earlier failure(s)
[Pipeline] }
[Pipeline] // stage
[Pipeline] stage
[Pipeline] { (publish site)
Stage 'publish site' skipped due to earlier failure(s)
[Pipeline] }
[Pipeline] // stage
[Pipeline] stage
[Pipeline] { (Declarative: Post Actions)
[Pipeline] step
Build failed in Jenkins: logging-log4net » feature/cd-pipeline #204
Posted by Apache Jenkins Server <je...@builds.apache.org>.
See <https://builds.apache.org/job/logging-log4net/job/feature%252Fcd-pipeline/204/display/redirect>
------------------------------------------
[...truncated 7.74 KB...]
Step 2/8 : ARG JENKINS_UID
---> Using cache
---> d65b5107ef11
Step 3/8 : ARG JENKINS_GID
---> Using cache
---> b6020a8c63be
Step 4/8 : MAINTAINER "dev@logging.apache.org"
---> Using cache
---> e547e1e03f31
Step 5/8 : RUN mkdir -p /var/workspaces && chmod 0777 /var/workspaces
---> Using cache
---> 0381e939e8f7
Step 6/8 : RUN groupadd -r -g $JENKINS_GID jenkins-slave
---> Using cache
---> 41289c5f78d1
Step 7/8 : RUN useradd --base-dir /var/workspaces --create-home --shell /bin/bash --uid $JENKINS_UID --gid $JENKINS_GID --groups $JENKINS_GID -p -M jenkins
---> Using cache
---> 64fb4259b854
Step 8/8 : RUN apt-get update && apt-get install -y nant git
---> Using cache
---> 3f469df9b609
Successfully built 3f469df9b609
Successfully tagged builder-netstandard:latest
[Pipeline] dockerFingerprintFrom
[Pipeline] sh
[log4net_feature_cd-pipeline-76KUCPODUF6LCE45226EBUR4GNVLYPMYVC23Z4ITBOMNJT3CA2WA] Running shell script
+ docker inspect -f . builder-netstandard:latest
.
[Pipeline] withDockerContainer
H26 does not seem to be running inside a container
$ docker run -t -d -u 910:910 -w /home/jenkins/jenkins-slave/workspace/log4net_feature_cd-pipeline-76KUCPODUF6LCE45226EBUR4GNVLYPMYVC23Z4ITBOMNJT3CA2WA -v /home/jenkins/jenkins-slave/workspace/log4net_feature_cd-pipeline-76KUCPODUF6LCE45226EBUR4GNVLYPMYVC23Z4ITBOMNJT3CA2WA:/home/jenkins/jenkins-slave/workspace/log4net_feature_cd-pipeline-76KUCPODUF6LCE45226EBUR4GNVLYPMYVC23Z4ITBOMNJT3CA2WA:rw,z -v /home/jenkins/jenkins-slave/workspace/log4net_feature_cd-pipeline-76KUCPODUF6LCE45226EBUR4GNVLYPMYVC23Z4ITBOMNJT3CA2WA@tmp:/home/jenkins/jenkins-slave/workspace/log4net_feature_cd-pipeline-76KUCPODUF6LCE45226EBUR4GNVLYPMYVC23Z4ITBOMNJT3CA2WA@tmp:rw,z -e ******** -e ******** -e ******** -e ******** -e ******** -e ******** -e ******** -e ******** -e ******** -e ******** -e ******** -e ******** -e ******** -e ******** -e ******** -e ******** -e ******** -e ******** -e ******** -e ******** -e ******** -e ******** -e ******** -e ******** -e ******** -e ******** -e ******** builder-netstandard:latest cat
$ docker top e7b025f0943fa60d6c17d259a469d63f20075d2751a2b8487e1255cce1ff2135 -eo pid,comm
[Pipeline] {
[Pipeline] sh
[log4net_feature_cd-pipeline-76KUCPODUF6LCE45226EBUR4GNVLYPMYVC23Z4ITBOMNJT3CA2WA] Running shell script
+ nant compile-netstandard-1.3
NAnt 0.92 (Build 0.92.4526.0; rc1; 05/23/2012)
Copyright (C) 2001-2012 Gerry Shaw
http://nant.sourceforge.net
Buildfile: file:///home/jenkins/jenkins-slave/workspace/log4net_feature_cd-pipeline-76KUCPODUF6LCE45226EBUR4GNVLYPMYVC23Z4ITBOMNJT3CA2WA/log4net.build
Target framework: Mono 4.0 Profile
Target(s) specified: compile-netstandard-1.3
check-current-build-config:
set-build-configuration:
set-debug-build-configuration:
check-current-build-config:
set-build-configuration-flags:
compile-netstandard-1.3:
set-debug-build-configuration:
check-current-build-config:
set-build-configuration-flags:
compile-netstandard-1.3-current-configuration:
[echo] dotnet --version
[exec] 2.1.200
[echo] dotnet restore log4net.netstandard.sln
[exec]
[exec] Welcome to .NET Core!
[exec] ---------------------
[exec] Learn more about .NET Core @ https://aka.ms/dotnet-docs. Use dotnet --help to see available commands or go to https://aka.ms/dotnet-cli-docs.
[exec]
[exec] Telemetry
[exec] --------------
[exec] The .NET Core tools collect usage data in order to improve your experience. The data is anonymous and does not include command-line arguments. The data is collected by Microsoft and shared with the community.
[exec] You can opt out of telemetry by setting a DOTNET_CLI_TELEMETRY_OPTOUT environment variable to 1 using your favorite shell.
[exec] You can read more about .NET Core tools telemetry @ https://aka.ms/dotnet-cli-telemetry.
[exec] Restoring packages for /home/jenkins/jenkins-slave/workspace/log4net_feature_cd-pipeline-76KUCPODUF6LCE45226EBUR4GNVLYPMYVC23Z4ITBOMNJT3CA2WA/netstandard/1.3/log4net/log4net.csproj...
[exec] Restoring packages for /home/jenkins/jenkins-slave/workspace/log4net_feature_cd-pipeline-76KUCPODUF6LCE45226EBUR4GNVLYPMYVC23Z4ITBOMNJT3CA2WA/netstandard/1.3/log4net.tests/log4net.tests.csproj...
[exec] Installing System.Security.Claims 4.0.1.
[exec] Installing System.Security.Principal.Windows 4.0.0.
[exec] Installing System.Net.WebHeaderCollection 4.0.1.
[exec] Installing System.Net.NameResolution 4.0.0.
[exec] Installing System.Net.Requests 4.0.11.
[exec] Installing System.IO.FileSystem.Watcher 4.0.0.
[exec] Installing System.Diagnostics.StackTrace 4.0.1.
[exec] Generating MSBuild file /home/jenkins/jenkins-slave/workspace/log4net_feature_cd-pipeline-76KUCPODUF6LCE45226EBUR4GNVLYPMYVC23Z4ITBOMNJT3CA2WA/netstandard/1.3/log4net/obj/log4net.csproj.nuget.g.props.
[exec] Generating MSBuild file /home/jenkins/jenkins-slave/workspace/log4net_feature_cd-pipeline-76KUCPODUF6LCE45226EBUR4GNVLYPMYVC23Z4ITBOMNJT3CA2WA/netstandard/1.3/log4net/obj/log4net.csproj.nuget.g.targets.
[exec] Restore completed in 2.58 sec for /home/jenkins/jenkins-slave/workspace/log4net_feature_cd-pipeline-76KUCPODUF6LCE45226EBUR4GNVLYPMYVC23Z4ITBOMNJT3CA2WA/netstandard/1.3/log4net/log4net.csproj.
[exec] Installing System.ComponentModel 4.0.1.
[exec] Installing System.ComponentModel.Primitives 4.1.0.
[exec] Installing System.Collections.Specialized 4.0.1.
[exec] Installing System.ComponentModel.TypeConverter 4.1.0.
[exec] Installing System.Diagnostics.TextWriterTraceListener 4.0.0.
[exec] Installing System.ComponentModel.EventBasedAsync 4.0.11.
[exec] Installing Microsoft.DotNet.PlatformAbstractions 1.0.3.
[exec] Installing Microsoft.TestPlatform.ObjectModel 15.5.0.
[exec] Installing Microsoft.Extensions.DependencyModel 1.0.3.
[exec] Installing Microsoft.Win32.Registry 4.3.0.
[exec] Installing Microsoft.TestPlatform.TestHost 15.5.0.
[exec] Installing Microsoft.CodeCoverage 1.0.3.
[exec] Installing NUnit 3.10.1.
[exec] Installing NUnit3TestAdapter 3.10.0.
[exec] Installing System.Xml.XPath.XmlDocument 4.3.0.
[exec] Installing System.Diagnostics.Process 4.3.0.
[exec] Installing Microsoft.DotNet.InternalAbstractions 1.0.0.
[exec] Installing System.ComponentModel.EventBasedAsync 4.3.0.
[exec] Installing Microsoft.NET.Test.Sdk 15.5.0.
[exec] Generating MSBuild file /home/jenkins/jenkins-slave/workspace/log4net_feature_cd-pipeline-76KUCPODUF6LCE45226EBUR4GNVLYPMYVC23Z4ITBOMNJT3CA2WA/netstandard/1.3/log4net.tests/obj/log4net.tests.csproj.nuget.g.props.
[exec] Generating MSBuild file /home/jenkins/jenkins-slave/workspace/log4net_feature_cd-pipeline-76KUCPODUF6LCE45226EBUR4GNVLYPMYVC23Z4ITBOMNJT3CA2WA/netstandard/1.3/log4net.tests/obj/log4net.tests.csproj.nuget.g.targets.
[exec] Restore completed in 3.79 sec for /home/jenkins/jenkins-slave/workspace/log4net_feature_cd-pipeline-76KUCPODUF6LCE45226EBUR4GNVLYPMYVC23Z4ITBOMNJT3CA2WA/netstandard/1.3/log4net.tests/log4net.tests.csproj.
[echo] dotnet build log4net
[exec] Microsoft (R) Build Engine version 15.7.177.53362 for .NET Core
[exec] Copyright (C) Microsoft Corporation. All rights reserved.
[exec]
[exec] Restore completed in 70.35 ms for /home/jenkins/jenkins-slave/workspace/log4net_feature_cd-pipeline-76KUCPODUF6LCE45226EBUR4GNVLYPMYVC23Z4ITBOMNJT3CA2WA/netstandard/1.3/log4net/log4net.csproj.
[exec] log4net -> /home/jenkins/jenkins-slave/workspace/log4net_feature_cd-pipeline-76KUCPODUF6LCE45226EBUR4GNVLYPMYVC23Z4ITBOMNJT3CA2WA/netstandard/1.3/log4net/bin/Debug/netstandard1.3/log4net.dll
[exec]
[exec] Build succeeded.
[exec] 0 Warning(s)
[exec] 0 Error(s)
[exec]
[exec] Time Elapsed 00:00:04.88
[mkdir] Creating directory '/home/jenkins/jenkins-slave/workspace/log4net_feature_cd-pipeline-76KUCPODUF6LCE45226EBUR4GNVLYPMYVC23Z4ITBOMNJT3CA2WA/bin/netstandard/1.3'.
[move] 1 directory moved.
set-release-build-configuration:
check-current-build-config:
set-build-configuration-flags:
compile-netstandard-1.3-current-configuration:
[echo] dotnet --version
[exec] 2.1.200
[echo] dotnet restore log4net.netstandard.sln
[exec] Restore completed in 65.27 ms for /home/jenkins/jenkins-slave/workspace/log4net_feature_cd-pipeline-76KUCPODUF6LCE45226EBUR4GNVLYPMYVC23Z4ITBOMNJT3CA2WA/netstandard/1.3/log4net.tests/log4net.tests.csproj.
[exec] Restore completed in 69.9 ms for /home/jenkins/jenkins-slave/workspace/log4net_feature_cd-pipeline-76KUCPODUF6LCE45226EBUR4GNVLYPMYVC23Z4ITBOMNJT3CA2WA/netstandard/1.3/log4net/log4net.csproj.
[echo] dotnet build log4net
[exec] Microsoft (R) Build Engine version 15.7.177.53362 for .NET Core
[exec] Copyright (C) Microsoft Corporation. All rights reserved.
[exec]
[exec] Restore completed in 73.44 ms for /home/jenkins/jenkins-slave/workspace/log4net_feature_cd-pipeline-76KUCPODUF6LCE45226EBUR4GNVLYPMYVC23Z4ITBOMNJT3CA2WA/netstandard/1.3/log4net/log4net.csproj.
[exec] log4net -> /home/jenkins/jenkins-slave/workspace/log4net_feature_cd-pipeline-76KUCPODUF6LCE45226EBUR4GNVLYPMYVC23Z4ITBOMNJT3CA2WA/netstandard/1.3/log4net/bin/Release/netstandard1.3/log4net.dll
[exec]
[exec] Build succeeded.
[exec] 0 Warning(s)
[exec] 0 Error(s)
[exec]
[exec] Time Elapsed 00:00:03.17
[move] 1 directory moved.
BUILD SUCCEEDED
Total time: 19.1 seconds.
[Pipeline] stash
Stashed 6 file(s)
[Pipeline] sh
[log4net_feature_cd-pipeline-76KUCPODUF6LCE45226EBUR4GNVLYPMYVC23Z4ITBOMNJT3CA2WA] Running shell script
[Pipeline] }
$ docker stop --time=1 e7b025f0943fa60d6c17d259a469d63f20075d2751a2b8487e1255cce1ff2135
[Pipeline] // withDockerContainer
[Pipeline] }
[Pipeline] // script
[Pipeline] }
[Pipeline] // stage
[Pipeline] stage
[Pipeline] { (build net-2.0)
Stage 'build net-2.0' skipped due to earlier failure(s)
[Pipeline] }
[Pipeline] // stage
[Pipeline] stage
[Pipeline] { (build net-3.5)
Stage 'build net-3.5' skipped due to earlier failure(s)
[Pipeline] }
[Pipeline] // stage
[Pipeline] stage
[Pipeline] { (build net-3.5-cp)
Stage 'build net-3.5-cp' skipped due to earlier failure(s)
[Pipeline] }
[Pipeline] // stage
[Pipeline] stage
[Pipeline] { (build net-4.0)
Stage 'build net-4.0' skipped due to earlier failure(s)
[Pipeline] }
[Pipeline] // stage
[Pipeline] stage
[Pipeline] { (build net-4.0-cp)
Stage 'build net-4.0-cp' skipped due to earlier failure(s)
[Pipeline] }
[Pipeline] // stage
[Pipeline] stage
[Pipeline] { (build net-4.5)
Stage 'build net-4.5' skipped due to earlier failure(s)
[Pipeline] }
[Pipeline] // stage
[Pipeline] stage
[Pipeline] { (build mono-2.0)
Stage 'build mono-2.0' skipped due to earlier failure(s)
[Pipeline] }
[Pipeline] // stage
[Pipeline] stage
[Pipeline] { (build mono-3.5)
Stage 'build mono-3.5' skipped due to earlier failure(s)
[Pipeline] }
[Pipeline] // stage
[Pipeline] stage
[Pipeline] { (build mono-4.0)
Stage 'build mono-4.0' skipped due to earlier failure(s)
[Pipeline] }
[Pipeline] // stage
[Pipeline] stage
[Pipeline] { (build site)
Stage 'build site' skipped due to earlier failure(s)
[Pipeline] }
[Pipeline] // stage
[Pipeline] stage
[Pipeline] { (prepare package)
Stage 'prepare package' skipped due to earlier failure(s)
[Pipeline] }
[Pipeline] // stage
[Pipeline] stage
[Pipeline] { (check test results)
Stage 'check test results' skipped due to earlier failure(s)
[Pipeline] }
[Pipeline] // stage
[Pipeline] stage
[Pipeline] { (publish site)
Stage 'publish site' skipped due to earlier failure(s)
[Pipeline] }
[Pipeline] // stage
[Pipeline] stage
[Pipeline] { (Declarative: Post Actions)
[Pipeline] step
Build failed in Jenkins: logging-log4net » feature/cd-pipeline #203
Posted by Apache Jenkins Server <je...@builds.apache.org>.
See <https://builds.apache.org/job/logging-log4net/job/feature%252Fcd-pipeline/203/display/redirect>
------------------------------------------
[...truncated 116.04 KB...]
[exec] /home/jenkins/jenkins-slave/workspace/log4net_feature_cd-pipeline-76KUCPODUF6LCE45226EBUR4GNVLYPMYVC23Z4ITBOMNJT3CA2WA/tests/src/Util/SystemInfoTest.cs(186,4): error CS0246: The type or namespace name 'Test' could not be found (are you missing a using directive or an assembly reference?) [/home/jenkins/jenkins-slave/workspace/log4net_feature_cd-pipeline-76KUCPODUF6LCE45226EBUR4GNVLYPMYVC23Z4ITBOMNJT3CA2WA/netstandard/1.3/log4net.tests/log4net.tests.csproj]
[exec] /home/jenkins/jenkins-slave/workspace/log4net_feature_cd-pipeline-76KUCPODUF6LCE45226EBUR4GNVLYPMYVC23Z4ITBOMNJT3CA2WA/tests/src/Util/SystemInfoTest.cs(192,4): error CS0246: The type or namespace name 'TestAttribute' could not be found (are you missing a using directive or an assembly reference?) [/home/jenkins/jenkins-slave/workspace/log4net_feature_cd-pipeline-76KUCPODUF6LCE45226EBUR4GNVLYPMYVC23Z4ITBOMNJT3CA2WA/netstandard/1.3/log4net.tests/log4net.tests.csproj]
[exec] /home/jenkins/jenkins-slave/workspace/log4net_feature_cd-pipeline-76KUCPODUF6LCE45226EBUR4GNVLYPMYVC23Z4ITBOMNJT3CA2WA/tests/src/Util/SystemInfoTest.cs(192,4): error CS0246: The type or namespace name 'Test' could not be found (are you missing a using directive or an assembly reference?) [/home/jenkins/jenkins-slave/workspace/log4net_feature_cd-pipeline-76KUCPODUF6LCE45226EBUR4GNVLYPMYVC23Z4ITBOMNJT3CA2WA/netstandard/1.3/log4net.tests/log4net.tests.csproj]
[exec] /home/jenkins/jenkins-slave/workspace/log4net_feature_cd-pipeline-76KUCPODUF6LCE45226EBUR4GNVLYPMYVC23Z4ITBOMNJT3CA2WA/tests/src/Util/SystemInfoTest.cs(198,4): error CS0246: The type or namespace name 'TestAttribute' could not be found (are you missing a using directive or an assembly reference?) [/home/jenkins/jenkins-slave/workspace/log4net_feature_cd-pipeline-76KUCPODUF6LCE45226EBUR4GNVLYPMYVC23Z4ITBOMNJT3CA2WA/netstandard/1.3/log4net.tests/log4net.tests.csproj]
[exec] /home/jenkins/jenkins-slave/workspace/log4net_feature_cd-pipeline-76KUCPODUF6LCE45226EBUR4GNVLYPMYVC23Z4ITBOMNJT3CA2WA/tests/src/Util/SystemInfoTest.cs(198,4): error CS0246: The type or namespace name 'Test' could not be found (are you missing a using directive or an assembly reference?) [/home/jenkins/jenkins-slave/workspace/log4net_feature_cd-pipeline-76KUCPODUF6LCE45226EBUR4GNVLYPMYVC23Z4ITBOMNJT3CA2WA/netstandard/1.3/log4net.tests/log4net.tests.csproj]
[exec] /home/jenkins/jenkins-slave/workspace/log4net_feature_cd-pipeline-76KUCPODUF6LCE45226EBUR4GNVLYPMYVC23Z4ITBOMNJT3CA2WA/tests/src/Util/SystemInfoTest.cs(204,4): error CS0246: The type or namespace name 'TestAttribute' could not be found (are you missing a using directive or an assembly reference?) [/home/jenkins/jenkins-slave/workspace/log4net_feature_cd-pipeline-76KUCPODUF6LCE45226EBUR4GNVLYPMYVC23Z4ITBOMNJT3CA2WA/netstandard/1.3/log4net.tests/log4net.tests.csproj]
[exec] /home/jenkins/jenkins-slave/workspace/log4net_feature_cd-pipeline-76KUCPODUF6LCE45226EBUR4GNVLYPMYVC23Z4ITBOMNJT3CA2WA/tests/src/Util/SystemInfoTest.cs(204,4): error CS0246: The type or namespace name 'Test' could not be found (are you missing a using directive or an assembly reference?) [/home/jenkins/jenkins-slave/workspace/log4net_feature_cd-pipeline-76KUCPODUF6LCE45226EBUR4GNVLYPMYVC23Z4ITBOMNJT3CA2WA/netstandard/1.3/log4net.tests/log4net.tests.csproj]
[exec] /home/jenkins/jenkins-slave/workspace/log4net_feature_cd-pipeline-76KUCPODUF6LCE45226EBUR4GNVLYPMYVC23Z4ITBOMNJT3CA2WA/tests/src/Appender/RollingFileAppenderTest.cs(1282,93): error CS0246: The type or namespace name 'RollingFileAppender' could not be found (are you missing a using directive or an assembly reference?) [/home/jenkins/jenkins-slave/workspace/log4net_feature_cd-pipeline-76KUCPODUF6LCE45226EBUR4GNVLYPMYVC23Z4ITBOMNJT3CA2WA/netstandard/1.3/log4net.tests/log4net.tests.csproj]
[exec] /home/jenkins/jenkins-slave/workspace/log4net_feature_cd-pipeline-76KUCPODUF6LCE45226EBUR4GNVLYPMYVC23Z4ITBOMNJT3CA2WA/tests/src/Appender/RollingFileAppenderTest.cs(1307,18): error CS0246: The type or namespace name 'RollingFileAppender' could not be found (are you missing a using directive or an assembly reference?) [/home/jenkins/jenkins-slave/workspace/log4net_feature_cd-pipeline-76KUCPODUF6LCE45226EBUR4GNVLYPMYVC23Z4ITBOMNJT3CA2WA/netstandard/1.3/log4net.tests/log4net.tests.csproj]
[exec] /home/jenkins/jenkins-slave/workspace/log4net_feature_cd-pipeline-76KUCPODUF6LCE45226EBUR4GNVLYPMYVC23Z4ITBOMNJT3CA2WA/tests/src/Appender/RollingFileAppenderTest.cs(1397,56): error CS0246: The type or namespace name 'FileAppender' could not be found (are you missing a using directive or an assembly reference?) [/home/jenkins/jenkins-slave/workspace/log4net_feature_cd-pipeline-76KUCPODUF6LCE45226EBUR4GNVLYPMYVC23Z4ITBOMNJT3CA2WA/netstandard/1.3/log4net.tests/log4net.tests.csproj]
[exec] /home/jenkins/jenkins-slave/workspace/log4net_feature_cd-pipeline-76KUCPODUF6LCE45226EBUR4GNVLYPMYVC23Z4ITBOMNJT3CA2WA/tests/src/Appender/RollingFileAppenderTest.cs(1397,97): error CS0246: The type or namespace name 'IErrorHandler' could not be found (are you missing a using directive or an assembly reference?) [/home/jenkins/jenkins-slave/workspace/log4net_feature_cd-pipeline-76KUCPODUF6LCE45226EBUR4GNVLYPMYVC23Z4ITBOMNJT3CA2WA/netstandard/1.3/log4net.tests/log4net.tests.csproj]
[exec] /home/jenkins/jenkins-slave/workspace/log4net_feature_cd-pipeline-76KUCPODUF6LCE45226EBUR4GNVLYPMYVC23Z4ITBOMNJT3CA2WA/tests/src/Appender/RollingFileAppenderTest.cs(1397,18): error CS0246: The type or namespace name 'ILogger' could not be found (are you missing a using directive or an assembly reference?) [/home/jenkins/jenkins-slave/workspace/log4net_feature_cd-pipeline-76KUCPODUF6LCE45226EBUR4GNVLYPMYVC23Z4ITBOMNJT3CA2WA/netstandard/1.3/log4net.tests/log4net.tests.csproj]
[exec] /home/jenkins/jenkins-slave/workspace/log4net_feature_cd-pipeline-76KUCPODUF6LCE45226EBUR4GNVLYPMYVC23Z4ITBOMNJT3CA2WA/tests/src/Appender/RollingFileAppenderTest.cs(1411,56): error CS0246: The type or namespace name 'FileAppender' could not be found (are you missing a using directive or an assembly reference?) [/home/jenkins/jenkins-slave/workspace/log4net_feature_cd-pipeline-76KUCPODUF6LCE45226EBUR4GNVLYPMYVC23Z4ITBOMNJT3CA2WA/netstandard/1.3/log4net.tests/log4net.tests.csproj]
[exec] /home/jenkins/jenkins-slave/workspace/log4net_feature_cd-pipeline-76KUCPODUF6LCE45226EBUR4GNVLYPMYVC23Z4ITBOMNJT3CA2WA/tests/src/Appender/RollingFileAppenderTest.cs(1411,97): error CS0246: The type or namespace name 'IErrorHandler' could not be found (are you missing a using directive or an assembly reference?) [/home/jenkins/jenkins-slave/workspace/log4net_feature_cd-pipeline-76KUCPODUF6LCE45226EBUR4GNVLYPMYVC23Z4ITBOMNJT3CA2WA/netstandard/1.3/log4net.tests/log4net.tests.csproj]
[exec] /home/jenkins/jenkins-slave/workspace/log4net_feature_cd-pipeline-76KUCPODUF6LCE45226EBUR4GNVLYPMYVC23Z4ITBOMNJT3CA2WA/tests/src/Appender/RollingFileAppenderTest.cs(1411,18): error CS0246: The type or namespace name 'ILogger' could not be found (are you missing a using directive or an assembly reference?) [/home/jenkins/jenkins-slave/workspace/log4net_feature_cd-pipeline-76KUCPODUF6LCE45226EBUR4GNVLYPMYVC23Z4ITBOMNJT3CA2WA/netstandard/1.3/log4net.tests/log4net.tests.csproj]
[exec] /home/jenkins/jenkins-slave/workspace/log4net_feature_cd-pipeline-76KUCPODUF6LCE45226EBUR4GNVLYPMYVC23Z4ITBOMNJT3CA2WA/tests/src/Appender/RollingFileAppenderTest.cs(1948,45): error CS0246: The type or namespace name 'RollingFileAppender' could not be found (are you missing a using directive or an assembly reference?) [/home/jenkins/jenkins-slave/workspace/log4net_feature_cd-pipeline-76KUCPODUF6LCE45226EBUR4GNVLYPMYVC23Z4ITBOMNJT3CA2WA/netstandard/1.3/log4net.tests/log4net.tests.csproj]
[exec] /home/jenkins/jenkins-slave/workspace/log4net_feature_cd-pipeline-76KUCPODUF6LCE45226EBUR4GNVLYPMYVC23Z4ITBOMNJT3CA2WA/tests/src/Appender/RollingFileAppenderTest.cs(1953,49): error CS0246: The type or namespace name 'RollingFileAppender' could not be found (are you missing a using directive or an assembly reference?) [/home/jenkins/jenkins-slave/workspace/log4net_feature_cd-pipeline-76KUCPODUF6LCE45226EBUR4GNVLYPMYVC23Z4ITBOMNJT3CA2WA/netstandard/1.3/log4net.tests/log4net.tests.csproj]
[exec] /home/jenkins/jenkins-slave/workspace/log4net_feature_cd-pipeline-76KUCPODUF6LCE45226EBUR4GNVLYPMYVC23Z4ITBOMNJT3CA2WA/tests/src/Appender/RollingFileAppenderTest.cs(1958,50): error CS0246: The type or namespace name 'RollingFileAppender' could not be found (are you missing a using directive or an assembly reference?) [/home/jenkins/jenkins-slave/workspace/log4net_feature_cd-pipeline-76KUCPODUF6LCE45226EBUR4GNVLYPMYVC23Z4ITBOMNJT3CA2WA/netstandard/1.3/log4net.tests/log4net.tests.csproj]
[exec] /home/jenkins/jenkins-slave/workspace/log4net_feature_cd-pipeline-76KUCPODUF6LCE45226EBUR4GNVLYPMYVC23Z4ITBOMNJT3CA2WA/tests/src/Appender/RollingFileAppenderTest.cs(1963,50): error CS0246: The type or namespace name 'RollingFileAppender' could not be found (are you missing a using directive or an assembly reference?) [/home/jenkins/jenkins-slave/workspace/log4net_feature_cd-pipeline-76KUCPODUF6LCE45226EBUR4GNVLYPMYVC23Z4ITBOMNJT3CA2WA/netstandard/1.3/log4net.tests/log4net.tests.csproj]
[exec] /home/jenkins/jenkins-slave/workspace/log4net_feature_cd-pipeline-76KUCPODUF6LCE45226EBUR4GNVLYPMYVC23Z4ITBOMNJT3CA2WA/tests/src/Appender/RollingFileAppenderTest.cs(53,11): error CS0246: The type or namespace name 'Logger' could not be found (are you missing a using directive or an assembly reference?) [/home/jenkins/jenkins-slave/workspace/log4net_feature_cd-pipeline-76KUCPODUF6LCE45226EBUR4GNVLYPMYVC23Z4ITBOMNJT3CA2WA/netstandard/1.3/log4net.tests/log4net.tests.csproj]
[exec] /home/jenkins/jenkins-slave/workspace/log4net_feature_cd-pipeline-76KUCPODUF6LCE45226EBUR4GNVLYPMYVC23Z4ITBOMNJT3CA2WA/tests/src/Appender/RollingFileAppenderTest.cs(113,4): error CS0246: The type or namespace name 'SetUpAttribute' could not be found (are you missing a using directive or an assembly reference?) [/home/jenkins/jenkins-slave/workspace/log4net_feature_cd-pipeline-76KUCPODUF6LCE45226EBUR4GNVLYPMYVC23Z4ITBOMNJT3CA2WA/netstandard/1.3/log4net.tests/log4net.tests.csproj]
[exec] /home/jenkins/jenkins-slave/workspace/log4net_feature_cd-pipeline-76KUCPODUF6LCE45226EBUR4GNVLYPMYVC23Z4ITBOMNJT3CA2WA/tests/src/Appender/RollingFileAppenderTest.cs(113,4): error CS0246: The type or namespace name 'SetUp' could not be found (are you missing a using directive or an assembly reference?) [/home/jenkins/jenkins-slave/workspace/log4net_feature_cd-pipeline-76KUCPODUF6LCE45226EBUR4GNVLYPMYVC23Z4ITBOMNJT3CA2WA/netstandard/1.3/log4net.tests/log4net.tests.csproj]
[exec] /home/jenkins/jenkins-slave/workspace/log4net_feature_cd-pipeline-76KUCPODUF6LCE45226EBUR4GNVLYPMYVC23Z4ITBOMNJT3CA2WA/tests/src/Appender/RollingFileAppenderTest.cs(130,4): error CS0246: The type or namespace name 'TearDownAttribute' could not be found (are you missing a using directive or an assembly reference?) [/home/jenkins/jenkins-slave/workspace/log4net_feature_cd-pipeline-76KUCPODUF6LCE45226EBUR4GNVLYPMYVC23Z4ITBOMNJT3CA2WA/netstandard/1.3/log4net.tests/log4net.tests.csproj]
[exec] /home/jenkins/jenkins-slave/workspace/log4net_feature_cd-pipeline-76KUCPODUF6LCE45226EBUR4GNVLYPMYVC23Z4ITBOMNJT3CA2WA/tests/src/Appender/RollingFileAppenderTest.cs(130,4): error CS0246: The type or namespace name 'TearDown' could not be found (are you missing a using directive or an assembly reference?) [/home/jenkins/jenkins-slave/workspace/log4net_feature_cd-pipeline-76KUCPODUF6LCE45226EBUR4GNVLYPMYVC23Z4ITBOMNJT3CA2WA/netstandard/1.3/log4net.tests/log4net.tests.csproj]
[exec] /home/jenkins/jenkins-slave/workspace/log4net_feature_cd-pipeline-76KUCPODUF6LCE45226EBUR4GNVLYPMYVC23Z4ITBOMNJT3CA2WA/tests/src/Appender/RollingFileAppenderTest.cs(194,4): error CS0246: The type or namespace name 'TestAttribute' could not be found (are you missing a using directive or an assembly reference?) [/home/jenkins/jenkins-slave/workspace/log4net_feature_cd-pipeline-76KUCPODUF6LCE45226EBUR4GNVLYPMYVC23Z4ITBOMNJT3CA2WA/netstandard/1.3/log4net.tests/log4net.tests.csproj]
[exec] /home/jenkins/jenkins-slave/workspace/log4net_feature_cd-pipeline-76KUCPODUF6LCE45226EBUR4GNVLYPMYVC23Z4ITBOMNJT3CA2WA/tests/src/Appender/RollingFileAppenderTest.cs(194,4): error CS0246: The type or namespace name 'Test' could not be found (are you missing a using directive or an assembly reference?) [/home/jenkins/jenkins-slave/workspace/log4net_feature_cd-pipeline-76KUCPODUF6LCE45226EBUR4GNVLYPMYVC23Z4ITBOMNJT3CA2WA/netstandard/1.3/log4net.tests/log4net.tests.csproj]
[exec] /home/jenkins/jenkins-slave/workspace/log4net_feature_cd-pipeline-76KUCPODUF6LCE45226EBUR4GNVLYPMYVC23Z4ITBOMNJT3CA2WA/tests/src/Appender/RollingFileAppenderTest.cs(204,4): error CS0246: The type or namespace name 'TestAttribute' could not be found (are you missing a using directive or an assembly reference?) [/home/jenkins/jenkins-slave/workspace/log4net_feature_cd-pipeline-76KUCPODUF6LCE45226EBUR4GNVLYPMYVC23Z4ITBOMNJT3CA2WA/netstandard/1.3/log4net.tests/log4net.tests.csproj]
[exec] /home/jenkins/jenkins-slave/workspace/log4net_feature_cd-pipeline-76KUCPODUF6LCE45226EBUR4GNVLYPMYVC23Z4ITBOMNJT3CA2WA/tests/src/Appender/RollingFileAppenderTest.cs(204,4): error CS0246: The type or namespace name 'Test' could not be found (are you missing a using directive or an assembly reference?) [/home/jenkins/jenkins-slave/workspace/log4net_feature_cd-pipeline-76KUCPODUF6LCE45226EBUR4GNVLYPMYVC23Z4ITBOMNJT3CA2WA/netstandard/1.3/log4net.tests/log4net.tests.csproj]
[exec] /home/jenkins/jenkins-slave/workspace/log4net_feature_cd-pipeline-76KUCPODUF6LCE45226EBUR4GNVLYPMYVC23Z4ITBOMNJT3CA2WA/tests/src/Appender/RollingFileAppenderTest.cs(918,4): error CS0246: The type or namespace name 'TestAttribute' could not be found (are you missing a using directive or an assembly reference?) [/home/jenkins/jenkins-slave/workspace/log4net_feature_cd-pipeline-76KUCPODUF6LCE45226EBUR4GNVLYPMYVC23Z4ITBOMNJT3CA2WA/netstandard/1.3/log4net.tests/log4net.tests.csproj]
[exec] /home/jenkins/jenkins-slave/workspace/log4net_feature_cd-pipeline-76KUCPODUF6LCE45226EBUR4GNVLYPMYVC23Z4ITBOMNJT3CA2WA/tests/src/Appender/RollingFileAppenderTest.cs(918,4): error CS0246: The type or namespace name 'Test' could not be found (are you missing a using directive or an assembly reference?) [/home/jenkins/jenkins-slave/workspace/log4net_feature_cd-pipeline-76KUCPODUF6LCE45226EBUR4GNVLYPMYVC23Z4ITBOMNJT3CA2WA/netstandard/1.3/log4net.tests/log4net.tests.csproj]
[exec] /home/jenkins/jenkins-slave/workspace/log4net_feature_cd-pipeline-76KUCPODUF6LCE45226EBUR4GNVLYPMYVC23Z4ITBOMNJT3CA2WA/tests/src/Appender/RollingFileAppenderTest.cs(947,4): error CS0246: The type or namespace name 'TestAttribute' could not be found (are you missing a using directive or an assembly reference?) [/home/jenkins/jenkins-slave/workspace/log4net_feature_cd-pipeline-76KUCPODUF6LCE45226EBUR4GNVLYPMYVC23Z4ITBOMNJT3CA2WA/netstandard/1.3/log4net.tests/log4net.tests.csproj]
[exec] /home/jenkins/jenkins-slave/workspace/log4net_feature_cd-pipeline-76KUCPODUF6LCE45226EBUR4GNVLYPMYVC23Z4ITBOMNJT3CA2WA/tests/src/Appender/RollingFileAppenderTest.cs(947,4): error CS0246: The type or namespace name 'Test' could not be found (are you missing a using directive or an assembly reference?) [/home/jenkins/jenkins-slave/workspace/log4net_feature_cd-pipeline-76KUCPODUF6LCE45226EBUR4GNVLYPMYVC23Z4ITBOMNJT3CA2WA/netstandard/1.3/log4net.tests/log4net.tests.csproj]
[exec] /home/jenkins/jenkins-slave/workspace/log4net_feature_cd-pipeline-76KUCPODUF6LCE45226EBUR4GNVLYPMYVC23Z4ITBOMNJT3CA2WA/tests/src/Appender/RollingFileAppenderTest.cs(980,4): error CS0246: The type or namespace name 'TestAttribute' could not be found (are you missing a using directive or an assembly reference?) [/home/jenkins/jenkins-slave/workspace/log4net_feature_cd-pipeline-76KUCPODUF6LCE45226EBUR4GNVLYPMYVC23Z4ITBOMNJT3CA2WA/netstandard/1.3/log4net.tests/log4net.tests.csproj]
[exec] /home/jenkins/jenkins-slave/workspace/log4net_feature_cd-pipeline-76KUCPODUF6LCE45226EBUR4GNVLYPMYVC23Z4ITBOMNJT3CA2WA/tests/src/Appender/RollingFileAppenderTest.cs(980,4): error CS0246: The type or namespace name 'Test' could not be found (are you missing a using directive or an assembly reference?) [/home/jenkins/jenkins-slave/workspace/log4net_feature_cd-pipeline-76KUCPODUF6LCE45226EBUR4GNVLYPMYVC23Z4ITBOMNJT3CA2WA/netstandard/1.3/log4net.tests/log4net.tests.csproj]
[exec] /home/jenkins/jenkins-slave/workspace/log4net_feature_cd-pipeline-76KUCPODUF6LCE45226EBUR4GNVLYPMYVC23Z4ITBOMNJT3CA2WA/tests/src/Appender/RollingFileAppenderTest.cs(1014,4): error CS0246: The type or namespace name 'TestAttribute' could not be found (are you missing a using directive or an assembly reference?) [/home/jenkins/jenkins-slave/workspace/log4net_feature_cd-pipeline-76KUCPODUF6LCE45226EBUR4GNVLYPMYVC23Z4ITBOMNJT3CA2WA/netstandard/1.3/log4net.tests/log4net.tests.csproj]
[exec] /home/jenkins/jenkins-slave/workspace/log4net_feature_cd-pipeline-76KUCPODUF6LCE45226EBUR4GNVLYPMYVC23Z4ITBOMNJT3CA2WA/tests/src/Appender/RollingFileAppenderTest.cs(1014,4): error CS0246: The type or namespace name 'Test' could not be found (are you missing a using directive or an assembly reference?) [/home/jenkins/jenkins-slave/workspace/log4net_feature_cd-pipeline-76KUCPODUF6LCE45226EBUR4GNVLYPMYVC23Z4ITBOMNJT3CA2WA/netstandard/1.3/log4net.tests/log4net.tests.csproj]
[exec] /home/jenkins/jenkins-slave/workspace/log4net_feature_cd-pipeline-76KUCPODUF6LCE45226EBUR4GNVLYPMYVC23Z4ITBOMNJT3CA2WA/tests/src/Appender/RollingFileAppenderTest.cs(1043,4): error CS0246: The type or namespace name 'TestAttribute' could not be found (are you missing a using directive or an assembly reference?) [/home/jenkins/jenkins-slave/workspace/log4net_feature_cd-pipeline-76KUCPODUF6LCE45226EBUR4GNVLYPMYVC23Z4ITBOMNJT3CA2WA/netstandard/1.3/log4net.tests/log4net.tests.csproj]
[exec] /home/jenkins/jenkins-slave/workspace/log4net_feature_cd-pipeline-76KUCPODUF6LCE45226EBUR4GNVLYPMYVC23Z4ITBOMNJT3CA2WA/tests/src/Appender/RollingFileAppenderTest.cs(1043,4): error CS0246: The type or namespace name 'Test' could not be found (are you missing a using directive or an assembly reference?) [/home/jenkins/jenkins-slave/workspace/log4net_feature_cd-pipeline-76KUCPODUF6LCE45226EBUR4GNVLYPMYVC23Z4ITBOMNJT3CA2WA/netstandard/1.3/log4net.tests/log4net.tests.csproj]
[exec] /home/jenkins/jenkins-slave/workspace/log4net_feature_cd-pipeline-76KUCPODUF6LCE45226EBUR4GNVLYPMYVC23Z4ITBOMNJT3CA2WA/tests/src/Appender/RollingFileAppenderTest.cs(1076,4): error CS0246: The type or namespace name 'TestAttribute' could not be found (are you missing a using directive or an assembly reference?) [/home/jenkins/jenkins-slave/workspace/log4net_feature_cd-pipeline-76KUCPODUF6LCE45226EBUR4GNVLYPMYVC23Z4ITBOMNJT3CA2WA/netstandard/1.3/log4net.tests/log4net.tests.csproj]
[exec] /home/jenkins/jenkins-slave/workspace/log4net_feature_cd-pipeline-76KUCPODUF6LCE45226EBUR4GNVLYPMYVC23Z4ITBOMNJT3CA2WA/tests/src/Appender/RollingFileAppenderTest.cs(1076,4): error CS0246: The type or namespace name 'Test' could not be found (are you missing a using directive or an assembly reference?) [/home/jenkins/jenkins-slave/workspace/log4net_feature_cd-pipeline-76KUCPODUF6LCE45226EBUR4GNVLYPMYVC23Z4ITBOMNJT3CA2WA/netstandard/1.3/log4net.tests/log4net.tests.csproj]
[exec] /home/jenkins/jenkins-slave/workspace/log4net_feature_cd-pipeline-76KUCPODUF6LCE45226EBUR4GNVLYPMYVC23Z4ITBOMNJT3CA2WA/tests/src/Appender/RollingFileAppenderTest.cs(1138,4): error CS0246: The type or namespace name 'TestAttribute' could not be found (are you missing a using directive or an assembly reference?) [/home/jenkins/jenkins-slave/workspace/log4net_feature_cd-pipeline-76KUCPODUF6LCE45226EBUR4GNVLYPMYVC23Z4ITBOMNJT3CA2WA/netstandard/1.3/log4net.tests/log4net.tests.csproj]
[exec] /home/jenkins/jenkins-slave/workspace/log4net_feature_cd-pipeline-76KUCPODUF6LCE45226EBUR4GNVLYPMYVC23Z4ITBOMNJT3CA2WA/tests/src/Appender/RollingFileAppenderTest.cs(1138,4): error CS0246: The type or namespace name 'Test' could not be found (are you missing a using directive or an assembly reference?) [/home/jenkins/jenkins-slave/workspace/log4net_feature_cd-pipeline-76KUCPODUF6LCE45226EBUR4GNVLYPMYVC23Z4ITBOMNJT3CA2WA/netstandard/1.3/log4net.tests/log4net.tests.csproj]
[exec] /home/jenkins/jenkins-slave/workspace/log4net_feature_cd-pipeline-76KUCPODUF6LCE45226EBUR4GNVLYPMYVC23Z4ITBOMNJT3CA2WA/tests/src/Appender/RollingFileAppenderTest.cs(1168,4): error CS0246: The type or namespace name 'TestAttribute' could not be found (are you missing a using directive or an assembly reference?) [/home/jenkins/jenkins-slave/workspace/log4net_feature_cd-pipeline-76KUCPODUF6LCE45226EBUR4GNVLYPMYVC23Z4ITBOMNJT3CA2WA/netstandard/1.3/log4net.tests/log4net.tests.csproj]
[exec] /home/jenkins/jenkins-slave/workspace/log4net_feature_cd-pipeline-76KUCPODUF6LCE45226EBUR4GNVLYPMYVC23Z4ITBOMNJT3CA2WA/tests/src/Appender/RollingFileAppenderTest.cs(1168,4): error CS0246: The type or namespace name 'Test' could not be found (are you missing a using directive or an assembly reference?) [/home/jenkins/jenkins-slave/workspace/log4net_feature_cd-pipeline-76KUCPODUF6LCE45226EBUR4GNVLYPMYVC23Z4ITBOMNJT3CA2WA/netstandard/1.3/log4net.tests/log4net.tests.csproj]
[exec] /home/jenkins/jenkins-slave/workspace/log4net_feature_cd-pipeline-76KUCPODUF6LCE45226EBUR4GNVLYPMYVC23Z4ITBOMNJT3CA2WA/tests/src/Appender/RollingFileAppenderTest.cs(1179,4): error CS0246: The type or namespace name 'TestAttribute' could not be found (are you missing a using directive or an assembly reference?) [/home/jenkins/jenkins-slave/workspace/log4net_feature_cd-pipeline-76KUCPODUF6LCE45226EBUR4GNVLYPMYVC23Z4ITBOMNJT3CA2WA/netstandard/1.3/log4net.tests/log4net.tests.csproj]
[exec] /home/jenkins/jenkins-slave/workspace/log4net_feature_cd-pipeline-76KUCPODUF6LCE45226EBUR4GNVLYPMYVC23Z4ITBOMNJT3CA2WA/tests/src/Appender/RollingFileAppenderTest.cs(1179,4): error CS0246: The type or namespace name 'Test' could not be found (are you missing a using directive or an assembly reference?) [/home/jenkins/jenkins-slave/workspace/log4net_feature_cd-pipeline-76KUCPODUF6LCE45226EBUR4GNVLYPMYVC23Z4ITBOMNJT3CA2WA/netstandard/1.3/log4net.tests/log4net.tests.csproj]
[exec] /home/jenkins/jenkins-slave/workspace/log4net_feature_cd-pipeline-76KUCPODUF6LCE45226EBUR4GNVLYPMYVC23Z4ITBOMNJT3CA2WA/tests/src/Appender/RollingFileAppenderTest.cs(1191,4): error CS0246: The type or namespace name 'TestAttribute' could not be found (are you missing a using directive or an assembly reference?) [/home/jenkins/jenkins-slave/workspace/log4net_feature_cd-pipeline-76KUCPODUF6LCE45226EBUR4GNVLYPMYVC23Z4ITBOMNJT3CA2WA/netstandard/1.3/log4net.tests/log4net.tests.csproj]
[exec] /home/jenkins/jenkins-slave/workspace/log4net_feature_cd-pipeline-76KUCPODUF6LCE45226EBUR4GNVLYPMYVC23Z4ITBOMNJT3CA2WA/tests/src/Appender/RollingFileAppenderTest.cs(1191,4): error CS0246: The type or namespace name 'Test' could not be found (are you missing a using directive or an assembly reference?) [/home/jenkins/jenkins-slave/workspace/log4net_feature_cd-pipeline-76KUCPODUF6LCE45226EBUR4GNVLYPMYVC23Z4ITBOMNJT3CA2WA/netstandard/1.3/log4net.tests/log4net.tests.csproj]
[exec] /home/jenkins/jenkins-slave/workspace/log4net_feature_cd-pipeline-76KUCPODUF6LCE45226EBUR4GNVLYPMYVC23Z4ITBOMNJT3CA2WA/tests/src/Appender/RollingFileAppenderTest.cs(1203,4): error CS0246: The type or namespace name 'TestAttribute' could not be found (are you missing a using directive or an assembly reference?) [/home/jenkins/jenkins-slave/workspace/log4net_feature_cd-pipeline-76KUCPODUF6LCE45226EBUR4GNVLYPMYVC23Z4ITBOMNJT3CA2WA/netstandard/1.3/log4net.tests/log4net.tests.csproj]
[exec] /home/jenkins/jenkins-slave/workspace/log4net_feature_cd-pipeline-76KUCPODUF6LCE45226EBUR4GNVLYPMYVC23Z4ITBOMNJT3CA2WA/tests/src/Appender/RollingFileAppenderTest.cs(1203,4): error CS0246: The type or namespace name 'Test' could not be found (are you missing a using directive or an assembly reference?) [/home/jenkins/jenkins-slave/workspace/log4net_feature_cd-pipeline-76KUCPODUF6LCE45226EBUR4GNVLYPMYVC23Z4ITBOMNJT3CA2WA/netstandard/1.3/log4net.tests/log4net.tests.csproj]
[exec] /home/jenkins/jenkins-slave/workspace/log4net_feature_cd-pipeline-76KUCPODUF6LCE45226EBUR4GNVLYPMYVC23Z4ITBOMNJT3CA2WA/tests/src/Appender/RollingFileAppenderTest.cs(1215,4): error CS0246: The type or namespace name 'TestAttribute' could not be found (are you missing a using directive or an assembly reference?) [/home/jenkins/jenkins-slave/workspace/log4net_feature_cd-pipeline-76KUCPODUF6LCE45226EBUR4GNVLYPMYVC23Z4ITBOMNJT3CA2WA/netstandard/1.3/log4net.tests/log4net.tests.csproj]
[exec] /home/jenkins/jenkins-slave/workspace/log4net_feature_cd-pipeline-76KUCPODUF6LCE45226EBUR4GNVLYPMYVC23Z4ITBOMNJT3CA2WA/tests/src/Appender/RollingFileAppenderTest.cs(1215,4): error CS0246: The type or namespace name 'Test' could not be found (are you missing a using directive or an assembly reference?) [/home/jenkins/jenkins-slave/workspace/log4net_feature_cd-pipeline-76KUCPODUF6LCE45226EBUR4GNVLYPMYVC23Z4ITBOMNJT3CA2WA/netstandard/1.3/log4net.tests/log4net.tests.csproj]
[exec] /home/jenkins/jenkins-slave/workspace/log4net_feature_cd-pipeline-76KUCPODUF6LCE45226EBUR4GNVLYPMYVC23Z4ITBOMNJT3CA2WA/tests/src/Appender/RollingFileAppenderTest.cs(1225,4): error CS0246: The type or namespace name 'TestAttribute' could not be found (are you missing a using directive or an assembly reference?) [/home/jenkins/jenkins-slave/workspace/log4net_feature_cd-pipeline-76KUCPODUF6LCE45226EBUR4GNVLYPMYVC23Z4ITBOMNJT3CA2WA/netstandard/1.3/log4net.tests/log4net.tests.csproj]
[exec] /home/jenkins/jenkins-slave/workspace/log4net_feature_cd-pipeline-76KUCPODUF6LCE45226EBUR4GNVLYPMYVC23Z4ITBOMNJT3CA2WA/tests/src/Appender/RollingFileAppenderTest.cs(1225,4): error CS0246: The type or namespace name 'Test' could not be found (are you missing a using directive or an assembly reference?) [/home/jenkins/jenkins-slave/workspace/log4net_feature_cd-pipeline-76KUCPODUF6LCE45226EBUR4GNVLYPMYVC23Z4ITBOMNJT3CA2WA/netstandard/1.3/log4net.tests/log4net.tests.csproj]
[exec] /home/jenkins/jenkins-slave/workspace/log4net_feature_cd-pipeline-76KUCPODUF6LCE45226EBUR4GNVLYPMYVC23Z4ITBOMNJT3CA2WA/tests/src/Appender/RollingFileAppenderTest.cs(1235,4): error CS0246: The type or namespace name 'TestAttribute' could not be found (are you missing a using directive or an assembly reference?) [/home/jenkins/jenkins-slave/workspace/log4net_feature_cd-pipeline-76KUCPODUF6LCE45226EBUR4GNVLYPMYVC23Z4ITBOMNJT3CA2WA/netstandard/1.3/log4net.tests/log4net.tests.csproj]
[exec] /home/jenkins/jenkins-slave/workspace/log4net_feature_cd-pipeline-76KUCPODUF6LCE45226EBUR4GNVLYPMYVC23Z4ITBOMNJT3CA2WA/tests/src/Appender/RollingFileAppenderTest.cs(1235,4): error CS0246: The type or namespace name 'Test' could not be found (are you missing a using directive or an assembly reference?) [/home/jenkins/jenkins-slave/workspace/log4net_feature_cd-pipeline-76KUCPODUF6LCE45226EBUR4GNVLYPMYVC23Z4ITBOMNJT3CA2WA/netstandard/1.3/log4net.tests/log4net.tests.csproj]
[exec] /home/jenkins/jenkins-slave/workspace/log4net_feature_cd-pipeline-76KUCPODUF6LCE45226EBUR4GNVLYPMYVC23Z4ITBOMNJT3CA2WA/tests/src/Appender/RollingFileAppenderTest.cs(1245,4): error CS0246: The type or namespace name 'TestAttribute' could not be found (are you missing a using directive or an assembly reference?) [/home/jenkins/jenkins-slave/workspace/log4net_feature_cd-pipeline-76KUCPODUF6LCE45226EBUR4GNVLYPMYVC23Z4ITBOMNJT3CA2WA/netstandard/1.3/log4net.tests/log4net.tests.csproj]
[exec] /home/jenkins/jenkins-slave/workspace/log4net_feature_cd-pipeline-76KUCPODUF6LCE45226EBUR4GNVLYPMYVC23Z4ITBOMNJT3CA2WA/tests/src/Appender/RollingFileAppenderTest.cs(1245,4): error CS0246: The type or namespace name 'Test' could not be found (are you missing a using directive or an assembly reference?) [/home/jenkins/jenkins-slave/workspace/log4net_feature_cd-pipeline-76KUCPODUF6LCE45226EBUR4GNVLYPMYVC23Z4ITBOMNJT3CA2WA/netstandard/1.3/log4net.tests/log4net.tests.csproj]
[exec] /home/jenkins/jenkins-slave/workspace/log4net_feature_cd-pipeline-76KUCPODUF6LCE45226EBUR4GNVLYPMYVC23Z4ITBOMNJT3CA2WA/tests/src/Appender/RollingFileAppenderTest.cs(1255,4): error CS0246: The type or namespace name 'TestAttribute' could not be found (are you missing a using directive or an assembly reference?) [/home/jenkins/jenkins-slave/workspace/log4net_feature_cd-pipeline-76KUCPODUF6LCE45226EBUR4GNVLYPMYVC23Z4ITBOMNJT3CA2WA/netstandard/1.3/log4net.tests/log4net.tests.csproj]
[exec] /home/jenkins/jenkins-slave/workspace/log4net_feature_cd-pipeline-76KUCPODUF6LCE45226EBUR4GNVLYPMYVC23Z4ITBOMNJT3CA2WA/tests/src/Appender/RollingFileAppenderTest.cs(1255,4): error CS0246: The type or namespace name 'Test' could not be found (are you missing a using directive or an assembly reference?) [/home/jenkins/jenkins-slave/workspace/log4net_feature_cd-pipeline-76KUCPODUF6LCE45226EBUR4GNVLYPMYVC23Z4ITBOMNJT3CA2WA/netstandard/1.3/log4net.tests/log4net.tests.csproj]
[exec] /home/jenkins/jenkins-slave/workspace/log4net_feature_cd-pipeline-76KUCPODUF6LCE45226EBUR4GNVLYPMYVC23Z4ITBOMNJT3CA2WA/tests/src/Appender/RollingFileAppenderTest.cs(1265,4): error CS0246: The type or namespace name 'TestAttribute' could not be found (are you missing a using directive or an assembly reference?) [/home/jenkins/jenkins-slave/workspace/log4net_feature_cd-pipeline-76KUCPODUF6LCE45226EBUR4GNVLYPMYVC23Z4ITBOMNJT3CA2WA/netstandard/1.3/log4net.tests/log4net.tests.csproj]
[exec] /home/jenkins/jenkins-slave/workspace/log4net_feature_cd-pipeline-76KUCPODUF6LCE45226EBUR4GNVLYPMYVC23Z4ITBOMNJT3CA2WA/tests/src/Appender/RollingFileAppenderTest.cs(1265,4): error CS0246: The type or namespace name 'Test' could not be found (are you missing a using directive or an assembly reference?) [/home/jenkins/jenkins-slave/workspace/log4net_feature_cd-pipeline-76KUCPODUF6LCE45226EBUR4GNVLYPMYVC23Z4ITBOMNJT3CA2WA/netstandard/1.3/log4net.tests/log4net.tests.csproj]
[exec] /home/jenkins/jenkins-slave/workspace/log4net_feature_cd-pipeline-76KUCPODUF6LCE45226EBUR4GNVLYPMYVC23Z4ITBOMNJT3CA2WA/tests/src/Appender/RollingFileAppenderTest.cs(1275,4): error CS0246: The type or namespace name 'TestAttribute' could not be found (are you missing a using directive or an assembly reference?) [/home/jenkins/jenkins-slave/workspace/log4net_feature_cd-pipeline-76KUCPODUF6LCE45226EBUR4GNVLYPMYVC23Z4ITBOMNJT3CA2WA/netstandard/1.3/log4net.tests/log4net.tests.csproj]
[exec] /home/jenkins/jenkins-slave/workspace/log4net_feature_cd-pipeline-76KUCPODUF6LCE45226EBUR4GNVLYPMYVC23Z4ITBOMNJT3CA2WA/tests/src/Appender/RollingFileAppenderTest.cs(1275,4): error CS0246: The type or namespace name 'Test' could not be found (are you missing a using directive or an assembly reference?) [/home/jenkins/jenkins-slave/workspace/log4net_feature_cd-pipeline-76KUCPODUF6LCE45226EBUR4GNVLYPMYVC23Z4ITBOMNJT3CA2WA/netstandard/1.3/log4net.tests/log4net.tests.csproj]
[exec] /home/jenkins/jenkins-slave/workspace/log4net_feature_cd-pipeline-76KUCPODUF6LCE45226EBUR4GNVLYPMYVC23Z4ITBOMNJT3CA2WA/tests/src/Appender/RollingFileAppenderTest.cs(1328,4): error CS0246: The type or namespace name 'TestAttribute' could not be found (are you missing a using directive or an assembly reference?) [/home/jenkins/jenkins-slave/workspace/log4net_feature_cd-pipeline-76KUCPODUF6LCE45226EBUR4GNVLYPMYVC23Z4ITBOMNJT3CA2WA/netstandard/1.3/log4net.tests/log4net.tests.csproj]
[exec] /home/jenkins/jenkins-slave/workspace/log4net_feature_cd-pipeline-76KUCPODUF6LCE45226EBUR4GNVLYPMYVC23Z4ITBOMNJT3CA2WA/tests/src/Appender/RollingFileAppenderTest.cs(1328,4): error CS0246: The type or namespace name 'Test' could not be found (are you missing a using directive or an assembly reference?) [/home/jenkins/jenkins-slave/workspace/log4net_feature_cd-pipeline-76KUCPODUF6LCE45226EBUR4GNVLYPMYVC23Z4ITBOMNJT3CA2WA/netstandard/1.3/log4net.tests/log4net.tests.csproj]
[exec] /home/jenkins/jenkins-slave/workspace/log4net_feature_cd-pipeline-76KUCPODUF6LCE45226EBUR4GNVLYPMYVC23Z4ITBOMNJT3CA2WA/tests/src/Appender/RollingFileAppenderTest.cs(1339,4): error CS0246: The type or namespace name 'TestAttribute' could not be found (are you missing a using directive or an assembly reference?) [/home/jenkins/jenkins-slave/workspace/log4net_feature_cd-pipeline-76KUCPODUF6LCE45226EBUR4GNVLYPMYVC23Z4ITBOMNJT3CA2WA/netstandard/1.3/log4net.tests/log4net.tests.csproj]
[exec] /home/jenkins/jenkins-slave/workspace/log4net_feature_cd-pipeline-76KUCPODUF6LCE45226EBUR4GNVLYPMYVC23Z4ITBOMNJT3CA2WA/tests/src/Appender/RollingFileAppenderTest.cs(1339,4): error CS0246: The type or namespace name 'Test' could not be found (are you missing a using directive or an assembly reference?) [/home/jenkins/jenkins-slave/workspace/log4net_feature_cd-pipeline-76KUCPODUF6LCE45226EBUR4GNVLYPMYVC23Z4ITBOMNJT3CA2WA/netstandard/1.3/log4net.tests/log4net.tests.csproj]
[exec] /home/jenkins/jenkins-slave/workspace/log4net_feature_cd-pipeline-76KUCPODUF6LCE45226EBUR4GNVLYPMYVC23Z4ITBOMNJT3CA2WA/tests/src/Appender/RollingFileAppenderTest.cs(1350,4): error CS0246: The type or namespace name 'TestAttribute' could not be found (are you missing a using directive or an assembly reference?) [/home/jenkins/jenkins-slave/workspace/log4net_feature_cd-pipeline-76KUCPODUF6LCE45226EBUR4GNVLYPMYVC23Z4ITBOMNJT3CA2WA/netstandard/1.3/log4net.tests/log4net.tests.csproj]
[exec] /home/jenkins/jenkins-slave/workspace/log4net_feature_cd-pipeline-76KUCPODUF6LCE45226EBUR4GNVLYPMYVC23Z4ITBOMNJT3CA2WA/tests/src/Appender/RollingFileAppenderTest.cs(1350,4): error CS0246: The type or namespace name 'Test' could not be found (are you missing a using directive or an assembly reference?) [/home/jenkins/jenkins-slave/workspace/log4net_feature_cd-pipeline-76KUCPODUF6LCE45226EBUR4GNVLYPMYVC23Z4ITBOMNJT3CA2WA/netstandard/1.3/log4net.tests/log4net.tests.csproj]
[exec] /home/jenkins/jenkins-slave/workspace/log4net_feature_cd-pipeline-76KUCPODUF6LCE45226EBUR4GNVLYPMYVC23Z4ITBOMNJT3CA2WA/tests/src/Appender/RollingFileAppenderTest.cs(1361,4): error CS0246: The type or namespace name 'TestAttribute' could not be found (are you missing a using directive or an assembly reference?) [/home/jenkins/jenkins-slave/workspace/log4net_feature_cd-pipeline-76KUCPODUF6LCE45226EBUR4GNVLYPMYVC23Z4ITBOMNJT3CA2WA/netstandard/1.3/log4net.tests/log4net.tests.csproj]
[exec] /home/jenkins/jenkins-slave/workspace/log4net_feature_cd-pipeline-76KUCPODUF6LCE45226EBUR4GNVLYPMYVC23Z4ITBOMNJT3CA2WA/tests/src/Appender/RollingFileAppenderTest.cs(1361,4): error CS0246: The type or namespace name 'Test' could not be found (are you missing a using directive or an assembly reference?) [/home/jenkins/jenkins-slave/workspace/log4net_feature_cd-pipeline-76KUCPODUF6LCE45226EBUR4GNVLYPMYVC23Z4ITBOMNJT3CA2WA/netstandard/1.3/log4net.tests/log4net.tests.csproj]
[exec] /home/jenkins/jenkins-slave/workspace/log4net_feature_cd-pipeline-76KUCPODUF6LCE45226EBUR4GNVLYPMYVC23Z4ITBOMNJT3CA2WA/tests/src/Appender/RollingFileAppenderTest.cs(1372,4): error CS0246: The type or namespace name 'TestAttribute' could not be found (are you missing a using directive or an assembly reference?) [/home/jenkins/jenkins-slave/workspace/log4net_feature_cd-pipeline-76KUCPODUF6LCE45226EBUR4GNVLYPMYVC23Z4ITBOMNJT3CA2WA/netstandard/1.3/log4net.tests/log4net.tests.csproj]
[exec] /home/jenkins/jenkins-slave/workspace/log4net_feature_cd-pipeline-76KUCPODUF6LCE45226EBUR4GNVLYPMYVC23Z4ITBOMNJT3CA2WA/tests/src/Appender/RollingFileAppenderTest.cs(1372,4): error CS0246: The type or namespace name 'Test' could not be found (are you missing a using directive or an assembly reference?) [/home/jenkins/jenkins-slave/workspace/log4net_feature_cd-pipeline-76KUCPODUF6LCE45226EBUR4GNVLYPMYVC23Z4ITBOMNJT3CA2WA/netstandard/1.3/log4net.tests/log4net.tests.csproj]
[exec] /home/jenkins/jenkins-slave/workspace/log4net_feature_cd-pipeline-76KUCPODUF6LCE45226EBUR4GNVLYPMYVC23Z4ITBOMNJT3CA2WA/tests/src/Appender/RollingFileAppenderTest.cs(1383,4): error CS0246: The type or namespace name 'TestAttribute' could not be found (are you missing a using directive or an assembly reference?) [/home/jenkins/jenkins-slave/workspace/log4net_feature_cd-pipeline-76KUCPODUF6LCE45226EBUR4GNVLYPMYVC23Z4ITBOMNJT3CA2WA/netstandard/1.3/log4net.tests/log4net.tests.csproj]
[exec] /home/jenkins/jenkins-slave/workspace/log4net_feature_cd-pipeline-76KUCPODUF6LCE45226EBUR4GNVLYPMYVC23Z4ITBOMNJT3CA2WA/tests/src/Appender/RollingFileAppenderTest.cs(1383,4): error CS0246: The type or namespace name 'Test' could not be found (are you missing a using directive or an assembly reference?) [/home/jenkins/jenkins-slave/workspace/log4net_feature_cd-pipeline-76KUCPODUF6LCE45226EBUR4GNVLYPMYVC23Z4ITBOMNJT3CA2WA/netstandard/1.3/log4net.tests/log4net.tests.csproj]
[exec] /home/jenkins/jenkins-slave/workspace/log4net_feature_cd-pipeline-76KUCPODUF6LCE45226EBUR4GNVLYPMYVC23Z4ITBOMNJT3CA2WA/tests/src/Appender/RollingFileAppenderTest.cs(1472,4): error CS0246: The type or namespace name 'TestAttribute' could not be found (are you missing a using directive or an assembly reference?) [/home/jenkins/jenkins-slave/workspace/log4net_feature_cd-pipeline-76KUCPODUF6LCE45226EBUR4GNVLYPMYVC23Z4ITBOMNJT3CA2WA/netstandard/1.3/log4net.tests/log4net.tests.csproj]
[exec] /home/jenkins/jenkins-slave/workspace/log4net_feature_cd-pipeline-76KUCPODUF6LCE45226EBUR4GNVLYPMYVC23Z4ITBOMNJT3CA2WA/tests/src/Appender/RollingFileAppenderTest.cs(1472,4): error CS0246: The type or namespace name 'Test' could not be found (are you missing a using directive or an assembly reference?) [/home/jenkins/jenkins-slave/workspace/log4net_feature_cd-pipeline-76KUCPODUF6LCE45226EBUR4GNVLYPMYVC23Z4ITBOMNJT3CA2WA/netstandard/1.3/log4net.tests/log4net.tests.csproj]
[exec] /home/jenkins/jenkins-slave/workspace/log4net_feature_cd-pipeline-76KUCPODUF6LCE45226EBUR4GNVLYPMYVC23Z4ITBOMNJT3CA2WA/tests/src/Appender/RollingFileAppenderTest.cs(1489,4): error CS0246: The type or namespace name 'TestAttribute' could not be found (are you missing a using directive or an assembly reference?) [/home/jenkins/jenkins-slave/workspace/log4net_feature_cd-pipeline-76KUCPODUF6LCE45226EBUR4GNVLYPMYVC23Z4ITBOMNJT3CA2WA/netstandard/1.3/log4net.tests/log4net.tests.csproj]
[exec] /home/jenkins/jenkins-slave/workspace/log4net_feature_cd-pipeline-76KUCPODUF6LCE45226EBUR4GNVLYPMYVC23Z4ITBOMNJT3CA2WA/tests/src/Appender/RollingFileAppenderTest.cs(1489,4): error CS0246: The type or namespace name 'Test' could not be found (are you missing a using directive or an assembly reference?) [/home/jenkins/jenkins-slave/workspace/log4net_feature_cd-pipeline-76KUCPODUF6LCE45226EBUR4GNVLYPMYVC23Z4ITBOMNJT3CA2WA/netstandard/1.3/log4net.tests/log4net.tests.csproj]
[exec] /home/jenkins/jenkins-slave/workspace/log4net_feature_cd-pipeline-76KUCPODUF6LCE45226EBUR4GNVLYPMYVC23Z4ITBOMNJT3CA2WA/tests/src/Appender/RollingFileAppenderTest.cs(1511,4): error CS0246: The type or namespace name 'TestAttribute' could not be found (are you missing a using directive or an assembly reference?) [/home/jenkins/jenkins-slave/workspace/log4net_feature_cd-pipeline-76KUCPODUF6LCE45226EBUR4GNVLYPMYVC23Z4ITBOMNJT3CA2WA/netstandard/1.3/log4net.tests/log4net.tests.csproj]
[exec] /home/jenkins/jenkins-slave/workspace/log4net_feature_cd-pipeline-76KUCPODUF6LCE45226EBUR4GNVLYPMYVC23Z4ITBOMNJT3CA2WA/tests/src/Appender/RollingFileAppenderTest.cs(1511,4): error CS0246: The type or namespace name 'Test' could not be found (are you missing a using directive or an assembly reference?) [/home/jenkins/jenkins-slave/workspace/log4net_feature_cd-pipeline-76KUCPODUF6LCE45226EBUR4GNVLYPMYVC23Z4ITBOMNJT3CA2WA/netstandard/1.3/log4net.tests/log4net.tests.csproj]
[exec] /home/jenkins/jenkins-slave/workspace/log4net_feature_cd-pipeline-76KUCPODUF6LCE45226EBUR4GNVLYPMYVC23Z4ITBOMNJT3CA2WA/tests/src/Appender/RollingFileAppenderTest.cs(1533,4): error CS0246: The type or namespace name 'TestAttribute' could not be found (are you missing a using directive or an assembly reference?) [/home/jenkins/jenkins-slave/workspace/log4net_feature_cd-pipeline-76KUCPODUF6LCE45226EBUR4GNVLYPMYVC23Z4ITBOMNJT3CA2WA/netstandard/1.3/log4net.tests/log4net.tests.csproj]
[exec] /home/jenkins/jenkins-slave/workspace/log4net_feature_cd-pipeline-76KUCPODUF6LCE45226EBUR4GNVLYPMYVC23Z4ITBOMNJT3CA2WA/tests/src/Appender/RollingFileAppenderTest.cs(1533,4): error CS0246: The type or namespace name 'Test' could not be found (are you missing a using directive or an assembly reference?) [/home/jenkins/jenkins-slave/workspace/log4net_feature_cd-pipeline-76KUCPODUF6LCE45226EBUR4GNVLYPMYVC23Z4ITBOMNJT3CA2WA/netstandard/1.3/log4net.tests/log4net.tests.csproj]
[exec] /home/jenkins/jenkins-slave/workspace/log4net_feature_cd-pipeline-76KUCPODUF6LCE45226EBUR4GNVLYPMYVC23Z4ITBOMNJT3CA2WA/tests/src/Appender/RollingFileAppenderTest.cs(1575,4): error CS0246: The type or namespace name 'TestAttribute' could not be found (are you missing a using directive or an assembly reference?) [/home/jenkins/jenkins-slave/workspace/log4net_feature_cd-pipeline-76KUCPODUF6LCE45226EBUR4GNVLYPMYVC23Z4ITBOMNJT3CA2WA/netstandard/1.3/log4net.tests/log4net.tests.csproj]
[exec] /home/jenkins/jenkins-slave/workspace/log4net_feature_cd-pipeline-76KUCPODUF6LCE45226EBUR4GNVLYPMYVC23Z4ITBOMNJT3CA2WA/tests/src/Appender/RollingFileAppenderTest.cs(1575,4): error CS0246: The type or namespace name 'Test' could not be found (are you missing a using directive or an assembly reference?) [/home/jenkins/jenkins-slave/workspace/log4net_feature_cd-pipeline-76KUCPODUF6LCE45226EBUR4GNVLYPMYVC23Z4ITBOMNJT3CA2WA/netstandard/1.3/log4net.tests/log4net.tests.csproj]
[exec] /home/jenkins/jenkins-slave/workspace/log4net_feature_cd-pipeline-76KUCPODUF6LCE45226EBUR4GNVLYPMYVC23Z4ITBOMNJT3CA2WA/tests/src/Appender/RollingFileAppenderTest.cs(1597,4): error CS0246: The type or namespace name 'TestAttribute' could not be found (are you missing a using directive or an assembly reference?) [/home/jenkins/jenkins-slave/workspace/log4net_feature_cd-pipeline-76KUCPODUF6LCE45226EBUR4GNVLYPMYVC23Z4ITBOMNJT3CA2WA/netstandard/1.3/log4net.tests/log4net.tests.csproj]
[exec] /home/jenkins/jenkins-slave/workspace/log4net_feature_cd-pipeline-76KUCPODUF6LCE45226EBUR4GNVLYPMYVC23Z4ITBOMNJT3CA2WA/tests/src/Appender/RollingFileAppenderTest.cs(1597,4): error CS0246: The type or namespace name 'Test' could not be found (are you missing a using directive or an assembly reference?) [/home/jenkins/jenkins-slave/workspace/log4net_feature_cd-pipeline-76KUCPODUF6LCE45226EBUR4GNVLYPMYVC23Z4ITBOMNJT3CA2WA/netstandard/1.3/log4net.tests/log4net.tests.csproj]
[exec] /home/jenkins/jenkins-slave/workspace/log4net_feature_cd-pipeline-76KUCPODUF6LCE45226EBUR4GNVLYPMYVC23Z4ITBOMNJT3CA2WA/tests/src/Appender/RollingFileAppenderTest.cs(1619,4): error CS0246: The type or namespace name 'TestAttribute' could not be found (are you missing a using directive or an assembly reference?) [/home/jenkins/jenkins-slave/workspace/log4net_feature_cd-pipeline-76KUCPODUF6LCE45226EBUR4GNVLYPMYVC23Z4ITBOMNJT3CA2WA/netstandard/1.3/log4net.tests/log4net.tests.csproj]
[exec] /home/jenkins/jenkins-slave/workspace/log4net_feature_cd-pipeline-76KUCPODUF6LCE45226EBUR4GNVLYPMYVC23Z4ITBOMNJT3CA2WA/tests/src/Appender/RollingFileAppenderTest.cs(1619,4): error CS0246: The type or namespace name 'Test' could not be found (are you missing a using directive or an assembly reference?) [/home/jenkins/jenkins-slave/workspace/log4net_feature_cd-pipeline-76KUCPODUF6LCE45226EBUR4GNVLYPMYVC23Z4ITBOMNJT3CA2WA/netstandard/1.3/log4net.tests/log4net.tests.csproj]
[exec] /home/jenkins/jenkins-slave/workspace/log4net_feature_cd-pipeline-76KUCPODUF6LCE45226EBUR4GNVLYPMYVC23Z4ITBOMNJT3CA2WA/tests/src/Appender/RollingFileAppenderTest.cs(1646,4): error CS0246: The type or namespace name 'TestAttribute' could not be found (are you missing a using directive or an assembly reference?) [/home/jenkins/jenkins-slave/workspace/log4net_feature_cd-pipeline-76KUCPODUF6LCE45226EBUR4GNVLYPMYVC23Z4ITBOMNJT3CA2WA/netstandard/1.3/log4net.tests/log4net.tests.csproj]
[exec] /home/jenkins/jenkins-slave/workspace/log4net_feature_cd-pipeline-76KUCPODUF6LCE45226EBUR4GNVLYPMYVC23Z4ITBOMNJT3CA2WA/tests/src/Appender/RollingFileAppenderTest.cs(1646,4): error CS0246: The type or namespace name 'Test' could not be found (are you missing a using directive or an assembly reference?) [/home/jenkins/jenkins-slave/workspace/log4net_feature_cd-pipeline-76KUCPODUF6LCE45226EBUR4GNVLYPMYVC23Z4ITBOMNJT3CA2WA/netstandard/1.3/log4net.tests/log4net.tests.csproj]
[exec] /home/jenkins/jenkins-slave/workspace/log4net_feature_cd-pipeline-76KUCPODUF6LCE45226EBUR4GNVLYPMYVC23Z4ITBOMNJT3CA2WA/tests/src/Appender/RollingFileAppenderTest.cs(1667,4): error CS0246: The type or namespace name 'TestAttribute' could not be found (are you missing a using directive or an assembly reference?) [/home/jenkins/jenkins-slave/workspace/log4net_feature_cd-pipeline-76KUCPODUF6LCE45226EBUR4GNVLYPMYVC23Z4ITBOMNJT3CA2WA/netstandard/1.3/log4net.tests/log4net.tests.csproj]
[exec] /home/jenkins/jenkins-slave/workspace/log4net_feature_cd-pipeline-76KUCPODUF6LCE45226EBUR4GNVLYPMYVC23Z4ITBOMNJT3CA2WA/tests/src/Appender/RollingFileAppenderTest.cs(1667,4): error CS0246: The type or namespace name 'Test' could not be found (are you missing a using directive or an assembly reference?) [/home/jenkins/jenkins-slave/workspace/log4net_feature_cd-pipeline-76KUCPODUF6LCE45226EBUR4GNVLYPMYVC23Z4ITBOMNJT3CA2WA/netstandard/1.3/log4net.tests/log4net.tests.csproj]
[exec] /home/jenkins/jenkins-slave/workspace/log4net_feature_cd-pipeline-76KUCPODUF6LCE45226EBUR4GNVLYPMYVC23Z4ITBOMNJT3CA2WA/tests/src/Appender/RollingFileAppenderTest.cs(1688,4): error CS0246: The type or namespace name 'TestAttribute' could not be found (are you missing a using directive or an assembly reference?) [/home/jenkins/jenkins-slave/workspace/log4net_feature_cd-pipeline-76KUCPODUF6LCE45226EBUR4GNVLYPMYVC23Z4ITBOMNJT3CA2WA/netstandard/1.3/log4net.tests/log4net.tests.csproj]
[exec] /home/jenkins/jenkins-slave/workspace/log4net_feature_cd-pipeline-76KUCPODUF6LCE45226EBUR4GNVLYPMYVC23Z4ITBOMNJT3CA2WA/tests/src/Appender/RollingFileAppenderTest.cs(1688,4): error CS0246: The type or namespace name 'Test' could not be found (are you missing a using directive or an assembly reference?) [/home/jenkins/jenkins-slave/workspace/log4net_feature_cd-pipeline-76KUCPODUF6LCE45226EBUR4GNVLYPMYVC23Z4ITBOMNJT3CA2WA/netstandard/1.3/log4net.tests/log4net.tests.csproj]
[exec] /home/jenkins/jenkins-slave/workspace/log4net_feature_cd-pipeline-76KUCPODUF6LCE45226EBUR4GNVLYPMYVC23Z4ITBOMNJT3CA2WA/tests/src/Appender/RollingFileAppenderTest.cs(1713,4): error CS0246: The type or namespace name 'TestAttribute' could not be found (are you missing a using directive or an assembly reference?) [/home/jenkins/jenkins-slave/workspace/log4net_feature_cd-pipeline-76KUCPODUF6LCE45226EBUR4GNVLYPMYVC23Z4ITBOMNJT3CA2WA/netstandard/1.3/log4net.tests/log4net.tests.csproj]
[exec] /home/jenkins/jenkins-slave/workspace/log4net_feature_cd-pipeline-76KUCPODUF6LCE45226EBUR4GNVLYPMYVC23Z4ITBOMNJT3CA2WA/tests/src/Appender/RollingFileAppenderTest.cs(1713,4): error CS0246: The type or namespace name 'Test' could not be found (are you missing a using directive or an assembly reference?) [/home/jenkins/jenkins-slave/workspace/log4net_feature_cd-pipeline-76KUCPODUF6LCE45226EBUR4GNVLYPMYVC23Z4ITBOMNJT3CA2WA/netstandard/1.3/log4net.tests/log4net.tests.csproj]
[exec] /home/jenkins/jenkins-slave/workspace/log4net_feature_cd-pipeline-76KUCPODUF6LCE45226EBUR4GNVLYPMYVC23Z4ITBOMNJT3CA2WA/tests/src/Appender/RollingFileAppenderTest.cs(1734,4): error CS0246: The type or namespace name 'TestAttribute' could not be found (are you missing a using directive or an assembly reference?) [/home/jenkins/jenkins-slave/workspace/log4net_feature_cd-pipeline-76KUCPODUF6LCE45226EBUR4GNVLYPMYVC23Z4ITBOMNJT3CA2WA/netstandard/1.3/log4net.tests/log4net.tests.csproj]
[exec] /home/jenkins/jenkins-slave/workspace/log4net_feature_cd-pipeline-76KUCPODUF6LCE45226EBUR4GNVLYPMYVC23Z4ITBOMNJT3CA2WA/tests/src/Appender/RollingFileAppenderTest.cs(1734,4): error CS0246: The type or namespace name 'Test' could not be found (are you missing a using directive or an assembly reference?) [/home/jenkins/jenkins-slave/workspace/log4net_feature_cd-pipeline-76KUCPODUF6LCE45226EBUR4GNVLYPMYVC23Z4ITBOMNJT3CA2WA/netstandard/1.3/log4net.tests/log4net.tests.csproj]
[exec] /home/jenkins/jenkins-slave/workspace/log4net_feature_cd-pipeline-76KUCPODUF6LCE45226EBUR4GNVLYPMYVC23Z4ITBOMNJT3CA2WA/tests/src/Appender/RollingFileAppenderTest.cs(1816,4): error CS0246: The type or namespace name 'TestAttribute' could not be found (are you missing a using directive or an assembly reference?) [/home/jenkins/jenkins-slave/workspace/log4net_feature_cd-pipeline-76KUCPODUF6LCE45226EBUR4GNVLYPMYVC23Z4ITBOMNJT3CA2WA/netstandard/1.3/log4net.tests/log4net.tests.csproj]
[exec] /home/jenkins/jenkins-slave/workspace/log4net_feature_cd-pipeline-76KUCPODUF6LCE45226EBUR4GNVLYPMYVC23Z4ITBOMNJT3CA2WA/tests/src/Appender/RollingFileAppenderTest.cs(1816,4): error CS0246: The type or namespace name 'Test' could not be found (are you missing a using directive or an assembly reference?) [/home/jenkins/jenkins-slave/workspace/log4net_feature_cd-pipeline-76KUCPODUF6LCE45226EBUR4GNVLYPMYVC23Z4ITBOMNJT3CA2WA/netstandard/1.3/log4net.tests/log4net.tests.csproj]
[exec] /home/jenkins/jenkins-slave/workspace/log4net_feature_cd-pipeline-76KUCPODUF6LCE45226EBUR4GNVLYPMYVC23Z4ITBOMNJT3CA2WA/tests/src/Appender/RollingFileAppenderTest.cs(1826,4): error CS0246: The type or namespace name 'TestAttribute' could not be found (are you missing a using directive or an assembly reference?) [/home/jenkins/jenkins-slave/workspace/log4net_feature_cd-pipeline-76KUCPODUF6LCE45226EBUR4GNVLYPMYVC23Z4ITBOMNJT3CA2WA/netstandard/1.3/log4net.tests/log4net.tests.csproj]
[exec] /home/jenkins/jenkins-slave/workspace/log4net_feature_cd-pipeline-76KUCPODUF6LCE45226EBUR4GNVLYPMYVC23Z4ITBOMNJT3CA2WA/tests/src/Appender/RollingFileAppenderTest.cs(1826,4): error CS0246: The type or namespace name 'Test' could not be found (are you missing a using directive or an assembly reference?) [/home/jenkins/jenkins-slave/workspace/log4net_feature_cd-pipeline-76KUCPODUF6LCE45226EBUR4GNVLYPMYVC23Z4ITBOMNJT3CA2WA/netstandard/1.3/log4net.tests/log4net.tests.csproj]
[exec] /home/jenkins/jenkins-slave/workspace/log4net_feature_cd-pipeline-76KUCPODUF6LCE45226EBUR4GNVLYPMYVC23Z4ITBOMNJT3CA2WA/tests/src/Appender/RollingFileAppenderTest.cs(1873,4): error CS0246: The type or namespace name 'TestAttribute' could not be found (are you missing a using directive or an assembly reference?) [/home/jenkins/jenkins-slave/workspace/log4net_feature_cd-pipeline-76KUCPODUF6LCE45226EBUR4GNVLYPMYVC23Z4ITBOMNJT3CA2WA/netstandard/1.3/log4net.tests/log4net.tests.csproj]
[exec] /home/jenkins/jenkins-slave/workspace/log4net_feature_cd-pipeline-76KUCPODUF6LCE45226EBUR4GNVLYPMYVC23Z4ITBOMNJT3CA2WA/tests/src/Appender/RollingFileAppenderTest.cs(1873,4): error CS0246: The type or namespace name 'Test' could not be found (are you missing a using directive or an assembly reference?) [/home/jenkins/jenkins-slave/workspace/log4net_feature_cd-pipeline-76KUCPODUF6LCE45226EBUR4GNVLYPMYVC23Z4ITBOMNJT3CA2WA/netstandard/1.3/log4net.tests/log4net.tests.csproj]
[exec] /home/jenkins/jenkins-slave/workspace/log4net_feature_cd-pipeline-76KUCPODUF6LCE45226EBUR4GNVLYPMYVC23Z4ITBOMNJT3CA2WA/tests/src/Appender/RollingFileAppenderTest.cs(1892,4): error CS0246: The type or namespace name 'TestAttribute' could not be found (are you missing a using directive or an assembly reference?) [/home/jenkins/jenkins-slave/workspace/log4net_feature_cd-pipeline-76KUCPODUF6LCE45226EBUR4GNVLYPMYVC23Z4ITBOMNJT3CA2WA/netstandard/1.3/log4net.tests/log4net.tests.csproj]
[exec] /home/jenkins/jenkins-slave/workspace/log4net_feature_cd-pipeline-76KUCPODUF6LCE45226EBUR4GNVLYPMYVC23Z4ITBOMNJT3CA2WA/tests/src/Appender/RollingFileAppenderTest.cs(1892,4): error CS0246: The type or namespace name 'Test' could not be found (are you missing a using directive or an assembly reference?) [/home/jenkins/jenkins-slave/workspace/log4net_feature_cd-pipeline-76KUCPODUF6LCE45226EBUR4GNVLYPMYVC23Z4ITBOMNJT3CA2WA/netstandard/1.3/log4net.tests/log4net.tests.csproj]
[exec] /home/jenkins/jenkins-slave/workspace/log4net_feature_cd-pipeline-76KUCPODUF6LCE45226EBUR4GNVLYPMYVC23Z4ITBOMNJT3CA2WA/tests/src/Appender/RollingFileAppenderTest.cs(1892,10): error CS0246: The type or namespace name 'IgnoreAttribute' could not be found (are you missing a using directive or an assembly reference?) [/home/jenkins/jenkins-slave/workspace/log4net_feature_cd-pipeline-76KUCPODUF6LCE45226EBUR4GNVLYPMYVC23Z4ITBOMNJT3CA2WA/netstandard/1.3/log4net.tests/log4net.tests.csproj]
[exec] /home/jenkins/jenkins-slave/workspace/log4net_feature_cd-pipeline-76KUCPODUF6LCE45226EBUR4GNVLYPMYVC23Z4ITBOMNJT3CA2WA/tests/src/Appender/RollingFileAppenderTest.cs(1892,10): error CS0246: The type or namespace name 'Ignore' could not be found (are you missing a using directive or an assembly reference?) [/home/jenkins/jenkins-slave/workspace/log4net_feature_cd-pipeline-76KUCPODUF6LCE45226EBUR4GNVLYPMYVC23Z4ITBOMNJT3CA2WA/netstandard/1.3/log4net.tests/log4net.tests.csproj]
[exec] /home/jenkins/jenkins-slave/workspace/log4net_feature_cd-pipeline-76KUCPODUF6LCE45226EBUR4GNVLYPMYVC23Z4ITBOMNJT3CA2WA/tests/src/Appender/RollingFileAppenderTest.cs(1900,4): error CS0246: The type or namespace name 'TestAttribute' could not be found (are you missing a using directive or an assembly reference?) [/home/jenkins/jenkins-slave/workspace/log4net_feature_cd-pipeline-76KUCPODUF6LCE45226EBUR4GNVLYPMYVC23Z4ITBOMNJT3CA2WA/netstandard/1.3/log4net.tests/log4net.tests.csproj]
[exec] /home/jenkins/jenkins-slave/workspace/log4net_feature_cd-pipeline-76KUCPODUF6LCE45226EBUR4GNVLYPMYVC23Z4ITBOMNJT3CA2WA/tests/src/Appender/RollingFileAppenderTest.cs(1900,4): error CS0246: The type or namespace name 'Test' could not be found (are you missing a using directive or an assembly reference?) [/home/jenkins/jenkins-slave/workspace/log4net_feature_cd-pipeline-76KUCPODUF6LCE45226EBUR4GNVLYPMYVC23Z4ITBOMNJT3CA2WA/netstandard/1.3/log4net.tests/log4net.tests.csproj]
[exec] /home/jenkins/jenkins-slave/workspace/log4net_feature_cd-pipeline-76KUCPODUF6LCE45226EBUR4GNVLYPMYVC23Z4ITBOMNJT3CA2WA/tests/src/Appender/RollingFileAppenderTest.cs(1900,10): error CS0246: The type or namespace name 'IgnoreAttribute' could not be found (are you missing a using directive or an assembly reference?) [/home/jenkins/jenkins-slave/workspace/log4net_feature_cd-pipeline-76KUCPODUF6LCE45226EBUR4GNVLYPMYVC23Z4ITBOMNJT3CA2WA/netstandard/1.3/log4net.tests/log4net.tests.csproj]
[exec] /home/jenkins/jenkins-slave/workspace/log4net_feature_cd-pipeline-76KUCPODUF6LCE45226EBUR4GNVLYPMYVC23Z4ITBOMNJT3CA2WA/tests/src/Appender/RollingFileAppenderTest.cs(1900,10): error CS0246: The type or namespace name 'Ignore' could not be found (are you missing a using directive or an assembly reference?) [/home/jenkins/jenkins-slave/workspace/log4net_feature_cd-pipeline-76KUCPODUF6LCE45226EBUR4GNVLYPMYVC23Z4ITBOMNJT3CA2WA/netstandard/1.3/log4net.tests/log4net.tests.csproj]
[exec] /home/jenkins/jenkins-slave/workspace/log4net_feature_cd-pipeline-76KUCPODUF6LCE45226EBUR4GNVLYPMYVC23Z4ITBOMNJT3CA2WA/tests/src/Appender/RollingFileAppenderTest.cs(1908,4): error CS0246: The type or namespace name 'TestAttribute' could not be found (are you missing a using directive or an assembly reference?) [/home/jenkins/jenkins-slave/workspace/log4net_feature_cd-pipeline-76KUCPODUF6LCE45226EBUR4GNVLYPMYVC23Z4ITBOMNJT3CA2WA/netstandard/1.3/log4net.tests/log4net.tests.csproj]
[exec] /home/jenkins/jenkins-slave/workspace/log4net_feature_cd-pipeline-76KUCPODUF6LCE45226EBUR4GNVLYPMYVC23Z4ITBOMNJT3CA2WA/tests/src/Appender/RollingFileAppenderTest.cs(1908,4): error CS0246: The type or namespace name 'Test' could not be found (are you missing a using directive or an assembly reference?) [/home/jenkins/jenkins-slave/workspace/log4net_feature_cd-pipeline-76KUCPODUF6LCE45226EBUR4GNVLYPMYVC23Z4ITBOMNJT3CA2WA/netstandard/1.3/log4net.tests/log4net.tests.csproj]
[exec] /home/jenkins/jenkins-slave/workspace/log4net_feature_cd-pipeline-76KUCPODUF6LCE45226EBUR4GNVLYPMYVC23Z4ITBOMNJT3CA2WA/tests/src/Appender/RollingFileAppenderTest.cs(1908,10): error CS0246: The type or namespace name 'IgnoreAttribute' could not be found (are you missing a using directive or an assembly reference?) [/home/jenkins/jenkins-slave/workspace/log4net_feature_cd-pipeline-76KUCPODUF6LCE45226EBUR4GNVLYPMYVC23Z4ITBOMNJT3CA2WA/netstandard/1.3/log4net.tests/log4net.tests.csproj]
[exec] /home/jenkins/jenkins-slave/workspace/log4net_feature_cd-pipeline-76KUCPODUF6LCE45226EBUR4GNVLYPMYVC23Z4ITBOMNJT3CA2WA/tests/src/Appender/RollingFileAppenderTest.cs(1908,10): error CS0246: The type or namespace name 'Ignore' could not be found (are you missing a using directive or an assembly reference?) [/home/jenkins/jenkins-slave/workspace/log4net_feature_cd-pipeline-76KUCPODUF6LCE45226EBUR4GNVLYPMYVC23Z4ITBOMNJT3CA2WA/netstandard/1.3/log4net.tests/log4net.tests.csproj]
[exec] /home/jenkins/jenkins-slave/workspace/log4net_feature_cd-pipeline-76KUCPODUF6LCE45226EBUR4GNVLYPMYVC23Z4ITBOMNJT3CA2WA/tests/src/Appender/RollingFileAppenderTest.cs(1916,4): error CS0246: The type or namespace name 'TestAttribute' could not be found (are you missing a using directive or an assembly reference?) [/home/jenkins/jenkins-slave/workspace/log4net_feature_cd-pipeline-76KUCPODUF6LCE45226EBUR4GNVLYPMYVC23Z4ITBOMNJT3CA2WA/netstandard/1.3/log4net.tests/log4net.tests.csproj]
[exec] /home/jenkins/jenkins-slave/workspace/log4net_feature_cd-pipeline-76KUCPODUF6LCE45226EBUR4GNVLYPMYVC23Z4ITBOMNJT3CA2WA/tests/src/Appender/RollingFileAppenderTest.cs(1916,4): error CS0246: The type or namespace name 'Test' could not be found (are you missing a using directive or an assembly reference?) [/home/jenkins/jenkins-slave/workspace/log4net_feature_cd-pipeline-76KUCPODUF6LCE45226EBUR4GNVLYPMYVC23Z4ITBOMNJT3CA2WA/netstandard/1.3/log4net.tests/log4net.tests.csproj]
[exec] /home/jenkins/jenkins-slave/workspace/log4net_feature_cd-pipeline-76KUCPODUF6LCE45226EBUR4GNVLYPMYVC23Z4ITBOMNJT3CA2WA/tests/src/Appender/RollingFileAppenderTest.cs(1916,10): error CS0246: The type or namespace name 'IgnoreAttribute' could not be found (are you missing a using directive or an assembly reference?) [/home/jenkins/jenkins-slave/workspace/log4net_feature_cd-pipeline-76KUCPODUF6LCE45226EBUR4GNVLYPMYVC23Z4ITBOMNJT3CA2WA/netstandard/1.3/log4net.tests/log4net.tests.csproj]
[exec] /home/jenkins/jenkins-slave/workspace/log4net_feature_cd-pipeline-76KUCPODUF6LCE45226EBUR4GNVLYPMYVC23Z4ITBOMNJT3CA2WA/tests/src/Appender/RollingFileAppenderTest.cs(1916,10): error CS0246: The type or namespace name 'Ignore' could not be found (are you missing a using directive or an assembly reference?) [/home/jenkins/jenkins-slave/workspace/log4net_feature_cd-pipeline-76KUCPODUF6LCE45226EBUR4GNVLYPMYVC23Z4ITBOMNJT3CA2WA/netstandard/1.3/log4net.tests/log4net.tests.csproj]
[exec] /home/jenkins/jenkins-slave/workspace/log4net_feature_cd-pipeline-76KUCPODUF6LCE45226EBUR4GNVLYPMYVC23Z4ITBOMNJT3CA2WA/tests/src/Appender/RollingFileAppenderTest.cs(1924,4): error CS0246: The type or namespace name 'TestAttribute' could not be found (are you missing a using directive or an assembly reference?) [/home/jenkins/jenkins-slave/workspace/log4net_feature_cd-pipeline-76KUCPODUF6LCE45226EBUR4GNVLYPMYVC23Z4ITBOMNJT3CA2WA/netstandard/1.3/log4net.tests/log4net.tests.csproj]
[exec] /home/jenkins/jenkins-slave/workspace/log4net_feature_cd-pipeline-76KUCPODUF6LCE45226EBUR4GNVLYPMYVC23Z4ITBOMNJT3CA2WA/tests/src/Appender/RollingFileAppenderTest.cs(1924,4): error CS0246: The type or namespace name 'Test' could not be found (are you missing a using directive or an assembly reference?) [/home/jenkins/jenkins-slave/workspace/log4net_feature_cd-pipeline-76KUCPODUF6LCE45226EBUR4GNVLYPMYVC23Z4ITBOMNJT3CA2WA/netstandard/1.3/log4net.tests/log4net.tests.csproj]
[exec] /home/jenkins/jenkins-slave/workspace/log4net_feature_cd-pipeline-76KUCPODUF6LCE45226EBUR4GNVLYPMYVC23Z4ITBOMNJT3CA2WA/tests/src/Appender/RollingFileAppenderTest.cs(1924,10): error CS0246: The type or namespace name 'IgnoreAttribute' could not be found (are you missing a using directive or an assembly reference?) [/home/jenkins/jenkins-slave/workspace/log4net_feature_cd-pipeline-76KUCPODUF6LCE45226EBUR4GNVLYPMYVC23Z4ITBOMNJT3CA2WA/netstandard/1.3/log4net.tests/log4net.tests.csproj]
[exec] /home/jenkins/jenkins-slave/workspace/log4net_feature_cd-pipeline-76KUCPODUF6LCE45226EBUR4GNVLYPMYVC23Z4ITBOMNJT3CA2WA/tests/src/Appender/RollingFileAppenderTest.cs(1924,10): error CS0246: The type or namespace name 'Ignore' could not be found (are you missing a using directive or an assembly reference?) [/home/jenkins/jenkins-slave/workspace/log4net_feature_cd-pipeline-76KUCPODUF6LCE45226EBUR4GNVLYPMYVC23Z4ITBOMNJT3CA2WA/netstandard/1.3/log4net.tests/log4net.tests.csproj]
[exec] /home/jenkins/jenkins-slave/workspace/log4net_feature_cd-pipeline-76KUCPODUF6LCE45226EBUR4GNVLYPMYVC23Z4ITBOMNJT3CA2WA/tests/src/Appender/RollingFileAppenderTest.cs(58,38): error CS0246: The type or namespace name 'IErrorHandler' could not be found (are you missing a using directive or an assembly reference?) [/home/jenkins/jenkins-slave/workspace/log4net_feature_cd-pipeline-76KUCPODUF6LCE45226EBUR4GNVLYPMYVC23Z4ITBOMNJT3CA2WA/netstandard/1.3/log4net.tests/log4net.tests.csproj]
[exec] /home/jenkins/jenkins-slave/workspace/log4net_feature_cd-pipeline-76KUCPODUF6LCE45226EBUR4GNVLYPMYVC23Z4ITBOMNJT3CA2WA/tests/src/Appender/RollingFileAppenderTest.cs(77,51): error CS0246: The type or namespace name 'ErrorCode' could not be found (are you missing a using directive or an assembly reference?) [/home/jenkins/jenkins-slave/workspace/log4net_feature_cd-pipeline-76KUCPODUF6LCE45226EBUR4GNVLYPMYVC23Z4ITBOMNJT3CA2WA/netstandard/1.3/log4net.tests/log4net.tests.csproj]
[exec] /home/jenkins/jenkins-slave/workspace/log4net_feature_cd-pipeline-76KUCPODUF6LCE45226EBUR4GNVLYPMYVC23Z4ITBOMNJT3CA2WA/tests/nant.build(869,10):
[exec] External Program Failed: dotnet (return code was 1)
BUILD SUCCEEDED - 1 non-fatal error(s), 0 warning(s)
Total time: 5.7 seconds.
[Pipeline] stash
Stashed 0 file(s)
[Pipeline] stash
Stashed 0 file(s)
[Pipeline] }
$ docker stop --time=1 ae4f52bb626d477c8504a748ff4d3401cb8c0682cd72ec4b78abd37bcb8a3310
$ docker rm -f ae4f52bb626d477c8504a748ff4d3401cb8c0682cd72ec4b78abd37bcb8a3310
[Pipeline] // withDockerContainer
[Pipeline] }
[Pipeline] // script
[Pipeline] }
[Pipeline] // stage
[Pipeline] stage
[Pipeline] { (build net-2.0)
[Pipeline] node
Running on windows-2016-1 in f:\jenkins\jenkins-slave\workspace\log4net_feature_cd-pipeline-76KUCPODUF6LCE45226EBUR4GNVLYPMYVC23Z4ITBOMNJT3CA2WA
[Pipeline] {
[Pipeline] withEnv
[Pipeline] {
[Pipeline] deleteDir
[Pipeline] checkout
Cloning the remote Git repository
Cloning with configured refspecs honoured and without tags
Cloning repository https://github.com/apache/logging-log4net.git
> git init f:\jenkins\jenkins-slave\workspace\log4net_feature_cd-pipeline-76KUCPODUF6LCE45226EBUR4GNVLYPMYVC23Z4ITBOMNJT3CA2WA # timeout=10
Fetching upstream changes from https://github.com/apache/logging-log4net.git
> git --version # timeout=10
using GIT_ASKPASS to set credentials dpsenner at github
> git fetch --no-tags --progress https://github.com/apache/logging-log4net.git +refs/heads/feature/cd-pipeline:refs/remotes/origin/feature/cd-pipeline
> git config remote.origin.url https://github.com/apache/logging-log4net.git # timeout=10
> git config --add remote.origin.fetch +refs/heads/feature/cd-pipeline:refs/remotes/origin/feature/cd-pipeline # timeout=10
> git config remote.origin.url https://github.com/apache/logging-log4net.git # timeout=10
Fetching without tags
Fetching upstream changes from https://github.com/apache/logging-log4net.git
using GIT_ASKPASS to set credentials dpsenner at github
> git fetch --no-tags --progress https://github.com/apache/logging-log4net.git +refs/heads/feature/cd-pipeline:refs/remotes/origin/feature/cd-pipeline
Checking out Revision 382561fac26a9bf77bb99cf7bc72e2a82a5c0e6e (feature/cd-pipeline)
> git config core.sparsecheckout # timeout=10
> git checkout -f 382561fac26a9bf77bb99cf7bc72e2a82a5c0e6e
Commit message: "Use nunit 2.6.4 because 2.6.5 obsoletes attributes and this causes build warnings to show up as errors"
[Pipeline] bat
[log4net_feature_cd-pipeline-76KUCPODUF6LCE45226EBUR4GNVLYPMYVC23Z4ITBOMNJT3CA2WA] Running batch script
f:\jenkins\jenkins-slave\workspace\log4net_feature_cd-pipeline-76KUCPODUF6LCE45226EBUR4GNVLYPMYVC23Z4ITBOMNJT3CA2WA>F:\jenkins\tools\nant\nant-0.92\bin\NAnt.exe -t:net-2.0 -buildfile:log4net.build compile-net-2.0
The system cannot find the path specified.
[Pipeline] }
[Pipeline] // withEnv
[Pipeline] }
[Pipeline] // node
[Pipeline] }
[Pipeline] // stage
[Pipeline] stage
[Pipeline] { (build net-3.5)
Stage 'build net-3.5' skipped due to earlier failure(s)
[Pipeline] }
[Pipeline] // stage
[Pipeline] stage
[Pipeline] { (build net-3.5-cp)
Stage 'build net-3.5-cp' skipped due to earlier failure(s)
[Pipeline] }
[Pipeline] // stage
[Pipeline] stage
[Pipeline] { (build net-4.0)
Stage 'build net-4.0' skipped due to earlier failure(s)
[Pipeline] }
[Pipeline] // stage
[Pipeline] stage
[Pipeline] { (build net-4.0-cp)
Stage 'build net-4.0-cp' skipped due to earlier failure(s)
[Pipeline] }
[Pipeline] // stage
[Pipeline] stage
[Pipeline] { (build net-4.5)
Stage 'build net-4.5' skipped due to earlier failure(s)
[Pipeline] }
[Pipeline] // stage
[Pipeline] stage
[Pipeline] { (build mono-2.0)
Stage 'build mono-2.0' skipped due to earlier failure(s)
[Pipeline] }
[Pipeline] // stage
[Pipeline] stage
[Pipeline] { (build mono-3.5)
Stage 'build mono-3.5' skipped due to earlier failure(s)
[Pipeline] }
[Pipeline] // stage
[Pipeline] stage
[Pipeline] { (build mono-4.0)
Stage 'build mono-4.0' skipped due to earlier failure(s)
[Pipeline] }
[Pipeline] // stage
[Pipeline] stage
[Pipeline] { (build site)
Stage 'build site' skipped due to earlier failure(s)
[Pipeline] }
[Pipeline] // stage
[Pipeline] stage
[Pipeline] { (prepare package)
Stage 'prepare package' skipped due to earlier failure(s)
[Pipeline] }
[Pipeline] // stage
[Pipeline] stage
[Pipeline] { (check test results)
Stage 'check test results' skipped due to earlier failure(s)
[Pipeline] }
[Pipeline] // stage
[Pipeline] stage
[Pipeline] { (publish site)
Stage 'publish site' skipped due to earlier failure(s)
[Pipeline] }
[Pipeline] // stage
[Pipeline] stage
[Pipeline] { (Declarative: Post Actions)
[Pipeline] step
Build failed in Jenkins: logging-log4net » feature/cd-pipeline #202
Posted by Apache Jenkins Server <je...@builds.apache.org>.
See <https://builds.apache.org/job/logging-log4net/job/feature%252Fcd-pipeline/202/display/redirect>
------------------------------------------
Started by user dpsenner
Connecting to https://api.github.com using dpsenner/****** (dpsenner at github)
Obtained Jenkinsfile from 382561fac26a9bf77bb99cf7bc72e2a82a5c0e6e
Running in Durability level: MAX_SURVIVABILITY
[Pipeline] node
Running on H26 in /home/jenkins/jenkins-slave/workspace/log4net_feature_cd-pipeline-76KUCPODUF6LCE45226EBUR4GNVLYPMYVC23Z4ITBOMNJT3CA2WA
[Pipeline] {
[Pipeline] timeout
Timeout set to expire in 4 hr 0 min
[Pipeline] {
[Pipeline] stage
[Pipeline] { (checkout)
[Pipeline] deleteDir
[Pipeline] checkout
Cloning the remote Git repository
Cloning with configured refspecs honoured and without tags
Cloning repository https://github.com/apache/logging-log4net.git
> git init /home/jenkins/jenkins-slave/workspace/log4net_feature_cd-pipeline-76KUCPODUF6LCE45226EBUR4GNVLYPMYVC23Z4ITBOMNJT3CA2WA # timeout=10
Fetching upstream changes from https://github.com/apache/logging-log4net.git
> git --version # timeout=10
using GIT_ASKPASS to set credentials dpsenner at github
> git fetch --no-tags --progress https://github.com/apache/logging-log4net.git +refs/heads/feature/cd-pipeline:refs/remotes/origin/feature/cd-pipeline
> git config remote.origin.url https://github.com/apache/logging-log4net.git # timeout=10
> git config --add remote.origin.fetch +refs/heads/feature/cd-pipeline:refs/remotes/origin/feature/cd-pipeline # timeout=10
> git config remote.origin.url https://github.com/apache/logging-log4net.git # timeout=10
Fetching without tags
Fetching upstream changes from https://github.com/apache/logging-log4net.git
using GIT_ASKPASS to set credentials dpsenner at github
> git fetch --no-tags --progress https://github.com/apache/logging-log4net.git +refs/heads/feature/cd-pipeline:refs/remotes/origin/feature/cd-pipeline
Checking out Revision 382561fac26a9bf77bb99cf7bc72e2a82a5c0e6e (feature/cd-pipeline)
> git config core.sparsecheckout # timeout=10
> git checkout -f 382561fac26a9bf77bb99cf7bc72e2a82a5c0e6e
Commit message: "Use nunit 2.6.4 because 2.6.5 obsoletes attributes and this causes build warnings to show up as errors"
> git rev-list --no-walk 382561fac26a9bf77bb99cf7bc72e2a82a5c0e6e # timeout=10
[Pipeline] }
[Pipeline] // stage
[Pipeline] stage
[Pipeline] { (build netstandard-1.3)
[Pipeline] script
[Pipeline] {
[Pipeline] checkout
> git rev-parse --is-inside-work-tree # timeout=10
Fetching changes from the remote Git repository
> git config remote.origin.url https://github.com/apache/logging-log4net.git # timeout=10
Fetching without tags
Fetching upstream changes from https://github.com/apache/logging-log4net.git
> git --version # timeout=10
using GIT_ASKPASS to set credentials dpsenner at github
> git fetch --no-tags --progress https://github.com/apache/logging-log4net.git +refs/heads/feature/cd-pipeline:refs/remotes/origin/feature/cd-pipeline
Checking out Revision 382561fac26a9bf77bb99cf7bc72e2a82a5c0e6e (feature/cd-pipeline)
> git config core.sparsecheckout # timeout=10
> git checkout -f 382561fac26a9bf77bb99cf7bc72e2a82a5c0e6e
Commit message: "Use nunit 2.6.4 because 2.6.5 obsoletes attributes and this causes build warnings to show up as errors"
[Pipeline] sh
[log4net_feature_cd-pipeline-76KUCPODUF6LCE45226EBUR4GNVLYPMYVC23Z4ITBOMNJT3CA2WA] Running shell script
+ stat -c %u buildtools/docker/builder-netstandard-1.3
[Pipeline] sh
[log4net_feature_cd-pipeline-76KUCPODUF6LCE45226EBUR4GNVLYPMYVC23Z4ITBOMNJT3CA2WA] Running shell script
+ stat -c %g buildtools/docker/builder-netstandard-1.3
[Pipeline] sh
[log4net_feature_cd-pipeline-76KUCPODUF6LCE45226EBUR4GNVLYPMYVC23Z4ITBOMNJT3CA2WA] Running shell script
+ docker build -t builder-netstandard:latest --file buildtools/docker/builder-netstandard-1.3/Dockerfile --build-arg JENKINS_UID=910 --build-arg JENKINS_GID=910 buildtools/docker/builder-netstandard-1.3
runtime/cgo: pthread_create failed: Resource temporarily unavailable
SIGABRT: abort
PC=0x7f15839c4428 m=13
goroutine 0 [idle]:
goroutine 1 [chan receive]:
net/http.(*persistConn).readLoop.func4(0x1515360, 0xc420018170, 0xc4204df760, 0xc4204df770)
/usr/local/go/src/net/http/transport.go:1515 +0x109
net/http.(*bodyEOFSignal).condfn(0xc42051c040, 0x1515360, 0xc420018170, 0x2000, 0x2)
/usr/local/go/src/net/http/transport.go:2005 +0x43
net/http.(*bodyEOFSignal).Read(0xc42051c040, 0xc420538000, 0x200, 0x2000, 0x2, 0x1515360, 0xc420018170)
/usr/local/go/src/net/http/transport.go:1981 +0x1bb
io.(*LimitedReader).Read(0xc420518040, 0xc420538000, 0x2000, 0x2000, 0xc420018568, 0xc4204df918, 0xc4204df878)
/usr/local/go/src/io/io.go:436 +0x6c
io/ioutil.devNull.ReadFrom(0x0, 0x1516660, 0xc420518040, 0xc420018568, 0x423601, 0x7f15805c5028)
/usr/local/go/src/io/ioutil/ioutil.go:151 +0x85
io/ioutil.(*devNull).ReadFrom(0xc420018568, 0x1516660, 0xc420518040, 0xc4204df910, 0x1, 0x10)
<autogenerated>:9 +0x66
io.copyBuffer(0x1519d60, 0xc420018568, 0x1516660, 0xc420518040, 0x0, 0x0, 0x0, 0xd8cea0, 0x1516c01, 0xc420518040)
/usr/local/go/src/io/io.go:384 +0x323
io.Copy(0x1519d60, 0xc420018568, 0x1516660, 0xc420518040, 0xd51ac0, 0xd5f720, 0xc4204dfa00)
/usr/local/go/src/io/io.go:360 +0x68
io.CopyN(0x1519d60, 0xc420018568, 0x1516ca0, 0xc42051c040, 0x200, 0xc4204dfa40, 0x457aa0, 0xc42052e0a0)
/usr/local/go/src/io/io.go:336 +0x8c
github.com/docker/docker/client.ensureReaderClosed(0x151c6a0, 0xc42051c040, 0xc4204693e0, 0xc8)
/usr/src/docker/.gopath/src/github.com/docker/docker/client/request.go:244 +0x8d
github.com/docker/docker/client.(*Client).Ping(0xc4203b2880, 0x7f158170b028, 0xc420018288, 0xc42046670c, 0x4, 0xc420466720, 0x5, 0x0, 0x0, 0x0)
/usr/src/docker/.gopath/src/github.com/docker/docker/client/ping.go:31 +0x3cc
github.com/docker/docker/cli/command.(*DockerCli).Initialize(0xc4203df810, 0xc42036d140, 0x5, 0xc42045abd0)
/usr/src/docker/.gopath/src/github.com/docker/docker/cli/command/cli.go:189 +0x3e9
main.newDockerCommand.func2(0xc420414fc0, 0xc42045abd0, 0x1, 0x9, 0x0, 0x0)
/usr/src/docker/.gopath/src/github.com/docker/docker/cmd/docker/docker.go:50 +0xa2
github.com/docker/docker/vendor/github.com/spf13/cobra.(*Command).execute(0xc420414fc0, 0xc42000c0d0, 0x9, 0x9, 0xc420414fc0, 0xc42000c0d0)
/usr/src/docker/.gopath/src/github.com/docker/docker/vendor/github.com/spf13/cobra/command.go:628 +0x571
github.com/docker/docker/vendor/github.com/spf13/cobra.(*Command).ExecuteC(0xc4200afd40, 0xc4203e6240, 0xc42038ff40, 0xc4200484d8)
/usr/src/docker/.gopath/src/github.com/docker/docker/vendor/github.com/spf13/cobra/command.go:742 +0x377
github.com/docker/docker/vendor/github.com/spf13/cobra.(*Command).Execute(0xc4200afd40, 0xc4200afd40, 0x1517260)
/usr/src/docker/.gopath/src/github.com/docker/docker/vendor/github.com/spf13/cobra/command.go:695 +0x2b
main.main()
/usr/src/docker/.gopath/src/github.com/docker/docker/cmd/docker/docker.go:169 +0xcb
goroutine 17 [syscall, locked to thread]:
runtime.goexit()
/usr/local/go/src/runtime/asm_amd64.s:2086 +0x1
goroutine 5 [syscall]:
os/signal.signal_recv(0x0)
/usr/local/go/src/runtime/sigqueue.go:116 +0x157
os/signal.loop()
/usr/local/go/src/os/signal/signal_unix.go:22 +0x22
created by os/signal.init.1
/usr/local/go/src/os/signal/signal_unix.go:28 +0x41
goroutine 8 [runnable]:
net/http.(*Transport).tryPutIdleConn(0xc4200eea50, 0xc4202cfa00, 0x0, 0x0)
/usr/local/go/src/net/http/transport.go:677 +0x372
net/http.(*persistConn).readLoop.func2(0x0, 0xc4200eec01)
/usr/local/go/src/net/http/transport.go:1391 +0x40
net/http.(*persistConn).readLoop(0xc4202cfa00)
/usr/local/go/src/net/http/transport.go:1548 +0x85d
created by net/http.(*Transport).dialConn
/usr/local/go/src/net/http/transport.go:1062 +0x4e9
goroutine 9 [select]:
net/http.(*persistConn).writeLoop(0xc4202cfa00)
/usr/local/go/src/net/http/transport.go:1646 +0x3bd
created by net/http.(*Transport).dialConn
/usr/local/go/src/net/http/transport.go:1063 +0x50e
rax 0x0
rbx 0x7f1583d54700
rcx 0x7f15839c4428
rdx 0x6
rdi 0xd38
rsi 0xd4b
rbp 0xf1d11e
rsp 0x7f15797f99b8
r8 0x7f1583d55770
r9 0x7f15797fa700
r10 0x8
r11 0x202
r12 0x7f15580008c0
r13 0xf3
r14 0x30
r15 0x3
rip 0x7f15839c4428
rflags 0x202
cs 0x33
fs 0x0
gs 0x0
[Pipeline] }
[Pipeline] // script
[Pipeline] }
[Pipeline] // stage
[Pipeline] stage
[Pipeline] { (build net-2.0)
Stage 'build net-2.0' skipped due to earlier failure(s)
[Pipeline] }
[Pipeline] // stage
[Pipeline] stage
[Pipeline] { (build net-3.5)
Stage 'build net-3.5' skipped due to earlier failure(s)
[Pipeline] }
[Pipeline] // stage
[Pipeline] stage
[Pipeline] { (build net-3.5-cp)
Stage 'build net-3.5-cp' skipped due to earlier failure(s)
[Pipeline] }
[Pipeline] // stage
[Pipeline] stage
[Pipeline] { (build net-4.0)
Stage 'build net-4.0' skipped due to earlier failure(s)
[Pipeline] }
[Pipeline] // stage
[Pipeline] stage
[Pipeline] { (build net-4.0-cp)
Stage 'build net-4.0-cp' skipped due to earlier failure(s)
[Pipeline] }
[Pipeline] // stage
[Pipeline] stage
[Pipeline] { (build net-4.5)
Stage 'build net-4.5' skipped due to earlier failure(s)
[Pipeline] }
[Pipeline] // stage
[Pipeline] stage
[Pipeline] { (build mono-2.0)
Stage 'build mono-2.0' skipped due to earlier failure(s)
[Pipeline] }
[Pipeline] // stage
[Pipeline] stage
[Pipeline] { (build mono-3.5)
Stage 'build mono-3.5' skipped due to earlier failure(s)
[Pipeline] }
[Pipeline] // stage
[Pipeline] stage
[Pipeline] { (build mono-4.0)
Stage 'build mono-4.0' skipped due to earlier failure(s)
[Pipeline] }
[Pipeline] // stage
[Pipeline] stage
[Pipeline] { (build site)
Stage 'build site' skipped due to earlier failure(s)
[Pipeline] }
[Pipeline] // stage
[Pipeline] stage
[Pipeline] { (prepare package)
Stage 'prepare package' skipped due to earlier failure(s)
[Pipeline] }
[Pipeline] // stage
[Pipeline] stage
[Pipeline] { (check test results)
Stage 'check test results' skipped due to earlier failure(s)
[Pipeline] }
[Pipeline] // stage
[Pipeline] stage
[Pipeline] { (publish site)
Stage 'publish site' skipped due to earlier failure(s)
[Pipeline] }
[Pipeline] // stage
[Pipeline] stage
[Pipeline] { (Declarative: Post Actions)
[Pipeline] step
Build failed in Jenkins: logging-log4net » feature/cd-pipeline #201
Posted by Apache Jenkins Server <je...@builds.apache.org>.
See <https://builds.apache.org/job/logging-log4net/job/feature%252Fcd-pipeline/201/display/redirect>
------------------------------------------
[...truncated 7.82 KB...]
---> 583ba7b4530f
Step 2/8 : ARG JENKINS_UID
---> Using cache
---> d65b5107ef11
Step 3/8 : ARG JENKINS_GID
---> Using cache
---> b6020a8c63be
Step 4/8 : MAINTAINER "dev@logging.apache.org"
---> Using cache
---> e547e1e03f31
Step 5/8 : RUN mkdir -p /var/workspaces && chmod 0777 /var/workspaces
---> Using cache
---> 0381e939e8f7
Step 6/8 : RUN groupadd -r -g $JENKINS_GID jenkins-slave
---> Using cache
---> 41289c5f78d1
Step 7/8 : RUN useradd --base-dir /var/workspaces --create-home --shell /bin/bash --uid $JENKINS_UID --gid $JENKINS_GID --groups $JENKINS_GID -p -M jenkins
---> Using cache
---> 64fb4259b854
Step 8/8 : RUN apt-get update && apt-get install -y nant git
---> Using cache
---> 3f469df9b609
Successfully built 3f469df9b609
Successfully tagged builder-netstandard:latest
[Pipeline] dockerFingerprintFrom
[Pipeline] sh
[log4net_feature_cd-pipeline-76KUCPODUF6LCE45226EBUR4GNVLYPMYVC23Z4ITBOMNJT3CA2WA] Running shell script
+ docker inspect -f . builder-netstandard:latest
.
[Pipeline] withDockerContainer
H26 does not seem to be running inside a container
$ docker run -t -d -u 910:910 -w /home/jenkins/jenkins-slave/workspace/log4net_feature_cd-pipeline-76KUCPODUF6LCE45226EBUR4GNVLYPMYVC23Z4ITBOMNJT3CA2WA -v /home/jenkins/jenkins-slave/workspace/log4net_feature_cd-pipeline-76KUCPODUF6LCE45226EBUR4GNVLYPMYVC23Z4ITBOMNJT3CA2WA:/home/jenkins/jenkins-slave/workspace/log4net_feature_cd-pipeline-76KUCPODUF6LCE45226EBUR4GNVLYPMYVC23Z4ITBOMNJT3CA2WA:rw,z -v /home/jenkins/jenkins-slave/workspace/log4net_feature_cd-pipeline-76KUCPODUF6LCE45226EBUR4GNVLYPMYVC23Z4ITBOMNJT3CA2WA@tmp:/home/jenkins/jenkins-slave/workspace/log4net_feature_cd-pipeline-76KUCPODUF6LCE45226EBUR4GNVLYPMYVC23Z4ITBOMNJT3CA2WA@tmp:rw,z -e ******** -e ******** -e ******** -e ******** -e ******** -e ******** -e ******** -e ******** -e ******** -e ******** -e ******** -e ******** -e ******** -e ******** -e ******** -e ******** -e ******** -e ******** -e ******** -e ******** -e ******** -e ******** -e ******** -e ******** -e ******** -e ******** -e ******** builder-netstandard:latest cat
$ docker top d82218aa9998fa3d8fe8f4976a0d5f6a095e321af542eb48fc03af478641d830 -eo pid,comm
[Pipeline] {
[Pipeline] sh
[log4net_feature_cd-pipeline-76KUCPODUF6LCE45226EBUR4GNVLYPMYVC23Z4ITBOMNJT3CA2WA] Running shell script
+ nant compile-netstandard-1.3
NAnt 0.92 (Build 0.92.4526.0; rc1; 05/23/2012)
Copyright (C) 2001-2012 Gerry Shaw
http://nant.sourceforge.net
Buildfile: file:///home/jenkins/jenkins-slave/workspace/log4net_feature_cd-pipeline-76KUCPODUF6LCE45226EBUR4GNVLYPMYVC23Z4ITBOMNJT3CA2WA/log4net.build
Target framework: Mono 4.0 Profile
Target(s) specified: compile-netstandard-1.3
check-current-build-config:
set-build-configuration:
set-debug-build-configuration:
check-current-build-config:
set-build-configuration-flags:
compile-netstandard-1.3:
set-debug-build-configuration:
check-current-build-config:
set-build-configuration-flags:
compile-netstandard-1.3-current-configuration:
[echo] dotnet --version
[exec] 2.1.200
[echo] dotnet restore log4net.netstandard.sln
[exec]
[exec] Welcome to .NET Core!
[exec] ---------------------
[exec] Learn more about .NET Core @ https://aka.ms/dotnet-docs. Use dotnet --help to see available commands or go to https://aka.ms/dotnet-cli-docs.
[exec]
[exec] Telemetry
[exec] --------------
[exec] The .NET Core tools collect usage data in order to improve your experience. The data is anonymous and does not include command-line arguments. The data is collected by Microsoft and shared with the community.
[exec] You can opt out of telemetry by setting a DOTNET_CLI_TELEMETRY_OPTOUT environment variable to 1 using your favorite shell.
[exec] You can read more about .NET Core tools telemetry @ https://aka.ms/dotnet-cli-telemetry.
[exec] Restoring packages for /home/jenkins/jenkins-slave/workspace/log4net_feature_cd-pipeline-76KUCPODUF6LCE45226EBUR4GNVLYPMYVC23Z4ITBOMNJT3CA2WA/netstandard/1.3/log4net/log4net.csproj...
[exec] Restoring packages for /home/jenkins/jenkins-slave/workspace/log4net_feature_cd-pipeline-76KUCPODUF6LCE45226EBUR4GNVLYPMYVC23Z4ITBOMNJT3CA2WA/netstandard/1.3/log4net.tests/log4net.tests.csproj...
[exec] Installing System.Security.Claims 4.0.1.
[exec] Installing System.Security.Principal.Windows 4.0.0.
[exec] Installing System.Net.WebHeaderCollection 4.0.1.
[exec] Installing System.Net.NameResolution 4.0.0.
[exec] Installing System.Net.Requests 4.0.11.
[exec] Installing System.Diagnostics.StackTrace 4.0.1.
[exec] Installing System.IO.FileSystem.Watcher 4.0.0.
[exec] Generating MSBuild file /home/jenkins/jenkins-slave/workspace/log4net_feature_cd-pipeline-76KUCPODUF6LCE45226EBUR4GNVLYPMYVC23Z4ITBOMNJT3CA2WA/netstandard/1.3/log4net/obj/log4net.csproj.nuget.g.props.
[exec] Generating MSBuild file /home/jenkins/jenkins-slave/workspace/log4net_feature_cd-pipeline-76KUCPODUF6LCE45226EBUR4GNVLYPMYVC23Z4ITBOMNJT3CA2WA/netstandard/1.3/log4net/obj/log4net.csproj.nuget.g.targets.
[exec] Restore completed in 2.7 sec for /home/jenkins/jenkins-slave/workspace/log4net_feature_cd-pipeline-76KUCPODUF6LCE45226EBUR4GNVLYPMYVC23Z4ITBOMNJT3CA2WA/netstandard/1.3/log4net/log4net.csproj.
[exec] Installing System.ComponentModel 4.0.1.
[exec] Installing System.ComponentModel.Primitives 4.1.0.
[exec] Installing System.Collections.Specialized 4.0.1.
[exec] Installing System.ComponentModel.TypeConverter 4.1.0.
[exec] Installing System.Diagnostics.TextWriterTraceListener 4.0.0.
[exec] Installing System.ComponentModel.EventBasedAsync 4.0.11.
[exec] Installing Microsoft.DotNet.PlatformAbstractions 1.0.3.
[exec] Installing Microsoft.TestPlatform.ObjectModel 15.5.0.
[exec] Installing Microsoft.Extensions.DependencyModel 1.0.3.
[exec] Installing Microsoft.Win32.Registry 4.3.0.
[exec] Installing Microsoft.TestPlatform.TestHost 15.5.0.
[exec] Installing NUnit3TestAdapter 3.9.0.
[exec] Installing Microsoft.NET.Test.Sdk 15.5.0.
[exec] Installing Microsoft.CodeCoverage 1.0.3.
[exec] Installing System.ComponentModel.EventBasedAsync 4.3.0.
[exec] Installing System.Diagnostics.Process 4.3.0.
[exec] Installing Microsoft.DotNet.InternalAbstractions 1.0.0.
[exec] Installing System.Xml.XPath.XmlDocument 4.3.0.
[exec] Generating MSBuild file /home/jenkins/jenkins-slave/workspace/log4net_feature_cd-pipeline-76KUCPODUF6LCE45226EBUR4GNVLYPMYVC23Z4ITBOMNJT3CA2WA/netstandard/1.3/log4net.tests/obj/log4net.tests.csproj.nuget.g.props.
[exec] Generating MSBuild file /home/jenkins/jenkins-slave/workspace/log4net_feature_cd-pipeline-76KUCPODUF6LCE45226EBUR4GNVLYPMYVC23Z4ITBOMNJT3CA2WA/netstandard/1.3/log4net.tests/obj/log4net.tests.csproj.nuget.g.targets.
[exec] Restore completed in 3.54 sec for /home/jenkins/jenkins-slave/workspace/log4net_feature_cd-pipeline-76KUCPODUF6LCE45226EBUR4GNVLYPMYVC23Z4ITBOMNJT3CA2WA/netstandard/1.3/log4net.tests/log4net.tests.csproj.
[echo] dotnet build log4net
[exec] Microsoft (R) Build Engine version 15.7.177.53362 for .NET Core
[exec] Copyright (C) Microsoft Corporation. All rights reserved.
[exec]
[exec] Restore completed in 84.23 ms for /home/jenkins/jenkins-slave/workspace/log4net_feature_cd-pipeline-76KUCPODUF6LCE45226EBUR4GNVLYPMYVC23Z4ITBOMNJT3CA2WA/netstandard/1.3/log4net/log4net.csproj.
[exec] log4net -> /home/jenkins/jenkins-slave/workspace/log4net_feature_cd-pipeline-76KUCPODUF6LCE45226EBUR4GNVLYPMYVC23Z4ITBOMNJT3CA2WA/netstandard/1.3/log4net/bin/Debug/netstandard1.3/log4net.dll
[exec]
[exec] Build succeeded.
[exec] 0 Warning(s)
[exec] 0 Error(s)
[exec]
[exec] Time Elapsed 00:00:05.25
[mkdir] Creating directory '/home/jenkins/jenkins-slave/workspace/log4net_feature_cd-pipeline-76KUCPODUF6LCE45226EBUR4GNVLYPMYVC23Z4ITBOMNJT3CA2WA/bin/netstandard/1.3'.
[move] 1 directory moved.
set-release-build-configuration:
check-current-build-config:
set-build-configuration-flags:
compile-netstandard-1.3-current-configuration:
[echo] dotnet --version
[exec] 2.1.200
[echo] dotnet restore log4net.netstandard.sln
[exec] Restore completed in 90.28 ms for /home/jenkins/jenkins-slave/workspace/log4net_feature_cd-pipeline-76KUCPODUF6LCE45226EBUR4GNVLYPMYVC23Z4ITBOMNJT3CA2WA/netstandard/1.3/log4net.tests/log4net.tests.csproj.
[exec] Restore completed in 95.41 ms for /home/jenkins/jenkins-slave/workspace/log4net_feature_cd-pipeline-76KUCPODUF6LCE45226EBUR4GNVLYPMYVC23Z4ITBOMNJT3CA2WA/netstandard/1.3/log4net/log4net.csproj.
[echo] dotnet build log4net
[exec] Microsoft (R) Build Engine version 15.7.177.53362 for .NET Core
[exec] Copyright (C) Microsoft Corporation. All rights reserved.
[exec]
[exec] Restore completed in 78.23 ms for /home/jenkins/jenkins-slave/workspace/log4net_feature_cd-pipeline-76KUCPODUF6LCE45226EBUR4GNVLYPMYVC23Z4ITBOMNJT3CA2WA/netstandard/1.3/log4net/log4net.csproj.
[exec] log4net -> /home/jenkins/jenkins-slave/workspace/log4net_feature_cd-pipeline-76KUCPODUF6LCE45226EBUR4GNVLYPMYVC23Z4ITBOMNJT3CA2WA/netstandard/1.3/log4net/bin/Release/netstandard1.3/log4net.dll
[exec]
[exec] Build succeeded.
[exec] 0 Warning(s)
[exec] 0 Error(s)
[exec]
[exec] Time Elapsed 00:00:03.53
[move] 1 directory moved.
BUILD SUCCEEDED
Total time: 19.6 seconds.
[Pipeline] stash
Stashed 6 file(s)
[Pipeline] sh
[log4net_feature_cd-pipeline-76KUCPODUF6LCE45226EBUR4GNVLYPMYVC23Z4ITBOMNJT3CA2WA] Running shell script
[Pipeline] }
$ docker stop --time=1 d82218aa9998fa3d8fe8f4976a0d5f6a095e321af542eb48fc03af478641d830
[Pipeline] // withDockerContainer
[Pipeline] }
[Pipeline] // script
[Pipeline] }
[Pipeline] // stage
[Pipeline] stage
[Pipeline] { (build net-2.0)
Stage 'build net-2.0' skipped due to earlier failure(s)
[Pipeline] }
[Pipeline] // stage
[Pipeline] stage
[Pipeline] { (build net-3.5)
Stage 'build net-3.5' skipped due to earlier failure(s)
[Pipeline] }
[Pipeline] // stage
[Pipeline] stage
[Pipeline] { (build net-3.5-cp)
Stage 'build net-3.5-cp' skipped due to earlier failure(s)
[Pipeline] }
[Pipeline] // stage
[Pipeline] stage
[Pipeline] { (build net-4.0)
Stage 'build net-4.0' skipped due to earlier failure(s)
[Pipeline] }
[Pipeline] // stage
[Pipeline] stage
[Pipeline] { (build net-4.0-cp)
Stage 'build net-4.0-cp' skipped due to earlier failure(s)
[Pipeline] }
[Pipeline] // stage
[Pipeline] stage
[Pipeline] { (build net-4.5)
Stage 'build net-4.5' skipped due to earlier failure(s)
[Pipeline] }
[Pipeline] // stage
[Pipeline] stage
[Pipeline] { (build mono-2.0)
Stage 'build mono-2.0' skipped due to earlier failure(s)
[Pipeline] }
[Pipeline] // stage
[Pipeline] stage
[Pipeline] { (build mono-3.5)
Stage 'build mono-3.5' skipped due to earlier failure(s)
[Pipeline] }
[Pipeline] // stage
[Pipeline] stage
[Pipeline] { (build mono-4.0)
Stage 'build mono-4.0' skipped due to earlier failure(s)
[Pipeline] }
[Pipeline] // stage
[Pipeline] stage
[Pipeline] { (build site)
Stage 'build site' skipped due to earlier failure(s)
[Pipeline] }
[Pipeline] // stage
[Pipeline] stage
[Pipeline] { (prepare package)
Stage 'prepare package' skipped due to earlier failure(s)
[Pipeline] }
[Pipeline] // stage
[Pipeline] stage
[Pipeline] { (check test results)
Stage 'check test results' skipped due to earlier failure(s)
[Pipeline] }
[Pipeline] // stage
[Pipeline] stage
[Pipeline] { (publish site)
Stage 'publish site' skipped due to earlier failure(s)
[Pipeline] }
[Pipeline] // stage
[Pipeline] stage
[Pipeline] { (Declarative: Post Actions)
[Pipeline] step
Build failed in Jenkins: logging-log4net » feature/cd-pipeline #200
Posted by Apache Jenkins Server <je...@builds.apache.org>.
See <https://builds.apache.org/job/logging-log4net/job/feature%252Fcd-pipeline/200/display/redirect>
------------------------------------------
[...truncated 287.50 KB...]
check-build-debug:
check-build-defines:
set-net-2.0-runtime-configuration:
check-log4net-basedir:
check-current-bin-dir:
[mkdir] Creating directory 'f:\jenkins\jenkins-slave\workspace\log4net_feature_cd-pipeline-76KUCPODUF6LCE45226EBUR4GNVLYPMYVC23Z4ITBOMNJT3CA2WA\bin\net\2.0\debug'.
clean-current-bin-dir:
[echo] Cleaning the bin/net/2.0/debug binaries directory.
[delete] Deleting directory 'f:\jenkins\jenkins-slave\workspace\log4net_feature_cd-pipeline-76KUCPODUF6LCE45226EBUR4GNVLYPMYVC23Z4ITBOMNJT3CA2WA\bin\net\2.0\debug'.
[mkdir] Creating directory 'f:\jenkins\jenkins-slave\workspace\log4net_feature_cd-pipeline-76KUCPODUF6LCE45226EBUR4GNVLYPMYVC23Z4ITBOMNJT3CA2WA\bin\net\2.0\debug'.
[csc] Compiling 226 files to 'f:\jenkins\jenkins-slave\workspace\log4net_feature_cd-pipeline-76KUCPODUF6LCE45226EBUR4GNVLYPMYVC23Z4ITBOMNJT3CA2WA\bin\net\2.0\debug\log4net.dll'.
set-release-build-configuration:
check-current-build-config:
set-build-configuration-flags:
compile-net-2.0-current-configuration:
check-bin-dir:
check-doc-dir:
check-sdkdoc-dir:
check-sdkdoc-debug:
check-current-build-config:
check-build-debug:
check-build-defines:
set-net-2.0-runtime-configuration:
check-log4net-basedir:
check-current-bin-dir:
[mkdir] Creating directory 'f:\jenkins\jenkins-slave\workspace\log4net_feature_cd-pipeline-76KUCPODUF6LCE45226EBUR4GNVLYPMYVC23Z4ITBOMNJT3CA2WA\bin\net\2.0\release'.
clean-current-bin-dir:
[echo] Cleaning the bin/net/2.0/release binaries directory.
[delete] Deleting directory 'f:\jenkins\jenkins-slave\workspace\log4net_feature_cd-pipeline-76KUCPODUF6LCE45226EBUR4GNVLYPMYVC23Z4ITBOMNJT3CA2WA\bin\net\2.0\release'.
[mkdir] Creating directory 'f:\jenkins\jenkins-slave\workspace\log4net_feature_cd-pipeline-76KUCPODUF6LCE45226EBUR4GNVLYPMYVC23Z4ITBOMNJT3CA2WA\bin\net\2.0\release'.
[echo] Old key file not found.
[echo] The release build using the old key will be skipped.
[csc] Compiling 226 files to 'f:\jenkins\jenkins-slave\workspace\log4net_feature_cd-pipeline-76KUCPODUF6LCE45226EBUR4GNVLYPMYVC23Z4ITBOMNJT3CA2WA\bin\net\2.0\release\log4net.dll'.
BUILD SUCCEEDED
Total time: 1.9 seconds.
[Pipeline] stash
Stashed 6 file(s)
[Pipeline] bat
[log4net_feature_cd-pipeline-76KUCPODUF6LCE45226EBUR4GNVLYPMYVC23Z4ITBOMNJT3CA2WA] Running batch script
f:\jenkins\jenkins-slave\workspace\log4net_feature_cd-pipeline-76KUCPODUF6LCE45226EBUR4GNVLYPMYVC23Z4ITBOMNJT3CA2WA>F:\jenkins\tools\nant\nant-0.92\bin\NAnt.exe -t:net-2.0 -buildfile:tests/nant.build runtests-net-2.0
NAnt 0.92 (Build 0.92.4543.0; release; 6/9/2012)
Copyright (C) 2001-2012 Gerry Shaw
http://nant.sourceforge.net
Buildfile: file:///f:/jenkins/jenkins-slave/workspace/log4net_feature_cd-pipeline-76KUCPODUF6LCE45226EBUR4GNVLYPMYVC23Z4ITBOMNJT3CA2WA/tests/nant.build
Target framework: Microsoft .NET Framework 2.0
Target(s) specified: runtests-net-2.0
check-current-build-config:
set-build-configuration:
set-debug-build-configuration:
check-current-build-config:
set-build-configuration-flags:
check-bin-dir:
[mkdir] Creating directory 'f:\jenkins\jenkins-slave\workspace\log4net_feature_cd-pipeline-76KUCPODUF6LCE45226EBUR4GNVLYPMYVC23Z4ITBOMNJT3CA2WA\tests\bin'.
check-doc-dir:
[mkdir] Creating directory 'f:\jenkins\jenkins-slave\workspace\log4net_feature_cd-pipeline-76KUCPODUF6LCE45226EBUR4GNVLYPMYVC23Z4ITBOMNJT3CA2WA\tests\doc'.
check-sdkdoc-dir:
check-sdkdoc-debug:
check-build-debug:
check-build-defines:
set-net-2.0-runtime-configuration:
check-log4net-basedir:
check-current-bin-dir:
[mkdir] Creating directory 'f:\jenkins\jenkins-slave\workspace\log4net_feature_cd-pipeline-76KUCPODUF6LCE45226EBUR4GNVLYPMYVC23Z4ITBOMNJT3CA2WA\tests\bin\net\2.0\debug'.
clean-current-bin-dir:
[echo] Cleaning the bin/net/2.0/debug binaries directory.
[delete] Deleting directory 'f:\jenkins\jenkins-slave\workspace\log4net_feature_cd-pipeline-76KUCPODUF6LCE45226EBUR4GNVLYPMYVC23Z4ITBOMNJT3CA2WA\tests\bin\net\2.0\debug'.
[mkdir] Creating directory 'f:\jenkins\jenkins-slave\workspace\log4net_feature_cd-pipeline-76KUCPODUF6LCE45226EBUR4GNVLYPMYVC23Z4ITBOMNJT3CA2WA\tests\bin\net\2.0\debug'.
check-log4net-output-dir:
check-log4net-assembly:
[echo] Testing if file exists: ..//bin/net/2.0/debug\log4net.dll
install-nunit:
[get] Retrieving 'https://www.nuget.org/api/v2/package/NUnit/2.6.5' to 'f:\jenkins\jenkins-slave\workspace\log4net_feature_cd-pipeline-76KUCPODUF6LCE45226EBUR4GNVLYPMYVC23Z4ITBOMNJT3CA2WA\tests\.tmp-nunit.zip'.
[unzip] Unzipping 'f:\jenkins\jenkins-slave\workspace\log4net_feature_cd-pipeline-76KUCPODUF6LCE45226EBUR4GNVLYPMYVC23Z4ITBOMNJT3CA2WA\tests\.tmp-nunit.zip' to 'f:\jenkins\jenkins-slave\workspace\log4net_feature_cd-pipeline-76KUCPODUF6LCE45226EBUR4GNVLYPMYVC23Z4ITBOMNJT3CA2WA\tests\.tmp-nunit'.
[copy] Copying 1 file to 'f:\jenkins\jenkins-slave\workspace\log4net_feature_cd-pipeline-76KUCPODUF6LCE45226EBUR4GNVLYPMYVC23Z4ITBOMNJT3CA2WA\tests\lib\net\2.0\debug'.
[delete] Deleting file f:\jenkins\jenkins-slave\workspace\log4net_feature_cd-pipeline-76KUCPODUF6LCE45226EBUR4GNVLYPMYVC23Z4ITBOMNJT3CA2WA\tests\.tmp-nunit.zip.
[delete] Deleting directory 'f:\jenkins\jenkins-slave\workspace\log4net_feature_cd-pipeline-76KUCPODUF6LCE45226EBUR4GNVLYPMYVC23Z4ITBOMNJT3CA2WA\tests\.tmp-nunit'.
compile-net-2.0:
[copy] Copying 3 files to 'f:\jenkins\jenkins-slave\workspace\log4net_feature_cd-pipeline-76KUCPODUF6LCE45226EBUR4GNVLYPMYVC23Z4ITBOMNJT3CA2WA\tests\bin\net\2.0\debug'.
[copy] Copying 1 file to 'f:\jenkins\jenkins-slave\workspace\log4net_feature_cd-pipeline-76KUCPODUF6LCE45226EBUR4GNVLYPMYVC23Z4ITBOMNJT3CA2WA\tests\bin\net\2.0\debug'.
[csc] Compiling 46 files to 'f:\jenkins\jenkins-slave\workspace\log4net_feature_cd-pipeline-76KUCPODUF6LCE45226EBUR4GNVLYPMYVC23Z4ITBOMNJT3CA2WA\tests\bin\net\2.0\debug\log4net.Tests.dll'.
[csc] f:\jenkins\jenkins-slave\workspace\log4net_feature_cd-pipeline-76KUCPODUF6LCE45226EBUR4GNVLYPMYVC23Z4ITBOMNJT3CA2WA\tests\src\Appender\RemotingAppenderTest.cs(268,4): error CS0618: Warning as Error: 'NUnit.Framework.TestFixtureTearDownAttribute' is obsolete: 'Use OneTimeTearDownAttribute'
[csc] f:\jenkins\jenkins-slave\workspace\log4net_feature_cd-pipeline-76KUCPODUF6LCE45226EBUR4GNVLYPMYVC23Z4ITBOMNJT3CA2WA\tests\src\Core\FixingTest.cs(39,4): error CS0618: Warning as Error: 'NUnit.Framework.TestFixtureSetUpAttribute' is obsolete: 'Use OneTimeSetUpAttribute'
[csc] f:\jenkins\jenkins-slave\workspace\log4net_feature_cd-pipeline-76KUCPODUF6LCE45226EBUR4GNVLYPMYVC23Z4ITBOMNJT3CA2WA\tests\src\Util\CyclicBufferTest.cs(38,10): error CS0618: Warning as Error: 'NUnit.Framework.ExpectedExceptionAttribute' is obsolete: 'Use Assert.Throw'
[csc] f:\jenkins\jenkins-slave\workspace\log4net_feature_cd-pipeline-76KUCPODUF6LCE45226EBUR4GNVLYPMYVC23Z4ITBOMNJT3CA2WA\tests\src\Util\SystemInfoTest.cs(140,10): error CS0618: Warning as Error: 'NUnit.Framework.ExpectedExceptionAttribute' is obsolete: 'Use Assert.Throw'
[csc] f:\jenkins\jenkins-slave\workspace\log4net_feature_cd-pipeline-76KUCPODUF6LCE45226EBUR4GNVLYPMYVC23Z4ITBOMNJT3CA2WA\tests\src\Util\SystemInfoTest.cs(151,10): error CS0618: Warning as Error: 'NUnit.Framework.ExpectedExceptionAttribute' is obsolete: 'Use Assert.Throw'
BUILD FAILED
f:\jenkins\jenkins-slave\workspace\log4net_feature_cd-pipeline-76KUCPODUF6LCE45226EBUR4GNVLYPMYVC23Z4ITBOMNJT3CA2WA\tests\nant.build(290,10):
External Program Failed: C:\Windows\Microsoft.NET\Framework64\v2.0.50727\csc.exe (return code was 1)
Total time: 1.6 seconds.
[Pipeline] }
[Pipeline] // withEnv
[Pipeline] }
[Pipeline] // node
[Pipeline] }
[Pipeline] // stage
[Pipeline] stage
[Pipeline] { (build net-3.5)
Stage 'build net-3.5' skipped due to earlier failure(s)
[Pipeline] }
[Pipeline] // stage
[Pipeline] stage
[Pipeline] { (build net-3.5-cp)
Stage 'build net-3.5-cp' skipped due to earlier failure(s)
[Pipeline] }
[Pipeline] // stage
[Pipeline] stage
[Pipeline] { (build net-4.0)
Stage 'build net-4.0' skipped due to earlier failure(s)
[Pipeline] }
[Pipeline] // stage
[Pipeline] stage
[Pipeline] { (build net-4.0-cp)
Stage 'build net-4.0-cp' skipped due to earlier failure(s)
[Pipeline] }
[Pipeline] // stage
[Pipeline] stage
[Pipeline] { (build net-4.5)
Stage 'build net-4.5' skipped due to earlier failure(s)
[Pipeline] }
[Pipeline] // stage
[Pipeline] stage
[Pipeline] { (build mono-2.0)
Stage 'build mono-2.0' skipped due to earlier failure(s)
[Pipeline] }
[Pipeline] // stage
[Pipeline] stage
[Pipeline] { (build mono-3.5)
Stage 'build mono-3.5' skipped due to earlier failure(s)
[Pipeline] }
[Pipeline] // stage
[Pipeline] stage
[Pipeline] { (build mono-4.0)
Stage 'build mono-4.0' skipped due to earlier failure(s)
[Pipeline] }
[Pipeline] // stage
[Pipeline] stage
[Pipeline] { (build site)
Stage 'build site' skipped due to earlier failure(s)
[Pipeline] }
[Pipeline] // stage
[Pipeline] stage
[Pipeline] { (prepare package)
Stage 'prepare package' skipped due to earlier failure(s)
[Pipeline] }
[Pipeline] // stage
[Pipeline] stage
[Pipeline] { (check test results)
Stage 'check test results' skipped due to earlier failure(s)
[Pipeline] }
[Pipeline] // stage
[Pipeline] stage
[Pipeline] { (publish site)
Stage 'publish site' skipped due to earlier failure(s)
[Pipeline] }
[Pipeline] // stage
[Pipeline] stage
[Pipeline] { (Declarative: Post Actions)
[Pipeline] step
Build failed in Jenkins: logging-log4net » feature/cd-pipeline #199
Posted by Apache Jenkins Server <je...@builds.apache.org>.
See <https://builds.apache.org/job/logging-log4net/job/feature%252Fcd-pipeline/199/display/redirect>
------------------------------------------
[...truncated 184.62 KB...]
check-bin-dir:
[mkdir] Creating directory 'f:\jenkins\jenkins-slave\workspace\log4net_feature_cd-pipeline-76KUCPODUF6LCE45226EBUR4GNVLYPMYVC23Z4ITBOMNJT3CA2WA\bin'.
check-doc-dir:
[mkdir] Creating directory 'f:\jenkins\jenkins-slave\workspace\log4net_feature_cd-pipeline-76KUCPODUF6LCE45226EBUR4GNVLYPMYVC23Z4ITBOMNJT3CA2WA\doc'.
check-sdkdoc-dir:
check-sdkdoc-debug:
check-current-build-config:
check-build-debug:
check-build-defines:
set-net-2.0-runtime-configuration:
check-log4net-basedir:
check-current-bin-dir:
[mkdir] Creating directory 'f:\jenkins\jenkins-slave\workspace\log4net_feature_cd-pipeline-76KUCPODUF6LCE45226EBUR4GNVLYPMYVC23Z4ITBOMNJT3CA2WA\bin\net\2.0\debug'.
clean-current-bin-dir:
[echo] Cleaning the bin/net/2.0/debug binaries directory.
[delete] Deleting directory 'f:\jenkins\jenkins-slave\workspace\log4net_feature_cd-pipeline-76KUCPODUF6LCE45226EBUR4GNVLYPMYVC23Z4ITBOMNJT3CA2WA\bin\net\2.0\debug'.
[mkdir] Creating directory 'f:\jenkins\jenkins-slave\workspace\log4net_feature_cd-pipeline-76KUCPODUF6LCE45226EBUR4GNVLYPMYVC23Z4ITBOMNJT3CA2WA\bin\net\2.0\debug'.
[csc] Compiling 226 files to 'f:\jenkins\jenkins-slave\workspace\log4net_feature_cd-pipeline-76KUCPODUF6LCE45226EBUR4GNVLYPMYVC23Z4ITBOMNJT3CA2WA\bin\net\2.0\debug\log4net.dll'.
set-release-build-configuration:
check-current-build-config:
set-build-configuration-flags:
compile-net-2.0-current-configuration:
check-bin-dir:
check-doc-dir:
check-sdkdoc-dir:
check-sdkdoc-debug:
check-current-build-config:
check-build-debug:
check-build-defines:
set-net-2.0-runtime-configuration:
check-log4net-basedir:
check-current-bin-dir:
[mkdir] Creating directory 'f:\jenkins\jenkins-slave\workspace\log4net_feature_cd-pipeline-76KUCPODUF6LCE45226EBUR4GNVLYPMYVC23Z4ITBOMNJT3CA2WA\bin\net\2.0\release'.
clean-current-bin-dir:
[echo] Cleaning the bin/net/2.0/release binaries directory.
[delete] Deleting directory 'f:\jenkins\jenkins-slave\workspace\log4net_feature_cd-pipeline-76KUCPODUF6LCE45226EBUR4GNVLYPMYVC23Z4ITBOMNJT3CA2WA\bin\net\2.0\release'.
[mkdir] Creating directory 'f:\jenkins\jenkins-slave\workspace\log4net_feature_cd-pipeline-76KUCPODUF6LCE45226EBUR4GNVLYPMYVC23Z4ITBOMNJT3CA2WA\bin\net\2.0\release'.
[echo] Old key file not found.
[echo] The release build using the old key will be skipped.
[csc] Compiling 226 files to 'f:\jenkins\jenkins-slave\workspace\log4net_feature_cd-pipeline-76KUCPODUF6LCE45226EBUR4GNVLYPMYVC23Z4ITBOMNJT3CA2WA\bin\net\2.0\release\log4net.dll'.
BUILD SUCCEEDED
Total time: 2 seconds.
[Pipeline] stash
Stashed 6 file(s)
[Pipeline] bat
[log4net_feature_cd-pipeline-76KUCPODUF6LCE45226EBUR4GNVLYPMYVC23Z4ITBOMNJT3CA2WA] Running batch script
f:\jenkins\jenkins-slave\workspace\log4net_feature_cd-pipeline-76KUCPODUF6LCE45226EBUR4GNVLYPMYVC23Z4ITBOMNJT3CA2WA>F:\jenkins\tools\nant\nant-0.92\bin\NAnt.exe -t:net-2.0 -buildfile:tests/nant.build runtests-net-2.0
NAnt 0.92 (Build 0.92.4543.0; release; 6/9/2012)
Copyright (C) 2001-2012 Gerry Shaw
http://nant.sourceforge.net
Buildfile: file:///f:/jenkins/jenkins-slave/workspace/log4net_feature_cd-pipeline-76KUCPODUF6LCE45226EBUR4GNVLYPMYVC23Z4ITBOMNJT3CA2WA/tests/nant.build
Target framework: Microsoft .NET Framework 2.0
Target(s) specified: runtests-net-2.0
check-current-build-config:
set-build-configuration:
set-debug-build-configuration:
check-current-build-config:
set-build-configuration-flags:
check-bin-dir:
[mkdir] Creating directory 'f:\jenkins\jenkins-slave\workspace\log4net_feature_cd-pipeline-76KUCPODUF6LCE45226EBUR4GNVLYPMYVC23Z4ITBOMNJT3CA2WA\tests\bin'.
check-doc-dir:
[mkdir] Creating directory 'f:\jenkins\jenkins-slave\workspace\log4net_feature_cd-pipeline-76KUCPODUF6LCE45226EBUR4GNVLYPMYVC23Z4ITBOMNJT3CA2WA\tests\doc'.
check-sdkdoc-dir:
check-sdkdoc-debug:
check-build-debug:
check-build-defines:
set-net-2.0-runtime-configuration:
check-log4net-basedir:
check-current-bin-dir:
[mkdir] Creating directory 'f:\jenkins\jenkins-slave\workspace\log4net_feature_cd-pipeline-76KUCPODUF6LCE45226EBUR4GNVLYPMYVC23Z4ITBOMNJT3CA2WA\tests\bin\net\2.0\debug'.
clean-current-bin-dir:
[echo] Cleaning the bin/net/2.0/debug binaries directory.
[delete] Deleting directory 'f:\jenkins\jenkins-slave\workspace\log4net_feature_cd-pipeline-76KUCPODUF6LCE45226EBUR4GNVLYPMYVC23Z4ITBOMNJT3CA2WA\tests\bin\net\2.0\debug'.
[mkdir] Creating directory 'f:\jenkins\jenkins-slave\workspace\log4net_feature_cd-pipeline-76KUCPODUF6LCE45226EBUR4GNVLYPMYVC23Z4ITBOMNJT3CA2WA\tests\bin\net\2.0\debug'.
check-log4net-output-dir:
check-log4net-assembly:
[echo] Testing if file exists: ..//bin/net/2.0/debug\log4net.dll
install-nunit:
BUILD FAILED
f:\jenkins\jenkins-slave\workspace\log4net_feature_cd-pipeline-76KUCPODUF6LCE45226EBUR4GNVLYPMYVC23Z4ITBOMNJT3CA2WA\tests\nant.build(29,6):
Unable to download 'https://github.com/nunit/nunitv2/releases/download/2.6.4/NUnit-2.6.4.zip' to 'f:\jenkins\jenkins-slave\workspace\log4net_feature_cd-pipeline-76KUCPODUF6LCE45226EBUR4GNVLYPMYVC23Z4ITBOMNJT3CA2WA\tests\.tmp-nunit.zip'.
The request was aborted: Could not create SSL/TLS secure channel.
Total time: 0.3 seconds.
[Pipeline] }
[Pipeline] // withEnv
[Pipeline] }
[Pipeline] // node
[Pipeline] }
[Pipeline] // stage
[Pipeline] stage
[Pipeline] { (build net-3.5)
Stage 'build net-3.5' skipped due to earlier failure(s)
[Pipeline] }
[Pipeline] // stage
[Pipeline] stage
[Pipeline] { (build net-3.5-cp)
Stage 'build net-3.5-cp' skipped due to earlier failure(s)
[Pipeline] }
[Pipeline] // stage
[Pipeline] stage
[Pipeline] { (build net-4.0)
Stage 'build net-4.0' skipped due to earlier failure(s)
[Pipeline] }
[Pipeline] // stage
[Pipeline] stage
[Pipeline] { (build net-4.0-cp)
Stage 'build net-4.0-cp' skipped due to earlier failure(s)
[Pipeline] }
[Pipeline] // stage
[Pipeline] stage
[Pipeline] { (build net-4.5)
Stage 'build net-4.5' skipped due to earlier failure(s)
[Pipeline] }
[Pipeline] // stage
[Pipeline] stage
[Pipeline] { (build mono-2.0)
Stage 'build mono-2.0' skipped due to earlier failure(s)
[Pipeline] }
[Pipeline] // stage
[Pipeline] stage
[Pipeline] { (build mono-3.5)
Stage 'build mono-3.5' skipped due to earlier failure(s)
[Pipeline] }
[Pipeline] // stage
[Pipeline] stage
[Pipeline] { (build mono-4.0)
Stage 'build mono-4.0' skipped due to earlier failure(s)
[Pipeline] }
[Pipeline] // stage
[Pipeline] stage
[Pipeline] { (build site)
Stage 'build site' skipped due to earlier failure(s)
[Pipeline] }
[Pipeline] // stage
[Pipeline] stage
[Pipeline] { (prepare package)
Stage 'prepare package' skipped due to earlier failure(s)
[Pipeline] }
[Pipeline] // stage
[Pipeline] stage
[Pipeline] { (check test results)
Stage 'check test results' skipped due to earlier failure(s)
[Pipeline] }
[Pipeline] // stage
[Pipeline] stage
[Pipeline] { (publish site)
Stage 'publish site' skipped due to earlier failure(s)
[Pipeline] }
[Pipeline] // stage
[Pipeline] stage
[Pipeline] { (Declarative: Post Actions)
[Pipeline] step
Build failed in Jenkins: logging-log4net » feature/cd-pipeline #198
Posted by Apache Jenkins Server <je...@builds.apache.org>.
See <https://builds.apache.org/job/logging-log4net/job/feature%252Fcd-pipeline/198/display/redirect>
------------------------------------------
[...truncated 128.85 KB...]
check-bin-dir:
[mkdir] Creating directory 'f:\jenkins\jenkins-slave\workspace\log4net_feature_cd-pipeline-76KUCPODUF6LCE45226EBUR4GNVLYPMYVC23Z4ITBOMNJT3CA2WA\bin'.
check-doc-dir:
[mkdir] Creating directory 'f:\jenkins\jenkins-slave\workspace\log4net_feature_cd-pipeline-76KUCPODUF6LCE45226EBUR4GNVLYPMYVC23Z4ITBOMNJT3CA2WA\doc'.
check-sdkdoc-dir:
check-sdkdoc-debug:
check-current-build-config:
check-build-debug:
check-build-defines:
set-net-2.0-runtime-configuration:
check-log4net-basedir:
check-current-bin-dir:
[mkdir] Creating directory 'f:\jenkins\jenkins-slave\workspace\log4net_feature_cd-pipeline-76KUCPODUF6LCE45226EBUR4GNVLYPMYVC23Z4ITBOMNJT3CA2WA\bin\net\2.0\debug'.
clean-current-bin-dir:
[echo] Cleaning the bin/net/2.0/debug binaries directory.
[delete] Deleting directory 'f:\jenkins\jenkins-slave\workspace\log4net_feature_cd-pipeline-76KUCPODUF6LCE45226EBUR4GNVLYPMYVC23Z4ITBOMNJT3CA2WA\bin\net\2.0\debug'.
[mkdir] Creating directory 'f:\jenkins\jenkins-slave\workspace\log4net_feature_cd-pipeline-76KUCPODUF6LCE45226EBUR4GNVLYPMYVC23Z4ITBOMNJT3CA2WA\bin\net\2.0\debug'.
[csc] Compiling 226 files to 'f:\jenkins\jenkins-slave\workspace\log4net_feature_cd-pipeline-76KUCPODUF6LCE45226EBUR4GNVLYPMYVC23Z4ITBOMNJT3CA2WA\bin\net\2.0\debug\log4net.dll'.
set-release-build-configuration:
check-current-build-config:
set-build-configuration-flags:
compile-net-2.0-current-configuration:
check-bin-dir:
check-doc-dir:
check-sdkdoc-dir:
check-sdkdoc-debug:
check-current-build-config:
check-build-debug:
check-build-defines:
set-net-2.0-runtime-configuration:
check-log4net-basedir:
check-current-bin-dir:
[mkdir] Creating directory 'f:\jenkins\jenkins-slave\workspace\log4net_feature_cd-pipeline-76KUCPODUF6LCE45226EBUR4GNVLYPMYVC23Z4ITBOMNJT3CA2WA\bin\net\2.0\release'.
clean-current-bin-dir:
[echo] Cleaning the bin/net/2.0/release binaries directory.
[delete] Deleting directory 'f:\jenkins\jenkins-slave\workspace\log4net_feature_cd-pipeline-76KUCPODUF6LCE45226EBUR4GNVLYPMYVC23Z4ITBOMNJT3CA2WA\bin\net\2.0\release'.
[mkdir] Creating directory 'f:\jenkins\jenkins-slave\workspace\log4net_feature_cd-pipeline-76KUCPODUF6LCE45226EBUR4GNVLYPMYVC23Z4ITBOMNJT3CA2WA\bin\net\2.0\release'.
[echo] Old key file not found.
[echo] The release build using the old key will be skipped.
[csc] Compiling 226 files to 'f:\jenkins\jenkins-slave\workspace\log4net_feature_cd-pipeline-76KUCPODUF6LCE45226EBUR4GNVLYPMYVC23Z4ITBOMNJT3CA2WA\bin\net\2.0\release\log4net.dll'.
BUILD SUCCEEDED
Total time: 1.9 seconds.
[Pipeline] stash
Stashed 6 file(s)
[Pipeline] bat
[log4net_feature_cd-pipeline-76KUCPODUF6LCE45226EBUR4GNVLYPMYVC23Z4ITBOMNJT3CA2WA] Running batch script
f:\jenkins\jenkins-slave\workspace\log4net_feature_cd-pipeline-76KUCPODUF6LCE45226EBUR4GNVLYPMYVC23Z4ITBOMNJT3CA2WA>F:\jenkins\tools\nant\nant-0.92\bin\NAnt.exe -t:net-2.0 -buildfile:tests/nant.build runtests-net-2.0
NAnt 0.92 (Build 0.92.4543.0; release; 6/9/2012)
Copyright (C) 2001-2012 Gerry Shaw
http://nant.sourceforge.net
Buildfile: file:///f:/jenkins/jenkins-slave/workspace/log4net_feature_cd-pipeline-76KUCPODUF6LCE45226EBUR4GNVLYPMYVC23Z4ITBOMNJT3CA2WA/tests/nant.build
Target framework: Microsoft .NET Framework 2.0
Target(s) specified: runtests-net-2.0
check-current-build-config:
set-build-configuration:
set-debug-build-configuration:
check-current-build-config:
set-build-configuration-flags:
check-bin-dir:
[mkdir] Creating directory 'f:\jenkins\jenkins-slave\workspace\log4net_feature_cd-pipeline-76KUCPODUF6LCE45226EBUR4GNVLYPMYVC23Z4ITBOMNJT3CA2WA\tests\bin'.
check-doc-dir:
[mkdir] Creating directory 'f:\jenkins\jenkins-slave\workspace\log4net_feature_cd-pipeline-76KUCPODUF6LCE45226EBUR4GNVLYPMYVC23Z4ITBOMNJT3CA2WA\tests\doc'.
check-sdkdoc-dir:
check-sdkdoc-debug:
check-build-debug:
check-build-defines:
set-net-2.0-runtime-configuration:
check-log4net-basedir:
check-current-bin-dir:
[mkdir] Creating directory 'f:\jenkins\jenkins-slave\workspace\log4net_feature_cd-pipeline-76KUCPODUF6LCE45226EBUR4GNVLYPMYVC23Z4ITBOMNJT3CA2WA\tests\bin\net\2.0\debug'.
clean-current-bin-dir:
[echo] Cleaning the bin/net/2.0/debug binaries directory.
[delete] Deleting directory 'f:\jenkins\jenkins-slave\workspace\log4net_feature_cd-pipeline-76KUCPODUF6LCE45226EBUR4GNVLYPMYVC23Z4ITBOMNJT3CA2WA\tests\bin\net\2.0\debug'.
[mkdir] Creating directory 'f:\jenkins\jenkins-slave\workspace\log4net_feature_cd-pipeline-76KUCPODUF6LCE45226EBUR4GNVLYPMYVC23Z4ITBOMNJT3CA2WA\tests\bin\net\2.0\debug'.
check-log4net-output-dir:
check-log4net-assembly:
[echo] Testing if file exists: ..//bin/net/2.0/debug\log4net.dll
install-nunit:
BUILD FAILED
f:\jenkins\jenkins-slave\workspace\log4net_feature_cd-pipeline-76KUCPODUF6LCE45226EBUR4GNVLYPMYVC23Z4ITBOMNJT3CA2WA\tests\nant.build(29,6):
Unable to download 'https://github.com/nunit/nunitv2/releases/download/2.6.4/NUnit-2.6.4.zip' to 'f:\jenkins\jenkins-slave\workspace\log4net_feature_cd-pipeline-76KUCPODUF6LCE45226EBUR4GNVLYPMYVC23Z4ITBOMNJT3CA2WA\tests\.tmp-nunit.zip'.
The request was aborted: Could not create SSL/TLS secure channel.
Total time: 0.3 seconds.
[Pipeline] }
[Pipeline] // withEnv
[Pipeline] }
[Pipeline] // node
[Pipeline] }
[Pipeline] // stage
[Pipeline] stage
[Pipeline] { (build net-3.5)
Stage 'build net-3.5' skipped due to earlier failure(s)
[Pipeline] }
[Pipeline] // stage
[Pipeline] stage
[Pipeline] { (build net-3.5-cp)
Stage 'build net-3.5-cp' skipped due to earlier failure(s)
[Pipeline] }
[Pipeline] // stage
[Pipeline] stage
[Pipeline] { (build net-4.0)
Stage 'build net-4.0' skipped due to earlier failure(s)
[Pipeline] }
[Pipeline] // stage
[Pipeline] stage
[Pipeline] { (build net-4.0-cp)
Stage 'build net-4.0-cp' skipped due to earlier failure(s)
[Pipeline] }
[Pipeline] // stage
[Pipeline] stage
[Pipeline] { (build net-4.5)
Stage 'build net-4.5' skipped due to earlier failure(s)
[Pipeline] }
[Pipeline] // stage
[Pipeline] stage
[Pipeline] { (build mono-2.0)
Stage 'build mono-2.0' skipped due to earlier failure(s)
[Pipeline] }
[Pipeline] // stage
[Pipeline] stage
[Pipeline] { (build mono-3.5)
Stage 'build mono-3.5' skipped due to earlier failure(s)
[Pipeline] }
[Pipeline] // stage
[Pipeline] stage
[Pipeline] { (build mono-4.0)
Stage 'build mono-4.0' skipped due to earlier failure(s)
[Pipeline] }
[Pipeline] // stage
[Pipeline] stage
[Pipeline] { (build site)
Stage 'build site' skipped due to earlier failure(s)
[Pipeline] }
[Pipeline] // stage
[Pipeline] stage
[Pipeline] { (prepare package)
Stage 'prepare package' skipped due to earlier failure(s)
[Pipeline] }
[Pipeline] // stage
[Pipeline] stage
[Pipeline] { (check test results)
Stage 'check test results' skipped due to earlier failure(s)
[Pipeline] }
[Pipeline] // stage
[Pipeline] stage
[Pipeline] { (publish site)
Stage 'publish site' skipped due to earlier failure(s)
[Pipeline] }
[Pipeline] // stage
[Pipeline] stage
[Pipeline] { (Declarative: Post Actions)
[Pipeline] step
Build failed in Jenkins: logging-log4net » feature/cd-pipeline #197
Posted by Apache Jenkins Server <je...@builds.apache.org>.
See <https://builds.apache.org/job/logging-log4net/job/feature%252Fcd-pipeline/197/display/redirect>
------------------------------------------
[...truncated 104.63 KB...]
Setting up libmono-system-reactive-observable-aliases0.0-cil (3.2.8+dfsg-10) ...
Setting up libmono-system-reactive-platformservices2.2-cil (3.2.8+dfsg-10) ...
Setting up libmono-system-reactive-runtime-remoting2.2-cil (3.2.8+dfsg-10) ...
Setting up libmono-system-xaml4.0-cil (3.2.8+dfsg-10) ...
Setting up libmono-windowsbase4.0-cil (3.2.8+dfsg-10) ...
Setting up libmono-system-reactive-windows-threading2.2-cil (3.2.8+dfsg-10) ...
Setting up libmono-system-runtime-durableinstancing4.0-cil (3.2.8+dfsg-10) ...
Setting up libmono-system-threading-tasks-dataflow4.0-cil (3.2.8+dfsg-10) ...
Setting up libmono-system-web-mvc1.0-cil (3.2.8+dfsg-10) ...
Setting up libmono-system-web-mvc2.0-cil (3.2.8+dfsg-10) ...
Setting up libmono-system-web-razor2.0-cil (3.2.8+dfsg-10) ...
Setting up libmono-system-windows4.0-cil (3.2.8+dfsg-10) ...
Setting up libnunit-core-interfaces2.6.3-cil (2.6.3+dfsg-1) ...
* Installing 1 assembly from libnunit-core-interfaces2.6.3-cil into Mono
Setting up libnunit-core2.6.3-cil (2.6.3+dfsg-1) ...
* Installing 1 assembly from libnunit-core2.6.3-cil into Mono
Setting up libnunit-framework2.6.3-cil (2.6.3+dfsg-1) ...
* Installing 1 assembly from libnunit-framework2.6.3-cil into Mono
Setting up libnunit-mocks2.6.3-cil (2.6.3+dfsg-1) ...
* Installing 1 assembly from libnunit-mocks2.6.3-cil into Mono
Setting up mono-csharp-shell (3.2.8+dfsg-10) ...
Setting up mono-mcs (3.2.8+dfsg-10) ...
Setting up mono-xbuild (3.2.8+dfsg-10) ...
Setting up libmono-system-security4.0-cil (3.2.8+dfsg-10) ...
Setting up libmono-system-configuration4.0-cil (3.2.8+dfsg-10) ...
Setting up libmono-system-transactions4.0-cil (3.2.8+dfsg-10) ...
Setting up libmono-system-enterpriseservices4.0-cil (3.2.8+dfsg-10) ...
Setting up libmono-system-data4.0-cil (3.2.8+dfsg-10) ...
Setting up libmono-sqlite4.0-cil (3.2.8+dfsg-10) ...
Setting up libmono-system-web-applicationservices4.0-cil (3.2.8+dfsg-10) ...
Setting up libmono-web4.0-cil (3.2.8+dfsg-10) ...
Setting up libmono-system-runtime2.0-cil (3.2.8+dfsg-10) ...
Setting up libmono-db2-1.0-cil (3.2.8+dfsg-10) ...
Setting up libmono-system-runtime-serialization4.0-cil (3.2.8+dfsg-10) ...
Setting up libmono-entityframework6.0-cil (3.2.8+dfsg-10) ...
Setting up libmono-entityframework-sqlserver6.0-cil (3.2.8+dfsg-10) ...
Setting up libmono-messaging4.0-cil (3.2.8+dfsg-10) ...
Setting up libmono-messaging-rabbitmq4.0-cil (3.2.8+dfsg-10) ...
Setting up libmono-npgsql4.0-cil (3.2.8+dfsg-10) ...
Setting up libmono-oracle4.0-cil (3.2.8+dfsg-10) ...
Setting up libmono-system-data-datasetextensions4.0-cil (3.2.8+dfsg-10) ...
Setting up libmono-system-data-linq4.0-cil (3.2.8+dfsg-10) ...
Setting up libmono-system-identitymodel4.0-cil (3.2.8+dfsg-10) ...
Setting up libmono-system-identitymodel-selectors4.0-cil (3.2.8+dfsg-10) ...
Setting up libmono-system-windows-forms4.0-cil (3.2.8+dfsg-10) ...
Setting up libmono-system-messaging4.0-cil (3.2.8+dfsg-10) ...
Setting up libmono-system-drawing-design4.0-cil (3.2.8+dfsg-10) ...
Setting up libmono-system-json-microsoft4.0-cil (3.2.8+dfsg-10) ...
Setting up libmono-system-net-http-formatting4.0-cil (3.2.8+dfsg-10) ...
Setting up libmono-system-reactive-windows-forms2.2-cil (3.2.8+dfsg-10) ...
Setting up libmono-system-runtime-caching4.0-cil (3.2.8+dfsg-10) ...
Setting up libmono-system-serviceprocess4.0-cil (3.2.8+dfsg-10) ...
Setting up libmono-system-web-http4.0-cil (3.2.8+dfsg-10) ...
Setting up libmono-system-windows-forms-datavisualization4.0a-cil (3.2.8+dfsg-10) ...
Setting up libmono-webmatrix-data4.0-cil (3.2.8+dfsg-10) ...
Setting up libmono-winforms2.0-cil (3.2.8+dfsg-10) ...
Setting up libmono-system-web4.0-cil (3.2.8+dfsg-10) ...
Setting up liblog4net1.2-cil (1.2.10+dfsg-6) ...
* Installing 1 assembly from liblog4net1.2-cil into Mono
Setting up libmono-http4.0-cil (3.2.8+dfsg-10) ...
Setting up libmono-microsoft-web-infrastructure1.0-cil (3.2.8+dfsg-10) ...
Setting up libmono-system-design4.0-cil (3.2.8+dfsg-10) ...
Setting up libmono-system-runtime4.0-cil (3.2.8+dfsg-10) ...
Setting up libmono-system-web-abstractions4.0-cil (3.2.8+dfsg-10) ...
Setting up libmono-system-web-extensions-design4.0-cil (3.2.8+dfsg-10) ...
Setting up libmono-system-web-http-webhost4.0-cil (3.2.8+dfsg-10) ...
Setting up libmono-system-web-webpages-deployment2.0-cil (3.2.8+dfsg-10) ...
Setting up libmono-system-web-webpages2.0-cil (3.2.8+dfsg-10) ...
Setting up libmono-system-web-webpages-razor2.0-cil (3.2.8+dfsg-10) ...
Setting up libmono-system-web-routing4.0-cil (3.2.8+dfsg-10) ...
Setting up libnunit-util2.6.3-cil (2.6.3+dfsg-1) ...
* Installing 1 assembly from libnunit-util2.6.3-cil into Mono
Setting up libnunit-console-runner2.6.3-cil (2.6.3+dfsg-1) ...
* Installing 1 assembly from libnunit-console-runner2.6.3-cil into Mono
Setting up libnunit-cil-dev (2.6.3+dfsg-1) ...
Setting up libmono-system-web-services4.0-cil (3.2.8+dfsg-10) ...
Setting up libmono-system-servicemodel4.0a-cil (3.2.8+dfsg-10) ...
Setting up libmono-system-web-extensions4.0-cil (3.2.8+dfsg-10) ...
Setting up libmono-system-servicemodel-web4.0-cil (3.2.8+dfsg-10) ...
Setting up libmono-system-data-services4.0-cil (3.2.8+dfsg-10) ...
Setting up libmono-system-servicemodel-discovery4.0-cil (3.2.8+dfsg-10) ...
Setting up libmono-system-servicemodel-routing4.0-cil (3.2.8+dfsg-10) ...
Setting up libmono-system-web-dynamicdata4.0-cil (3.2.8+dfsg-10) ...
Setting up libmono-system-web-http-selfhost4.0-cil (3.2.8+dfsg-10) ...
Setting up libmono-system-web-mvc3.0-cil (3.2.8+dfsg-10) ...
Setting up libmono-system-xml-serialization4.0-cil (3.2.8+dfsg-10) ...
Setting up libmono-cil-dev (3.2.8+dfsg-10) ...
Setting up mono-devel (3.2.8+dfsg-10) ...
update-alternatives: using /usr/bin/mono-csc to provide /usr/bin/cli-csc (c-sharp-compiler) in auto mode
update-alternatives: using /usr/bin/resgen to provide /usr/bin/cli-resgen (resource-file-generator) in auto mode
update-alternatives: using /usr/bin/al to provide /usr/bin/cli-al (assembly-linker) in auto mode
update-alternatives: using /usr/bin/sn to provide /usr/bin/cli-sn (strong-name-tool) in auto mode
Setting up nant (0.92~rc1+dfsg-4) ...
Processing triggers for libc-bin (2.19-18+deb8u10) ...
Processing triggers for systemd (215-17+deb8u7) ...
Processing triggers for sgml-base (1.26+nmu4) ...
---> 794bdb746a7a
Removing intermediate container 311377ff5659
Successfully built 794bdb746a7a
Successfully tagged builder-netstandard:latest
[Pipeline] dockerFingerprintFrom
[Pipeline] sh
[log4net_feature_cd-pipeline-76KUCPODUF6LCE45226EBUR4GNVLYPMYVC23Z4ITBOMNJT3CA2WA] Running shell script
+ docker inspect -f . builder-netstandard:latest
.
[Pipeline] withDockerContainer
H21 does not seem to be running inside a container
$ docker run -t -d -u 910:910 -w /home/jenkins/jenkins-slave/workspace/log4net_feature_cd-pipeline-76KUCPODUF6LCE45226EBUR4GNVLYPMYVC23Z4ITBOMNJT3CA2WA -v /home/jenkins/jenkins-slave/workspace/log4net_feature_cd-pipeline-76KUCPODUF6LCE45226EBUR4GNVLYPMYVC23Z4ITBOMNJT3CA2WA:/home/jenkins/jenkins-slave/workspace/log4net_feature_cd-pipeline-76KUCPODUF6LCE45226EBUR4GNVLYPMYVC23Z4ITBOMNJT3CA2WA:rw,z -v /home/jenkins/jenkins-slave/workspace/log4net_feature_cd-pipeline-76KUCPODUF6LCE45226EBUR4GNVLYPMYVC23Z4ITBOMNJT3CA2WA@tmp:/home/jenkins/jenkins-slave/workspace/log4net_feature_cd-pipeline-76KUCPODUF6LCE45226EBUR4GNVLYPMYVC23Z4ITBOMNJT3CA2WA@tmp:rw,z -e ******** -e ******** -e ******** -e ******** -e ******** -e ******** -e ******** -e ******** -e ******** -e ******** -e ******** -e ******** -e ******** -e ******** -e ******** -e ******** -e ******** -e ******** -e ******** -e ******** -e ******** -e ******** -e ******** -e ******** -e ******** -e ******** -e ******** builder-netstandard:latest cat
$ docker top cbaffb176210b744512392dd2f3acd2169383ed8f11bc76b1a50ce20e9638b30 -eo pid,comm
[Pipeline] {
[Pipeline] sh
[log4net_feature_cd-pipeline-76KUCPODUF6LCE45226EBUR4GNVLYPMYVC23Z4ITBOMNJT3CA2WA] Running shell script
+ nant compile-netstandard-1.3
NAnt 0.92 (Build 0.92.4526.0; rc1; 05/23/2012)
Copyright (C) 2001-2012 Gerry Shaw
http://nant.sourceforge.net
Buildfile: file:///home/jenkins/jenkins-slave/workspace/log4net_feature_cd-pipeline-76KUCPODUF6LCE45226EBUR4GNVLYPMYVC23Z4ITBOMNJT3CA2WA/log4net.build
Target framework: Mono 4.0 Profile
Target(s) specified: compile-netstandard-1.3
check-current-build-config:
set-build-configuration:
set-debug-build-configuration:
check-current-build-config:
set-build-configuration-flags:
compile-netstandard-1.3:
set-debug-build-configuration:
check-current-build-config:
set-build-configuration-flags:
compile-netstandard-1.3-current-configuration:
[echo] dotnet --version
[exec] 2.1.200
[echo] dotnet restore log4net.netstandard.sln
[exec]
[exec] Welcome to .NET Core!
[exec] ---------------------
[exec] Learn more about .NET Core @ https://aka.ms/dotnet-docs. Use dotnet --help to see available commands or go to https://aka.ms/dotnet-cli-docs.
[exec]
[exec] Telemetry
[exec] --------------
[exec] The .NET Core tools collect usage data in order to improve your experience. The data is anonymous and does not include command-line arguments. The data is collected by Microsoft and shared with the community.
[exec] You can opt out of telemetry by setting a DOTNET_CLI_TELEMETRY_OPTOUT environment variable to 1 using your favorite shell.
[exec] You can read more about .NET Core tools telemetry @ https://aka.ms/dotnet-cli-telemetry.
[exec] /home/jenkins/jenkins-slave/workspace/log4net_feature_cd-pipeline-76KUCPODUF6LCE45226EBUR4GNVLYPMYVC23Z4ITBOMNJT3CA2WA/netstandard/1.3/log4net.tests/log4net.tests.csproj : error NU1003: PackageTargetFallback and AssetTargetFallback cannot be used together. Remove PackageTargetFallback(deprecated) references from the project environment. [/home/jenkins/jenkins-slave/workspace/log4net_feature_cd-pipeline-76KUCPODUF6LCE45226EBUR4GNVLYPMYVC23Z4ITBOMNJT3CA2WA/netstandard/1.3/log4net.netstandard.sln]
BUILD FAILED
/home/jenkins/jenkins-slave/workspace/log4net_feature_cd-pipeline-76KUCPODUF6LCE45226EBUR4GNVLYPMYVC23Z4ITBOMNJT3CA2WA/log4net.build(1768,5):
External Program Failed: dotnet (return code was 1)
Total time: 3.5 seconds.
[Pipeline] }
$ docker stop --time=1 cbaffb176210b744512392dd2f3acd2169383ed8f11bc76b1a50ce20e9638b30
$ docker rm -f cbaffb176210b744512392dd2f3acd2169383ed8f11bc76b1a50ce20e9638b30
[Pipeline] // withDockerContainer
[Pipeline] }
[Pipeline] // script
[Pipeline] }
[Pipeline] // stage
[Pipeline] stage
[Pipeline] { (build net-2.0)
Stage 'build net-2.0' skipped due to earlier failure(s)
[Pipeline] }
[Pipeline] // stage
[Pipeline] stage
[Pipeline] { (build net-3.5)
Stage 'build net-3.5' skipped due to earlier failure(s)
[Pipeline] }
[Pipeline] // stage
[Pipeline] stage
[Pipeline] { (build net-3.5-cp)
Stage 'build net-3.5-cp' skipped due to earlier failure(s)
[Pipeline] }
[Pipeline] // stage
[Pipeline] stage
[Pipeline] { (build net-4.0)
Stage 'build net-4.0' skipped due to earlier failure(s)
[Pipeline] }
[Pipeline] // stage
[Pipeline] stage
[Pipeline] { (build net-4.0-cp)
Stage 'build net-4.0-cp' skipped due to earlier failure(s)
[Pipeline] }
[Pipeline] // stage
[Pipeline] stage
[Pipeline] { (build net-4.5)
Stage 'build net-4.5' skipped due to earlier failure(s)
[Pipeline] }
[Pipeline] // stage
[Pipeline] stage
[Pipeline] { (build mono-2.0)
Stage 'build mono-2.0' skipped due to earlier failure(s)
[Pipeline] }
[Pipeline] // stage
[Pipeline] stage
[Pipeline] { (build mono-3.5)
Stage 'build mono-3.5' skipped due to earlier failure(s)
[Pipeline] }
[Pipeline] // stage
[Pipeline] stage
[Pipeline] { (build mono-4.0)
Stage 'build mono-4.0' skipped due to earlier failure(s)
[Pipeline] }
[Pipeline] // stage
[Pipeline] stage
[Pipeline] { (build site)
Stage 'build site' skipped due to earlier failure(s)
[Pipeline] }
[Pipeline] // stage
[Pipeline] stage
[Pipeline] { (prepare package)
Stage 'prepare package' skipped due to earlier failure(s)
[Pipeline] }
[Pipeline] // stage
[Pipeline] stage
[Pipeline] { (check test results)
Stage 'check test results' skipped due to earlier failure(s)
[Pipeline] }
[Pipeline] // stage
[Pipeline] stage
[Pipeline] { (publish site)
Stage 'publish site' skipped due to earlier failure(s)
[Pipeline] }
[Pipeline] // stage
[Pipeline] stage
[Pipeline] { (Declarative: Post Actions)
[Pipeline] step
Build failed in Jenkins: logging-log4net » feature/cd-pipeline #196
Posted by Apache Jenkins Server <je...@builds.apache.org>.
See <https://builds.apache.org/job/logging-log4net/job/feature%252Fcd-pipeline/196/display/redirect>
------------------------------------------
[...truncated 142.49 KB...]
check-bin-dir:
[mkdir] Creating directory 'f:\jenkins\jenkins-slave\workspace\log4net_feature_cd-pipeline-76KUCPODUF6LCE45226EBUR4GNVLYPMYVC23Z4ITBOMNJT3CA2WA\bin'.
check-doc-dir:
[mkdir] Creating directory 'f:\jenkins\jenkins-slave\workspace\log4net_feature_cd-pipeline-76KUCPODUF6LCE45226EBUR4GNVLYPMYVC23Z4ITBOMNJT3CA2WA\doc'.
check-sdkdoc-dir:
check-sdkdoc-debug:
check-current-build-config:
check-build-debug:
check-build-defines:
set-net-2.0-runtime-configuration:
check-log4net-basedir:
check-current-bin-dir:
[mkdir] Creating directory 'f:\jenkins\jenkins-slave\workspace\log4net_feature_cd-pipeline-76KUCPODUF6LCE45226EBUR4GNVLYPMYVC23Z4ITBOMNJT3CA2WA\bin\net\2.0\debug'.
clean-current-bin-dir:
[echo] Cleaning the bin/net/2.0/debug binaries directory.
[delete] Deleting directory 'f:\jenkins\jenkins-slave\workspace\log4net_feature_cd-pipeline-76KUCPODUF6LCE45226EBUR4GNVLYPMYVC23Z4ITBOMNJT3CA2WA\bin\net\2.0\debug'.
[mkdir] Creating directory 'f:\jenkins\jenkins-slave\workspace\log4net_feature_cd-pipeline-76KUCPODUF6LCE45226EBUR4GNVLYPMYVC23Z4ITBOMNJT3CA2WA\bin\net\2.0\debug'.
[csc] Compiling 226 files to 'f:\jenkins\jenkins-slave\workspace\log4net_feature_cd-pipeline-76KUCPODUF6LCE45226EBUR4GNVLYPMYVC23Z4ITBOMNJT3CA2WA\bin\net\2.0\debug\log4net.dll'.
set-release-build-configuration:
check-current-build-config:
set-build-configuration-flags:
compile-net-2.0-current-configuration:
check-bin-dir:
check-doc-dir:
check-sdkdoc-dir:
check-sdkdoc-debug:
check-current-build-config:
check-build-debug:
check-build-defines:
set-net-2.0-runtime-configuration:
check-log4net-basedir:
check-current-bin-dir:
[mkdir] Creating directory 'f:\jenkins\jenkins-slave\workspace\log4net_feature_cd-pipeline-76KUCPODUF6LCE45226EBUR4GNVLYPMYVC23Z4ITBOMNJT3CA2WA\bin\net\2.0\release'.
clean-current-bin-dir:
[echo] Cleaning the bin/net/2.0/release binaries directory.
[delete] Deleting directory 'f:\jenkins\jenkins-slave\workspace\log4net_feature_cd-pipeline-76KUCPODUF6LCE45226EBUR4GNVLYPMYVC23Z4ITBOMNJT3CA2WA\bin\net\2.0\release'.
[mkdir] Creating directory 'f:\jenkins\jenkins-slave\workspace\log4net_feature_cd-pipeline-76KUCPODUF6LCE45226EBUR4GNVLYPMYVC23Z4ITBOMNJT3CA2WA\bin\net\2.0\release'.
[echo] Old key file not found.
[echo] The release build using the old key will be skipped.
[csc] Compiling 226 files to 'f:\jenkins\jenkins-slave\workspace\log4net_feature_cd-pipeline-76KUCPODUF6LCE45226EBUR4GNVLYPMYVC23Z4ITBOMNJT3CA2WA\bin\net\2.0\release\log4net.dll'.
BUILD SUCCEEDED
Total time: 2.8 seconds.
[Pipeline] stash
Stashed 6 file(s)
[Pipeline] bat
[log4net_feature_cd-pipeline-76KUCPODUF6LCE45226EBUR4GNVLYPMYVC23Z4ITBOMNJT3CA2WA] Running batch script
f:\jenkins\jenkins-slave\workspace\log4net_feature_cd-pipeline-76KUCPODUF6LCE45226EBUR4GNVLYPMYVC23Z4ITBOMNJT3CA2WA>F:\jenkins\tools\nant\nant-0.92\bin\NAnt.exe -t:net-2.0 -buildfile:tests/nant.build runtests-net-2.0
NAnt 0.92 (Build 0.92.4543.0; release; 6/9/2012)
Copyright (C) 2001-2012 Gerry Shaw
http://nant.sourceforge.net
Buildfile: file:///f:/jenkins/jenkins-slave/workspace/log4net_feature_cd-pipeline-76KUCPODUF6LCE45226EBUR4GNVLYPMYVC23Z4ITBOMNJT3CA2WA/tests/nant.build
Target framework: Microsoft .NET Framework 2.0
Target(s) specified: runtests-net-2.0
check-current-build-config:
set-build-configuration:
set-debug-build-configuration:
check-current-build-config:
set-build-configuration-flags:
check-bin-dir:
[mkdir] Creating directory 'f:\jenkins\jenkins-slave\workspace\log4net_feature_cd-pipeline-76KUCPODUF6LCE45226EBUR4GNVLYPMYVC23Z4ITBOMNJT3CA2WA\tests\bin'.
check-doc-dir:
[mkdir] Creating directory 'f:\jenkins\jenkins-slave\workspace\log4net_feature_cd-pipeline-76KUCPODUF6LCE45226EBUR4GNVLYPMYVC23Z4ITBOMNJT3CA2WA\tests\doc'.
check-sdkdoc-dir:
check-sdkdoc-debug:
check-build-debug:
check-build-defines:
set-net-2.0-runtime-configuration:
check-log4net-basedir:
check-current-bin-dir:
[mkdir] Creating directory 'f:\jenkins\jenkins-slave\workspace\log4net_feature_cd-pipeline-76KUCPODUF6LCE45226EBUR4GNVLYPMYVC23Z4ITBOMNJT3CA2WA\tests\bin\net\2.0\debug'.
clean-current-bin-dir:
[echo] Cleaning the bin/net/2.0/debug binaries directory.
[delete] Deleting directory 'f:\jenkins\jenkins-slave\workspace\log4net_feature_cd-pipeline-76KUCPODUF6LCE45226EBUR4GNVLYPMYVC23Z4ITBOMNJT3CA2WA\tests\bin\net\2.0\debug'.
[mkdir] Creating directory 'f:\jenkins\jenkins-slave\workspace\log4net_feature_cd-pipeline-76KUCPODUF6LCE45226EBUR4GNVLYPMYVC23Z4ITBOMNJT3CA2WA\tests\bin\net\2.0\debug'.
check-log4net-output-dir:
check-log4net-assembly:
[echo] Testing if file exists: ..//bin/net/2.0/debug\log4net.dll
install-nunit:
BUILD FAILED
f:\jenkins\jenkins-slave\workspace\log4net_feature_cd-pipeline-76KUCPODUF6LCE45226EBUR4GNVLYPMYVC23Z4ITBOMNJT3CA2WA\tests\nant.build(29,6):
Unable to download 'https://github.com/nunit/nunitv2/releases/download/2.6.4/NUnit-2.6.4.zip' to 'f:\jenkins\jenkins-slave\workspace\log4net_feature_cd-pipeline-76KUCPODUF6LCE45226EBUR4GNVLYPMYVC23Z4ITBOMNJT3CA2WA\tests\.tmp-nunit.zip'.
The request was aborted: Could not create SSL/TLS secure channel.
Total time: 0.3 seconds.
[Pipeline] }
[Pipeline] // withEnv
[Pipeline] }
[Pipeline] // node
[Pipeline] }
[Pipeline] // stage
[Pipeline] stage
[Pipeline] { (build net-3.5)
Stage 'build net-3.5' skipped due to earlier failure(s)
[Pipeline] }
[Pipeline] // stage
[Pipeline] stage
[Pipeline] { (build net-3.5-cp)
Stage 'build net-3.5-cp' skipped due to earlier failure(s)
[Pipeline] }
[Pipeline] // stage
[Pipeline] stage
[Pipeline] { (build net-4.0)
Stage 'build net-4.0' skipped due to earlier failure(s)
[Pipeline] }
[Pipeline] // stage
[Pipeline] stage
[Pipeline] { (build net-4.0-cp)
Stage 'build net-4.0-cp' skipped due to earlier failure(s)
[Pipeline] }
[Pipeline] // stage
[Pipeline] stage
[Pipeline] { (build net-4.5)
Stage 'build net-4.5' skipped due to earlier failure(s)
[Pipeline] }
[Pipeline] // stage
[Pipeline] stage
[Pipeline] { (build mono-2.0)
Stage 'build mono-2.0' skipped due to earlier failure(s)
[Pipeline] }
[Pipeline] // stage
[Pipeline] stage
[Pipeline] { (build mono-3.5)
Stage 'build mono-3.5' skipped due to earlier failure(s)
[Pipeline] }
[Pipeline] // stage
[Pipeline] stage
[Pipeline] { (build mono-4.0)
Stage 'build mono-4.0' skipped due to earlier failure(s)
[Pipeline] }
[Pipeline] // stage
[Pipeline] stage
[Pipeline] { (build site)
Stage 'build site' skipped due to earlier failure(s)
[Pipeline] }
[Pipeline] // stage
[Pipeline] stage
[Pipeline] { (prepare package)
Stage 'prepare package' skipped due to earlier failure(s)
[Pipeline] }
[Pipeline] // stage
[Pipeline] stage
[Pipeline] { (check test results)
Stage 'check test results' skipped due to earlier failure(s)
[Pipeline] }
[Pipeline] // stage
[Pipeline] stage
[Pipeline] { (publish site)
Stage 'publish site' skipped due to earlier failure(s)
[Pipeline] }
[Pipeline] // stage
[Pipeline] stage
[Pipeline] { (Declarative: Post Actions)
[Pipeline] step
Build failed in Jenkins: logging-log4net » feature/cd-pipeline #195
Posted by Apache Jenkins Server <je...@builds.apache.org>.
See <https://builds.apache.org/job/logging-log4net/job/feature%252Fcd-pipeline/195/display/redirect>
------------------------------------------
[...truncated 125.79 KB...]
[exec] Installing System.Runtime.InteropServices.RuntimeInformation 4.0.0.
[exec] Installing System.Threading.ThreadPool 4.3.0.
[exec] Installing System.Xml.XPath 4.3.0.
[exec] Installing Microsoft.Win32.Registry 4.3.0.
[exec] Installing System.Diagnostics.Debug 4.0.11.
[exec] Installing System.Linq 4.1.0.
[exec] Installing System.ObjectModel 4.0.12.
[exec] Installing System.Reflection 4.1.0.
[exec] Installing System.Reflection.Extensions 4.0.1.
[exec] Installing System.Reflection.Primitives 4.0.1.
[exec] Installing System.Threading 4.0.11.
[exec] Installing System.Collections.Concurrent 4.0.12.
[exec] Installing System.Console 4.0.0.
[exec] Installing System.Diagnostics.Tools 4.0.1.
[exec] Installing System.Globalization.Calendars 4.0.1.
[exec] Installing System.IO.Compression 4.1.0.
[exec] Installing System.IO.Compression.ZipFile 4.0.1.
[exec] Installing System.Net.Sockets 4.1.0.
[exec] Installing System.Runtime.Numerics 4.0.1.
[exec] Installing System.Text.RegularExpressions 4.1.0.
[exec] Installing System.Threading.Timer 4.0.1.
[exec] Installing System.Xml.ReaderWriter 4.0.11.
[exec] Installing System.Xml.XDocument 4.0.11.
[exec] Installing System.Reflection.Emit 4.0.1.
[exec] Installing System.Reflection.Emit.ILGeneration 4.0.1.
[exec] Installing runtime.native.System.Security.Cryptography 4.0.0.
[exec] Installing runtime.native.System.Net.Http 4.0.1.
[exec] Installing System.Security.Cryptography.Cng 4.2.0.
[exec] Installing System.Security.Cryptography.Csp 4.0.0.
[exec] Installing System.Security.Cryptography.OpenSsl 4.0.0.
[exec] Installing System.Reflection.Emit.Lightweight 4.0.1.
[exec] Installing Microsoft.NETCore.Windows.ApiSets 1.0.1.
[exec] Installing System.ComponentModel.TypeConverter 4.1.0.
[exec] Installing Microsoft.NETCore.Jit 1.0.6.
[exec] Installing System.Security.Principal 4.0.1.
[exec] Installing runtime.native.System.Net.Security 4.0.1.
[exec] Installing Microsoft.NETCore.DotNetHostResolver 1.0.1.
[exec] Installing Microsoft.CodeAnalysis.Common 1.3.0.
[exec] Installing Newtonsoft.Json 9.0.1.
[exec] Installing System.Linq.Expressions 4.1.0.
[exec] Installing Microsoft.Extensions.DependencyModel 1.0.3.
[exec] Installing runtime.native.System.IO.Compression 4.3.0.
[exec] Installing System.Buffers 4.3.0.
[exec] Installing Microsoft.TestPlatform.ObjectModel 15.5.0.
[exec] Installing System.Reflection.Emit.ILGeneration 4.3.0.
[exec] Installing System.Reflection.Emit 4.3.0.
[exec] Installing System.Reflection.Emit.Lightweight 4.3.0.
[exec] Installing runtime.native.System.Security.Cryptography.OpenSsl 4.3.0.
[exec] Installing runtime.native.System.Net.Http 4.3.0.
[exec] Installing System.Diagnostics.DiagnosticSource 4.3.0.
[exec] Installing System.Globalization.Extensions 4.3.0.
[exec] Installing System.Diagnostics.TextWriterTraceListener 4.0.0.
[exec] Installing runtime.native.System.Security.Cryptography.Apple 4.3.0.
[exec] Installing System.Security.Cryptography.OpenSsl 4.3.0.
[exec] Installing System.Security.Cryptography.Cng 4.3.0.
[exec] Installing Microsoft.NETCore.Targets 1.0.1.
[exec] Installing System.Security.Cryptography.Csp 4.3.0.
[exec] Installing runtime.native.System.IO.Compression 4.1.0.
[exec] Installing Microsoft.NETCore.DotNetHost 1.0.1.
[exec] Installing Microsoft.CodeAnalysis.Analyzers 1.1.0.
[exec] Installing System.Diagnostics.FileVersionInfo 4.0.0.
[exec] Installing System.Text.Encoding.CodePages 4.0.1.
[exec] Installing System.Xml.XPath.XDocument 4.0.1.
[exec] Installing System.ComponentModel.EventBasedAsync 4.0.11.
[exec] Installing Microsoft.DotNet.PlatformAbstractions 1.0.3.
[exec] Installing System.Runtime.Serialization.Primitives 4.1.1.
[exec] Installing System.Runtime.Serialization.Json 4.0.2.
[exec] Installing System.Xml.XPath.XmlDocument 4.0.1.
[exec] Generating MSBuild file /home/jenkins/jenkins-slave/workspace/log4net_feature_cd-pipeline-76KUCPODUF6LCE45226EBUR4GNVLYPMYVC23Z4ITBOMNJT3CA2WA/netstandard/1.3/log4net.tests/obj/log4net.tests.csproj.nuget.g.props.
[exec] Generating MSBuild file /home/jenkins/jenkins-slave/workspace/log4net_feature_cd-pipeline-76KUCPODUF6LCE45226EBUR4GNVLYPMYVC23Z4ITBOMNJT3CA2WA/netstandard/1.3/log4net.tests/obj/log4net.tests.csproj.nuget.g.targets.
[exec] Restore completed in 2.67 sec for /home/jenkins/jenkins-slave/workspace/log4net_feature_cd-pipeline-76KUCPODUF6LCE45226EBUR4GNVLYPMYVC23Z4ITBOMNJT3CA2WA/netstandard/1.3/log4net.tests/log4net.tests.csproj.
[echo] dotnet build log4net
[exec] Microsoft (R) Build Engine version 15.7.177.53362 for .NET Core
[exec] Copyright (C) Microsoft Corporation. All rights reserved.
[exec]
[exec] Restore completed in 67.74 ms for /home/jenkins/jenkins-slave/workspace/log4net_feature_cd-pipeline-76KUCPODUF6LCE45226EBUR4GNVLYPMYVC23Z4ITBOMNJT3CA2WA/netstandard/1.3/log4net/log4net.csproj.
[exec] log4net -> /home/jenkins/jenkins-slave/workspace/log4net_feature_cd-pipeline-76KUCPODUF6LCE45226EBUR4GNVLYPMYVC23Z4ITBOMNJT3CA2WA/netstandard/1.3/log4net/bin/Debug/netstandard1.3/log4net.dll
[exec]
[exec] Build succeeded.
[exec] 0 Warning(s)
[exec] 0 Error(s)
[exec]
[exec] Time Elapsed 00:00:04.52
[mkdir] Creating directory '/home/jenkins/jenkins-slave/workspace/log4net_feature_cd-pipeline-76KUCPODUF6LCE45226EBUR4GNVLYPMYVC23Z4ITBOMNJT3CA2WA/bin/netstandard/1.3'.
[move] 1 directory moved.
set-release-build-configuration:
check-current-build-config:
set-build-configuration-flags:
compile-netstandard-1.3-current-configuration:
[echo] dotnet --version
[exec] 2.1.200
[echo] dotnet restore log4net.netstandard.sln
[exec] Restore completed in 74.8 ms for /home/jenkins/jenkins-slave/workspace/log4net_feature_cd-pipeline-76KUCPODUF6LCE45226EBUR4GNVLYPMYVC23Z4ITBOMNJT3CA2WA/netstandard/1.3/log4net.tests/log4net.tests.csproj.
[exec] Restore completed in 74.8 ms for /home/jenkins/jenkins-slave/workspace/log4net_feature_cd-pipeline-76KUCPODUF6LCE45226EBUR4GNVLYPMYVC23Z4ITBOMNJT3CA2WA/netstandard/1.3/log4net/log4net.csproj.
[echo] dotnet build log4net
[exec] Microsoft (R) Build Engine version 15.7.177.53362 for .NET Core
[exec] Copyright (C) Microsoft Corporation. All rights reserved.
[exec]
[exec] Restore completed in 67.59 ms for /home/jenkins/jenkins-slave/workspace/log4net_feature_cd-pipeline-76KUCPODUF6LCE45226EBUR4GNVLYPMYVC23Z4ITBOMNJT3CA2WA/netstandard/1.3/log4net/log4net.csproj.
[exec] log4net -> /home/jenkins/jenkins-slave/workspace/log4net_feature_cd-pipeline-76KUCPODUF6LCE45226EBUR4GNVLYPMYVC23Z4ITBOMNJT3CA2WA/netstandard/1.3/log4net/bin/Release/netstandard1.3/log4net.dll
[exec]
[exec] Build succeeded.
[exec] 0 Warning(s)
[exec] 0 Error(s)
[exec]
[exec] Time Elapsed 00:00:03.20
[move] 1 directory moved.
BUILD SUCCEEDED
Total time: 16.4 seconds.
[Pipeline] stash
Stashed 6 file(s)
[Pipeline] sh
[log4net_feature_cd-pipeline-76KUCPODUF6LCE45226EBUR4GNVLYPMYVC23Z4ITBOMNJT3CA2WA] Running shell script
+ nant -buildfile:tests/nant.build runtests-netstandard-1.3
NAnt 0.92 (Build 0.92.4526.0; rc1; 05/23/2012)
Copyright (C) 2001-2012 Gerry Shaw
http://nant.sourceforge.net
Buildfile: file:///home/jenkins/jenkins-slave/workspace/log4net_feature_cd-pipeline-76KUCPODUF6LCE45226EBUR4GNVLYPMYVC23Z4ITBOMNJT3CA2WA/tests/nant.build
Target framework: Mono 4.0 Profile
Target(s) specified: runtests-netstandard-1.3
check-current-build-config:
set-build-configuration:
set-debug-build-configuration:
check-current-build-config:
set-build-configuration-flags:
runtests-netstandard-1.3:
[exec] Build started, please wait...
[exec] Build completed.
[exec]
[exec] Test run for /home/jenkins/jenkins-slave/workspace/log4net_feature_cd-pipeline-76KUCPODUF6LCE45226EBUR4GNVLYPMYVC23Z4ITBOMNJT3CA2WA/netstandard/1.3/log4net.tests/bin/Debug/netcoreapp1.0/log4net.tests.dll(.NETCoreApp,Version=v1.0)
[exec] Microsoft (R) Test Execution Command Line Tool Version 15.7.0
[exec] Copyright (c) Microsoft Corporation. All rights reserved.
[exec]
[exec] Starting test execution, please wait...
[exec] Logging Vstest Diagnostics in file: /home/jenkins/jenkins-slave/workspace/log4net_feature_cd-pipeline-76KUCPODUF6LCE45226EBUR4GNVLYPMYVC23Z4ITBOMNJT3CA2WA/netstandard/1.3/log4net.tests/test.diagnostics.log
[exec] Microsoft.VisualStudio.TestPlatform.ObjectModel.TestPlatformException: Failed to initialize client proxy: could not connect to test process.
[exec] at Microsoft.VisualStudio.TestPlatform.CrossPlatEngine.Client.ProxyOperationManager.SetupChannel(IEnumerable`1 sources, CancellationToken cancellationToken)
[exec] at Microsoft.VisualStudio.TestPlatform.CrossPlatEngine.Client.ProxyExecutionManager.StartTestRun(TestRunCriteria testRunCriteria, ITestRunEventsHandler eventHandler)
[exec]
[exec] Test Run Aborted.
[exec] /home/jenkins/jenkins-slave/workspace/log4net_feature_cd-pipeline-76KUCPODUF6LCE45226EBUR4GNVLYPMYVC23Z4ITBOMNJT3CA2WA/tests/nant.build(869,10):
[exec] External Program Failed: dotnet (return code was 1)
BUILD SUCCEEDED - 1 non-fatal error(s), 4 warning(s)
Total time: 66.2 seconds.
[Pipeline] stash
[Pipeline] }
$ docker stop --time=1 35ab1497d7caa923cb909359af189c1103589d2d0bd76a79e0c17064bcc76f50
$ docker rm -f 35ab1497d7caa923cb909359af189c1103589d2d0bd76a79e0c17064bcc76f50
[Pipeline] // withDockerContainer
[Pipeline] }
[Pipeline] // script
[Pipeline] }
[Pipeline] // stage
[Pipeline] stage
[Pipeline] { (build net-2.0)
Stage 'build net-2.0' skipped due to earlier failure(s)
[Pipeline] }
[Pipeline] // stage
[Pipeline] stage
[Pipeline] { (build net-3.5)
Stage 'build net-3.5' skipped due to earlier failure(s)
[Pipeline] }
[Pipeline] // stage
[Pipeline] stage
[Pipeline] { (build net-3.5-cp)
Stage 'build net-3.5-cp' skipped due to earlier failure(s)
[Pipeline] }
[Pipeline] // stage
[Pipeline] stage
[Pipeline] { (build net-4.0)
Stage 'build net-4.0' skipped due to earlier failure(s)
[Pipeline] }
[Pipeline] // stage
[Pipeline] stage
[Pipeline] { (build net-4.0-cp)
Stage 'build net-4.0-cp' skipped due to earlier failure(s)
[Pipeline] }
[Pipeline] // stage
[Pipeline] stage
[Pipeline] { (build net-4.5)
Stage 'build net-4.5' skipped due to earlier failure(s)
[Pipeline] }
[Pipeline] // stage
[Pipeline] stage
[Pipeline] { (build mono-2.0)
Stage 'build mono-2.0' skipped due to earlier failure(s)
[Pipeline] }
[Pipeline] // stage
[Pipeline] stage
[Pipeline] { (build mono-3.5)
Stage 'build mono-3.5' skipped due to earlier failure(s)
[Pipeline] }
[Pipeline] // stage
[Pipeline] stage
[Pipeline] { (build mono-4.0)
Stage 'build mono-4.0' skipped due to earlier failure(s)
[Pipeline] }
[Pipeline] // stage
[Pipeline] stage
[Pipeline] { (build site)
Stage 'build site' skipped due to earlier failure(s)
[Pipeline] }
[Pipeline] // stage
[Pipeline] stage
[Pipeline] { (prepare package)
Stage 'prepare package' skipped due to earlier failure(s)
[Pipeline] }
[Pipeline] // stage
[Pipeline] stage
[Pipeline] { (check test results)
Stage 'check test results' skipped due to earlier failure(s)
[Pipeline] }
[Pipeline] // stage
[Pipeline] stage
[Pipeline] { (publish site)
Stage 'publish site' skipped due to earlier failure(s)
[Pipeline] }
[Pipeline] // stage
[Pipeline] stage
[Pipeline] { (Declarative: Post Actions)
[Pipeline] step
Build failed in Jenkins: logging-log4net » feature/cd-pipeline #194
Posted by Apache Jenkins Server <je...@builds.apache.org>.
See <https://builds.apache.org/job/logging-log4net/job/feature%252Fcd-pipeline/194/display/redirect>
------------------------------------------
[...truncated 124.79 KB...]
[exec] Installing System.Globalization.Calendars 4.3.0.
[exec] Installing System.IO 4.3.0.
[exec] Installing System.IO.Compression 4.3.0.
[exec] Installing System.IO.Compression.ZipFile 4.3.0.
[exec] Installing System.IO.FileSystem.Primitives 4.3.0.
[exec] Installing System.Linq.Expressions 4.3.0.
[exec] Installing System.Net.Http 4.3.0.
[exec] Installing System.Net.Primitives 4.3.0.
[exec] Installing System.ObjectModel 4.3.0.
[exec] Installing System.Reflection.Primitives 4.3.0.
[exec] Installing System.Resources.ResourceManager 4.3.0.
[exec] Installing System.Runtime.Handles 4.3.0.
[exec] Installing System.Runtime 4.3.0.
[exec] Installing System.Security.Cryptography.Algorithms 4.3.0.
[exec] Installing System.Security.Cryptography.Encoding 4.3.0.
[exec] Installing System.Runtime.Numerics 4.3.0.
[exec] Installing System.Security.Cryptography.Primitives 4.3.0.
[exec] Installing System.Security.Cryptography.X509Certificates 4.3.0.
[exec] Installing System.Text.Encoding 4.3.0.
[exec] Installing System.Text.Encoding.Extensions 4.3.0.
[exec] Installing System.Threading.Tasks 4.3.0.
[exec] Installing System.Xml.XDocument 4.3.0.
[exec] Installing System.Globalization 4.0.11.
[exec] Installing System.Diagnostics.FileVersionInfo 4.0.0.
[exec] Installing System.Resources.ResourceManager 4.0.1.
[exec] Installing System.Runtime 4.1.0.
[exec] Installing Microsoft.NETCore.Targets 1.1.0.
[exec] Installing Microsoft.NETCore.Platforms 1.0.1.
[exec] Installing Microsoft.Win32.Primitives 4.0.1.
[exec] Installing Microsoft.Win32.Registry 4.0.0.
[exec] Installing runtime.native.System 4.0.0.
[exec] Installing System.Collections 4.0.11.
[exec] Installing System.IO 4.1.0.
[exec] Installing System.IO.FileSystem.Primitives 4.0.1.
[exec] Installing System.Runtime.Handles 4.0.1.
[exec] Installing System.Text.Encoding 4.0.11.
[exec] Installing System.Text.Encoding.Extensions 4.0.11.
[exec] Installing System.Threading.Tasks 4.0.11.
[exec] Installing System.Runtime.Serialization.Primitives 4.3.0.
[exec] Installing runtime.native.System 4.3.0.
[exec] Installing System.Threading.Overlapped 4.0.1.
[exec] Installing System.Threading.Tasks.Extensions 4.3.0.
[exec] Installing System.Diagnostics.Tracing 4.1.0.
[exec] Installing System.Net.Http 4.1.0.
[exec] Installing System.Net.Primitives 4.0.11.
[exec] Installing Newtonsoft.Json 9.0.1.
[exec] Installing Microsoft.Extensions.DependencyModel 1.0.3.
[exec] Installing Microsoft.TestPlatform.ObjectModel 15.5.0.
[exec] Installing System.AppContext 4.1.0.
[exec] Installing System.Collections.Concurrent 4.0.12.
[exec] Installing System.Console 4.0.0.
[exec] Installing System.Diagnostics.Debug 4.0.11.
[exec] Installing System.Globalization.Calendars 4.0.1.
[exec] Installing System.Diagnostics.Tools 4.0.1.
[exec] Installing System.IO.Compression 4.1.0.
[exec] Installing Microsoft.CodeAnalysis.Analyzers 1.1.0.
[exec] Installing System.IO.Compression.ZipFile 4.0.1.
[exec] Installing System.IO.FileSystem 4.0.1.
[exec] Installing System.Linq 4.1.0.
[exec] Installing System.Linq.Expressions 4.1.0.
[exec] Installing System.ObjectModel 4.0.12.
[exec] Installing System.Reflection 4.1.0.
[exec] Installing System.Reflection.Extensions 4.0.1.
[exec] Installing System.Net.Sockets 4.1.0.
[exec] Installing System.Reflection.Primitives 4.0.1.
[exec] Installing System.Runtime.Extensions 4.1.0.
[exec] Installing System.Runtime.InteropServices 4.1.0.
[exec] Installing System.Runtime.InteropServices.RuntimeInformation 4.0.0.
[exec] Installing System.Runtime.Numerics 4.0.1.
[exec] Installing System.Text.RegularExpressions 4.1.0.
[exec] Installing System.Threading 4.0.11.
[exec] Installing System.Threading.Timer 4.0.1.
[exec] Installing Microsoft.NETCore.DotNetHost 1.0.1.
[exec] Installing System.Xml.ReaderWriter 4.0.11.
[exec] Installing System.Xml.XDocument 4.0.11.
[exec] Installing System.Reflection.Emit 4.0.1.
[exec] Installing System.Reflection.Emit.ILGeneration 4.0.1.
[exec] Installing runtime.native.System.Security.Cryptography 4.0.0.
[exec] Installing runtime.native.System.Net.Http 4.0.1.
[exec] Installing System.Security.Cryptography.Cng 4.2.0.
[exec] Installing System.Security.Cryptography.Csp 4.0.0.
[exec] Installing System.Security.Cryptography.OpenSsl 4.0.0.
[exec] Installing System.Reflection.Emit.Lightweight 4.0.1.
[exec] Installing System.Security.Principal 4.0.1.
[exec] Installing runtime.native.System.Net.Security 4.0.1.
[exec] Installing runtime.native.System.IO.Compression 4.1.0.
[exec] Installing Microsoft.NETCore.Windows.ApiSets 1.0.1.
[exec] Installing Microsoft.NETCore.DotNetHostResolver 1.0.1.
[exec] Installing Microsoft.NETCore.Jit 1.0.6.
[exec] Installing Microsoft.CodeAnalysis.Common 1.3.0.
[exec] Installing System.Collections.NonGeneric 4.3.0.
[exec] Installing System.Collections.Specialized 4.3.0.
[exec] Installing System.ComponentModel 4.3.0.
[exec] Installing System.ComponentModel.Primitives 4.3.0.
[exec] Installing System.Xml.XPath 4.3.0.
[exec] Installing System.Threading.ThreadPool 4.3.0.
[exec] Installing Microsoft.Win32.Registry 4.3.0.
[exec] Installing runtime.native.System.IO.Compression 4.3.0.
[exec] Installing System.Buffers 4.3.0.
[exec] Installing System.Reflection.Emit 4.3.0.
[exec] Installing System.Reflection.Emit.ILGeneration 4.3.0.
[exec] Installing System.Reflection.Emit.Lightweight 4.3.0.
[exec] Installing runtime.native.System.Net.Http 4.3.0.
[exec] Installing runtime.native.System.Security.Cryptography.OpenSsl 4.3.0.
[exec] Installing System.Diagnostics.DiagnosticSource 4.3.0.
[exec] Installing System.Globalization.Extensions 4.3.0.
[exec] Installing runtime.native.System.Security.Cryptography.Apple 4.3.0.
[exec] Installing System.Security.Cryptography.OpenSsl 4.3.0.
[exec] Installing System.Security.Cryptography.Cng 4.3.0.
[exec] Installing Microsoft.NETCore.Targets 1.0.1.
[exec] Installing System.Security.Cryptography.Csp 4.3.0.
[exec] Installing System.Runtime.Serialization.Primitives 4.1.1.
[exec] Installing Microsoft.DotNet.PlatformAbstractions 1.0.3.
[exec] Installing System.Runtime.Serialization.Json 4.0.2.
[exec] Installing System.Diagnostics.TextWriterTraceListener 4.0.0.
[exec] Installing System.Xml.XPath.XmlDocument 4.0.1.
[exec] Installing System.ComponentModel.TypeConverter 4.1.0.
[exec] Installing System.ComponentModel.EventBasedAsync 4.0.11.
[exec] Generating MSBuild file /home/jenkins/jenkins-slave/workspace/log4net_feature_cd-pipeline-76KUCPODUF6LCE45226EBUR4GNVLYPMYVC23Z4ITBOMNJT3CA2WA/netstandard/1.3/log4net.tests/obj/log4net.tests.csproj.nuget.g.props.
[exec] Generating MSBuild file /home/jenkins/jenkins-slave/workspace/log4net_feature_cd-pipeline-76KUCPODUF6LCE45226EBUR4GNVLYPMYVC23Z4ITBOMNJT3CA2WA/netstandard/1.3/log4net.tests/obj/log4net.tests.csproj.nuget.g.targets.
[exec] Restore completed in 3.27 sec for /home/jenkins/jenkins-slave/workspace/log4net_feature_cd-pipeline-76KUCPODUF6LCE45226EBUR4GNVLYPMYVC23Z4ITBOMNJT3CA2WA/netstandard/1.3/log4net.tests/log4net.tests.csproj.
[echo] dotnet build log4net
[exec] Microsoft (R) Build Engine version 15.7.177.53362 for .NET Core
[exec] Copyright (C) Microsoft Corporation. All rights reserved.
[exec]
[exec] Restore completed in 89.78 ms for /home/jenkins/jenkins-slave/workspace/log4net_feature_cd-pipeline-76KUCPODUF6LCE45226EBUR4GNVLYPMYVC23Z4ITBOMNJT3CA2WA/netstandard/1.3/log4net/log4net.csproj.
[exec] log4net -> /home/jenkins/jenkins-slave/workspace/log4net_feature_cd-pipeline-76KUCPODUF6LCE45226EBUR4GNVLYPMYVC23Z4ITBOMNJT3CA2WA/netstandard/1.3/log4net/bin/Debug/netstandard1.3/log4net.dll
[exec]
[exec] Build succeeded.
[exec] 0 Warning(s)
[exec] 0 Error(s)
[exec]
[exec] Time Elapsed 00:00:05.08
[mkdir] Creating directory '/home/jenkins/jenkins-slave/workspace/log4net_feature_cd-pipeline-76KUCPODUF6LCE45226EBUR4GNVLYPMYVC23Z4ITBOMNJT3CA2WA/bin/netstandard/1.3'.
[move] 1 directory moved.
set-release-build-configuration:
check-current-build-config:
set-build-configuration-flags:
compile-netstandard-1.3-current-configuration:
[echo] dotnet --version
[exec] 2.1.200
[echo] dotnet restore log4net.netstandard.sln
[exec] Restore completed in 83.88 ms for /home/jenkins/jenkins-slave/workspace/log4net_feature_cd-pipeline-76KUCPODUF6LCE45226EBUR4GNVLYPMYVC23Z4ITBOMNJT3CA2WA/netstandard/1.3/log4net/log4net.csproj.
[exec] Restore completed in 83.88 ms for /home/jenkins/jenkins-slave/workspace/log4net_feature_cd-pipeline-76KUCPODUF6LCE45226EBUR4GNVLYPMYVC23Z4ITBOMNJT3CA2WA/netstandard/1.3/log4net.tests/log4net.tests.csproj.
[echo] dotnet build log4net
[exec] Microsoft (R) Build Engine version 15.7.177.53362 for .NET Core
[exec] Copyright (C) Microsoft Corporation. All rights reserved.
[exec]
[exec] Restore completed in 79.07 ms for /home/jenkins/jenkins-slave/workspace/log4net_feature_cd-pipeline-76KUCPODUF6LCE45226EBUR4GNVLYPMYVC23Z4ITBOMNJT3CA2WA/netstandard/1.3/log4net/log4net.csproj.
[exec] log4net -> /home/jenkins/jenkins-slave/workspace/log4net_feature_cd-pipeline-76KUCPODUF6LCE45226EBUR4GNVLYPMYVC23Z4ITBOMNJT3CA2WA/netstandard/1.3/log4net/bin/Release/netstandard1.3/log4net.dll
[exec]
[exec] Build succeeded.
[exec] 0 Warning(s)
[exec] 0 Error(s)
[exec]
[exec] Time Elapsed 00:00:03.40
[move] 1 directory moved.
BUILD SUCCEEDED
Total time: 19.4 seconds.
[Pipeline] stash
Stashed 6 file(s)
[Pipeline] sh
[log4net_feature_cd-pipeline-76KUCPODUF6LCE45226EBUR4GNVLYPMYVC23Z4ITBOMNJT3CA2WA] Running shell script
[Pipeline] }
$ docker stop --time=1 74f2eb9944bf1a536f5a7afb812a7511501add7e8ec90d697e031e8772c6b33f
[Pipeline] // withDockerContainer
[Pipeline] }
[Pipeline] // script
[Pipeline] }
[Pipeline] // stage
[Pipeline] stage
[Pipeline] { (build net-2.0)
Stage 'build net-2.0' skipped due to earlier failure(s)
[Pipeline] }
[Pipeline] // stage
[Pipeline] stage
[Pipeline] { (build net-3.5)
Stage 'build net-3.5' skipped due to earlier failure(s)
[Pipeline] }
[Pipeline] // stage
[Pipeline] stage
[Pipeline] { (build net-3.5-cp)
Stage 'build net-3.5-cp' skipped due to earlier failure(s)
[Pipeline] }
[Pipeline] // stage
[Pipeline] stage
[Pipeline] { (build net-4.0)
Stage 'build net-4.0' skipped due to earlier failure(s)
[Pipeline] }
[Pipeline] // stage
[Pipeline] stage
[Pipeline] { (build net-4.0-cp)
Stage 'build net-4.0-cp' skipped due to earlier failure(s)
[Pipeline] }
[Pipeline] // stage
[Pipeline] stage
[Pipeline] { (build net-4.5)
Stage 'build net-4.5' skipped due to earlier failure(s)
[Pipeline] }
[Pipeline] // stage
[Pipeline] stage
[Pipeline] { (build mono-2.0)
Stage 'build mono-2.0' skipped due to earlier failure(s)
[Pipeline] }
[Pipeline] // stage
[Pipeline] stage
[Pipeline] { (build mono-3.5)
Stage 'build mono-3.5' skipped due to earlier failure(s)
[Pipeline] }
[Pipeline] // stage
[Pipeline] stage
[Pipeline] { (build mono-4.0)
Stage 'build mono-4.0' skipped due to earlier failure(s)
[Pipeline] }
[Pipeline] // stage
[Pipeline] stage
[Pipeline] { (build site)
Stage 'build site' skipped due to earlier failure(s)
[Pipeline] }
[Pipeline] // stage
[Pipeline] stage
[Pipeline] { (prepare package)
Stage 'prepare package' skipped due to earlier failure(s)
[Pipeline] }
[Pipeline] // stage
[Pipeline] stage
[Pipeline] { (check test results)
Stage 'check test results' skipped due to earlier failure(s)
[Pipeline] }
[Pipeline] // stage
[Pipeline] stage
[Pipeline] { (publish site)
Stage 'publish site' skipped due to earlier failure(s)
[Pipeline] }
[Pipeline] // stage
[Pipeline] stage
[Pipeline] { (Declarative: Post Actions)
[Pipeline] step