You are viewing a plain text version of this content. The canonical link for it is here.
Posted to builds@lucene.apache.org by Policeman Jenkins Server <je...@thetaphi.de> on 2023/07/07 16:39:13 UTC
[JENKINS] Lucene-main-Linux (64bit/openj9/jdk-17.0.5) - Build # 43008 - Unstable!
Build: https://jenkins.thetaphi.de/job/Lucene-main-Linux/43008/
Java: 64bit/openj9/jdk-17.0.5 -XX:-UseCompressedOops -Xgcpolicy:metronome
1 tests failed.
FAILED: org.apache.lucene.util.automaton.TestAutomaton.testRandomFinite
Error Message:
java.lang.IllegalArgumentException: This builder doesn't allow terms that are larger than 1000 characters, got [e0 ac ad e0 ac 8b e0 ad bb e0 b0 89 e0 b0 94 e0 b0 b4 e0 b0 8a e0 b1 a5 e0 b0 91 f0 90 a0 bf f0 90 a0 8e f0 90 a0 85 f0 90 a0 a9 f0 90 a0 98 f0 90 a0 91 f0 90 a0 bd f0 90 a0 a4 f0 90 a0 be f0 90 a0 87 f0 90 a0 9a ea a0 b1 ea a0 be ea a0 be ea a0 be ea a0 b2 ea a0 b3 ea a0 b7 ea a0 bb ea a0 be ea a0 b6 f0 9d 91 a6 f0 9d 97 90 f0 9d 9e aa f0 9d 91 a2 f0 9d 9d 9b f0 9d 9b b2 f0 9d 96 86 f0 9d 9b ad f0 9d 91 80 f0 9d 98 b1 f0 9d 94 8f f0 9d 95 91 f0 9d 96 a3 f0 9d 98 95 f0 9d 90 85 f0 9d 9c b5 f0 9d 9c 8b f0 9d 9c a1 ed 9f 9b ed 9f b0 ed 9e bf ed 9f 86 e2 b4 b2 e2 b5 81 e2 b5 90 e2 b5 bb e2 b5 90 e2 b5 af e2 b5 a0 e2 b5 b0 e2 bf bf e2 bf b1 e2 bf bb e2 bf b1 e2 bf b1 e2 bf b6 e2 bf bc e2 bf ba e2 bf bc e2 bf b5 e2 bf bb e2 bf ba e2 bf bb e2 bf bc e2 bf bb e2 bf b8 e0 a5 9e e0 a4 98 e0 a5 bb e0 a4 96 f0 9f 8b 9e f0 9f 8b 94 f0 9f 8a 9f f0 9f 8a 89 f0 9f 89 a9 f0 9f 8b ac f0 9f 89 a2 f0 9f 88 b4 f0 9f 8a b6 f0 9f 8a 82 f0 9f 8b 80 f0 9f 8a ba f0 9f 8a 82 f0 9f 89 b1 f0 9f 89 93 f0 9f 8b 8a f0 9f 88 97 f0 9f 8b b5 f0 9f 8b a6 f0 9f 88 9b e1 ae aa e1 ae 9d e1 ae 93 e1 ae 9a e1 ae b4 e1 ae b7 e1 ae 9e e2 a1 96 e2 a1 99 e2 a0 9d e2 a0 81 e2 a2 a0 e2 a2 b0 e2 a2 b3 e2 a2 a2 e2 a0 90 e1 b7 9e e1 b7 8c e1 b7 9f e1 b7 9d e1 b7 9b e1 b7 8a e1 b7 a4 e1 b7 97 e1 b7 92 e1 b7 8a e1 b7 94 e1 b7 87 e1 b7 94 e1 b7 a7 e1 b7 84 e1 b7 a2 e1 b7 ab e1 b7 9c e1 b7 8a e1 b7 8c f0 90 a8 82 f0 90 a8 b2 f0 90 a9 90 f0 90 a9 80 f0 90 a9 99 f0 90 a8 90 f0 90 a8 83 f0 90 a8 ba f0 90 a9 92 f0 90 a8 9f f0 90 a8 8f f0 90 a8 a3 e0 ba b5 e0 ba 80 e0 ba a1 e0 ba 8e e0 ba 8b e0 ba bd e0 bb 8b e0 ba 93 e0 bb 9c e0 ba b9 e0 ba 98 e0 bb b3 e0 bb 8c e0 ba 9d e0 bb 83 e0 ba 8d f0 90 a4 ab f0 90 a4 a1 f0 90 a4 b8 f0 90 a4 b8 f0 90 a4 a5 f0 90 a4 a1 f0 90 a4 a0 f0 90 a4 b9 f0 90 a4 bc f0 90 a4 aa f0 90 a4 b9 f0 90 a4 bd df 9a df 82 df 9b df 8e df 94 df bc df 9f df 93 df 81 e1 83 bb e1 82 bb e1 82 ba e1 83 b9 e1 83 9c e1 83 bd e1 83 ba e1 82 b4 e1 83 b2 e1 83 98 e1 83 9a e1 83 8c e1 83 98 e1 82 a8 e2 b5 9a e2 b5 a7 e2 b5 91 e2 b5 86 e2 b5 a1 e2 b5 bd e2 b5 95 e2 b5 b8 e2 b5 ad e2 b5 9d e2 b5 b6 e2 b5 a3 e2 b5 98 e2 b5 a7 e2 b5 a6 e2 b4 b4 e2 b5 84 e2 b5 af ef b8 91 ef b8 9e ef b8 90 ef b8 94 ef b8 9f ef b8 9e ef b8 94 ef b8 96 ef b8 97 ef b8 99 ef b8 97 ef b8 9a ef b8 95 ef b8 95 ef b8 9d f0 90 b0 8c f0 90 b1 88 f0 90 b0 b3 f0 90 b0 b5 f0 90 b1 86 f0 90 b1 88 f0 90 b0 9d f0 90 b0 a0 f0 90 b0 82 f0 90 b0 85 f0 90 b0 98 f0 90 b0 a8 e2 bf b7 e2 bf b3 e2 bf ba e2 bf b5 e2 bf b6 e2 bf b8 e2 bf ba e2 bf b6 e2 bf b9 e2 bf b0 e2 bf b5 e2 bf b7 e2 bf bf e2 bf b3 e2 bf b2 e2 bf b3 e2 bf ba f0 90 a8 a2 f0 90 a9 80 f0 90 a8 8d f0 90 a8 99 f0 90 a9 88 f0 90 a8 81 f0 90 a8 9f f0 90 a8 9a f0 90 a8 83 f0 90 a9 9e f0 90 a8 ac f0 90 a8 87 f0 90 a8 a8 f0 90 a8 ba f0 90 a9 8e f0 90 a8 83 f0 90 a9 87 f0 90 a8 a1 f0 90 a8 a7 e3 8b bf e3 88 87 f0 9f 81 9d f0 9f 81 8d f0 9f 81 99 f0 9f 82 97 f0 9f 80 b9 f0 9f 82 9f f0 9f 81 a1 f0 9f 81 83 f0 9f 82 9b f0 9f 81 8b f0 9f 82 9c f0 9f 81 ab f0 9f 81 9b f0 9f 80 b0 f0 9f 81 b6 f0 9f 81 9e]
Stack Trace:
java.lang.IllegalArgumentException: This builder doesn't allow terms that are larger than 1000 characters, got [e0 ac ad e0 ac 8b e0 ad bb e0 b0 89 e0 b0 94 e0 b0 b4 e0 b0 8a e0 b1 a5 e0 b0 91 f0 90 a0 bf f0 90 a0 8e f0 90 a0 85 f0 90 a0 a9 f0 90 a0 98 f0 90 a0 91 f0 90 a0 bd f0 90 a0 a4 f0 90 a0 be f0 90 a0 87 f0 90 a0 9a ea a0 b1 ea a0 be ea a0 be ea a0 be ea a0 b2 ea a0 b3 ea a0 b7 ea a0 bb ea a0 be ea a0 b6 f0 9d 91 a6 f0 9d 97 90 f0 9d 9e aa f0 9d 91 a2 f0 9d 9d 9b f0 9d 9b b2 f0 9d 96 86 f0 9d 9b ad f0 9d 91 80 f0 9d 98 b1 f0 9d 94 8f f0 9d 95 91 f0 9d 96 a3 f0 9d 98 95 f0 9d 90 85 f0 9d 9c b5 f0 9d 9c 8b f0 9d 9c a1 ed 9f 9b ed 9f b0 ed 9e bf ed 9f 86 e2 b4 b2 e2 b5 81 e2 b5 90 e2 b5 bb e2 b5 90 e2 b5 af e2 b5 a0 e2 b5 b0 e2 bf bf e2 bf b1 e2 bf bb e2 bf b1 e2 bf b1 e2 bf b6 e2 bf bc e2 bf ba e2 bf bc e2 bf b5 e2 bf bb e2 bf ba e2 bf bb e2 bf bc e2 bf bb e2 bf b8 e0 a5 9e e0 a4 98 e0 a5 bb e0 a4 96 f0 9f 8b 9e f0 9f 8b 94 f0 9f 8a 9f f0 9f 8a 89 f0 9f 89 a9 f0 9f 8b ac f0 9f 89 a2 f0 9f 88 b4 f0 9f 8a b6 f0 9f 8a 82 f0 9f 8b 80 f0 9f 8a ba f0 9f 8a 82 f0 9f 89 b1 f0 9f 89 93 f0 9f 8b 8a f0 9f 88 97 f0 9f 8b b5 f0 9f 8b a6 f0 9f 88 9b e1 ae aa e1 ae 9d e1 ae 93 e1 ae 9a e1 ae b4 e1 ae b7 e1 ae 9e e2 a1 96 e2 a1 99 e2 a0 9d e2 a0 81 e2 a2 a0 e2 a2 b0 e2 a2 b3 e2 a2 a2 e2 a0 90 e1 b7 9e e1 b7 8c e1 b7 9f e1 b7 9d e1 b7 9b e1 b7 8a e1 b7 a4 e1 b7 97 e1 b7 92 e1 b7 8a e1 b7 94 e1 b7 87 e1 b7 94 e1 b7 a7 e1 b7 84 e1 b7 a2 e1 b7 ab e1 b7 9c e1 b7 8a e1 b7 8c f0 90 a8 82 f0 90 a8 b2 f0 90 a9 90 f0 90 a9 80 f0 90 a9 99 f0 90 a8 90 f0 90 a8 83 f0 90 a8 ba f0 90 a9 92 f0 90 a8 9f f0 90 a8 8f f0 90 a8 a3 e0 ba b5 e0 ba 80 e0 ba a1 e0 ba 8e e0 ba 8b e0 ba bd e0 bb 8b e0 ba 93 e0 bb 9c e0 ba b9 e0 ba 98 e0 bb b3 e0 bb 8c e0 ba 9d e0 bb 83 e0 ba 8d f0 90 a4 ab f0 90 a4 a1 f0 90 a4 b8 f0 90 a4 b8 f0 90 a4 a5 f0 90 a4 a1 f0 90 a4 a0 f0 90 a4 b9 f0 90 a4 bc f0 90 a4 aa f0 90 a4 b9 f0 90 a4 bd df 9a df 82 df 9b df 8e df 94 df bc df 9f df 93 df 81 e1 83 bb e1 82 bb e1 82 ba e1 83 b9 e1 83 9c e1 83 bd e1 83 ba e1 82 b4 e1 83 b2 e1 83 98 e1 83 9a e1 83 8c e1 83 98 e1 82 a8 e2 b5 9a e2 b5 a7 e2 b5 91 e2 b5 86 e2 b5 a1 e2 b5 bd e2 b5 95 e2 b5 b8 e2 b5 ad e2 b5 9d e2 b5 b6 e2 b5 a3 e2 b5 98 e2 b5 a7 e2 b5 a6 e2 b4 b4 e2 b5 84 e2 b5 af ef b8 91 ef b8 9e ef b8 90 ef b8 94 ef b8 9f ef b8 9e ef b8 94 ef b8 96 ef b8 97 ef b8 99 ef b8 97 ef b8 9a ef b8 95 ef b8 95 ef b8 9d f0 90 b0 8c f0 90 b1 88 f0 90 b0 b3 f0 90 b0 b5 f0 90 b1 86 f0 90 b1 88 f0 90 b0 9d f0 90 b0 a0 f0 90 b0 82 f0 90 b0 85 f0 90 b0 98 f0 90 b0 a8 e2 bf b7 e2 bf b3 e2 bf ba e2 bf b5 e2 bf b6 e2 bf b8 e2 bf ba e2 bf b6 e2 bf b9 e2 bf b0 e2 bf b5 e2 bf b7 e2 bf bf e2 bf b3 e2 bf b2 e2 bf b3 e2 bf ba f0 90 a8 a2 f0 90 a9 80 f0 90 a8 8d f0 90 a8 99 f0 90 a9 88 f0 90 a8 81 f0 90 a8 9f f0 90 a8 9a f0 90 a8 83 f0 90 a9 9e f0 90 a8 ac f0 90 a8 87 f0 90 a8 a8 f0 90 a8 ba f0 90 a9 8e f0 90 a8 83 f0 90 a9 87 f0 90 a8 a1 f0 90 a8 a7 e3 8b bf e3 88 87 f0 9f 81 9d f0 9f 81 8d f0 9f 81 99 f0 9f 82 97 f0 9f 80 b9 f0 9f 82 9f f0 9f 81 a1 f0 9f 81 83 f0 9f 82 9b f0 9f 81 8b f0 9f 82 9c f0 9f 81 ab f0 9f 81 9b f0 9f 80 b0 f0 9f 81 b6 f0 9f 81 9e]
at __randomizedtesting.SeedInfo.seed([3AAC28BC76FA5563:7D1A4E81C96A3042]:0)
at app//org.apache.lucene.util.automaton.StringsToAutomaton.add(StringsToAutomaton.java:269)
at app//org.apache.lucene.util.automaton.StringsToAutomaton.build(StringsToAutomaton.java:245)
at app//org.apache.lucene.util.automaton.Automata.makeStringUnion(Automata.java:583)
at app//org.apache.lucene.util.automaton.TestAutomaton.unionTerms(TestAutomaton.java:810)
at app//org.apache.lucene.util.automaton.TestAutomaton.assertSame(TestAutomaton.java:1280)
at app//org.apache.lucene.util.automaton.TestAutomaton.testRandomFinite(TestAutomaton.java:1190)
at java.base@17.0.5/jdk.internal.reflect.NativeMethodAccessorImpl.invoke0(Native Method)
at java.base@17.0.5/jdk.internal.reflect.NativeMethodAccessorImpl.invoke(NativeMethodAccessorImpl.java:77)
at java.base@17.0.5/jdk.internal.reflect.DelegatingMethodAccessorImpl.invoke(DelegatingMethodAccessorImpl.java:43)
at java.base@17.0.5/java.lang.reflect.Method.invoke(Method.java:568)
at app//com.carrotsearch.randomizedtesting.RandomizedRunner.invoke(RandomizedRunner.java:1758)
at app//com.carrotsearch.randomizedtesting.RandomizedRunner$8.evaluate(RandomizedRunner.java:946)
at app//com.carrotsearch.randomizedtesting.RandomizedRunner$9.evaluate(RandomizedRunner.java:982)
at app//com.carrotsearch.randomizedtesting.RandomizedRunner$10.evaluate(RandomizedRunner.java:996)
at app//org.apache.lucene.tests.util.TestRuleSetupTeardownChained$1.evaluate(TestRuleSetupTeardownChained.java:48)
at app//org.apache.lucene.tests.util.AbstractBeforeAfterRule$1.evaluate(AbstractBeforeAfterRule.java:43)
at app//org.apache.lucene.tests.util.TestRuleThreadAndTestName$1.evaluate(TestRuleThreadAndTestName.java:45)
at app//org.apache.lucene.tests.util.TestRuleIgnoreAfterMaxFailures$1.evaluate(TestRuleIgnoreAfterMaxFailures.java:60)
at app//org.apache.lucene.tests.util.TestRuleMarkFailure$1.evaluate(TestRuleMarkFailure.java:44)
at app//org.junit.rules.RunRules.evaluate(RunRules.java:20)
at app//com.carrotsearch.randomizedtesting.rules.StatementAdapter.evaluate(StatementAdapter.java:36)
at app//com.carrotsearch.randomizedtesting.ThreadLeakControl$StatementRunner.run(ThreadLeakControl.java:390)
at app//com.carrotsearch.randomizedtesting.ThreadLeakControl.forkTimeoutingTask(ThreadLeakControl.java:843)
at app//com.carrotsearch.randomizedtesting.ThreadLeakControl$3.evaluate(ThreadLeakControl.java:490)
at app//com.carrotsearch.randomizedtesting.RandomizedRunner.runSingleTest(RandomizedRunner.java:955)
at app//com.carrotsearch.randomizedtesting.RandomizedRunner$5.evaluate(RandomizedRunner.java:840)
at app//com.carrotsearch.randomizedtesting.RandomizedRunner$6.evaluate(RandomizedRunner.java:891)
at app//com.carrotsearch.randomizedtesting.RandomizedRunner$7.evaluate(RandomizedRunner.java:902)
at app//org.apache.lucene.tests.util.AbstractBeforeAfterRule$1.evaluate(AbstractBeforeAfterRule.java:43)
at app//com.carrotsearch.randomizedtesting.rules.StatementAdapter.evaluate(StatementAdapter.java:36)
at app//org.apache.lucene.tests.util.TestRuleStoreClassName$1.evaluate(TestRuleStoreClassName.java:38)
at app//com.carrotsearch.randomizedtesting.rules.NoShadowingOrOverridesOnMethodsRule$1.evaluate(NoShadowingOrOverridesOnMethodsRule.java:40)
at app//com.carrotsearch.randomizedtesting.rules.NoShadowingOrOverridesOnMethodsRule$1.evaluate(NoShadowingOrOverridesOnMethodsRule.java:40)
at app//com.carrotsearch.randomizedtesting.rules.StatementAdapter.evaluate(StatementAdapter.java:36)
at app//com.carrotsearch.randomizedtesting.rules.StatementAdapter.evaluate(StatementAdapter.java:36)
at app//org.apache.lucene.tests.util.TestRuleAssertionsRequired$1.evaluate(TestRuleAssertionsRequired.java:53)
at app//org.apache.lucene.tests.util.AbstractBeforeAfterRule$1.evaluate(AbstractBeforeAfterRule.java:43)
at app//org.apache.lucene.tests.util.TestRuleMarkFailure$1.evaluate(TestRuleMarkFailure.java:44)
at app//org.apache.lucene.tests.util.TestRuleIgnoreAfterMaxFailures$1.evaluate(TestRuleIgnoreAfterMaxFailures.java:60)
at app//org.apache.lucene.tests.util.TestRuleIgnoreTestSuites$1.evaluate(TestRuleIgnoreTestSuites.java:47)
at app//org.junit.rules.RunRules.evaluate(RunRules.java:20)
at app//com.carrotsearch.randomizedtesting.rules.StatementAdapter.evaluate(StatementAdapter.java:36)
at app//com.carrotsearch.randomizedtesting.ThreadLeakControl$StatementRunner.run(ThreadLeakControl.java:390)
at app//com.carrotsearch.randomizedtesting.ThreadLeakControl.lambda$forkTimeoutingTask$0(ThreadLeakControl.java:850)
at java.base@17.0.5/java.lang.Thread.run(Thread.java:857)