You are viewing a plain text version of this content. The canonical link for it is here.
Posted to builds@beam.apache.org by Apache Jenkins Server <je...@builds.apache.org> on 2023/08/31 20:33:25 UTC
Build failed in Jenkins: beam_PreCommit_SQL_Cron #5506
See <https://ci-beam.apache.org/job/beam_PreCommit_SQL_Cron/5506/display/redirect>
Changes:
------------------------------------------
[...truncated 140.83 KB...]
> Task :sdks:java:extensions:sql:perf-tests:buildDependents
> Task :sdks:java:extensions:sql:zetasql:assemble
> Task :sdks:java:extensions:sql:zetasql:analyzeClassesDependencies
> Task :sdks:java:extensions:sql:zetasql:compileTestJava FROM-CACHE
> Task :sdks:java:extensions:sql:zetasql:testClasses UP-TO-DATE
> Task :sdks:java:extensions:sql:zetasql:analyzeTestClassesDependencies SKIPPED
> Task :sdks:java:extensions:sql:zetasql:analyzeDependencies
> Task :sdks:java:extensions:sql:zetasql:checkstyleMain SKIPPED
> Task :sdks:java:extensions:sql:zetasql:checkstyleTest SKIPPED
> Task :sdks:java:extensions:sql:zetasql:javadoc FROM-CACHE
> Task :sdks:java:extensions:sql:zetasql:spotbugsMain FROM-CACHE
> Task :sdks:java:extensions:sql:zetasql:spotbugsTest SKIPPED
> Task :sdks:java:extensions:sql:zetasql:test FROM-CACHE
> Task :sdks:java:extensions:sql:zetasql:check
> Task :sdks:java:extensions:sql:zetasql:build
> Task :sdks:java:extensions:sql:runBasicExample
SLF4J: Class path contains multiple SLF4J bindings.
SLF4J: Found binding in [jar:file:/home/jenkins/.gradle/caches/modules-2/files-2.1/org.slf4j/slf4j-jdk14/1.7.30/d35953dd2fe54ebe39fdf18cfd82fe6eb35b25ed/slf4j-jdk14-1.7.30.jar!/org/slf4j/impl/StaticLoggerBinder.class]
SLF4J: Found binding in [jar:file:/home/jenkins/.gradle/caches/modules-2/files-2.1/org.slf4j/slf4j-reload4j/1.7.36/db708f7d959dee1857ac524636e85ecf2e1781c1/slf4j-reload4j-1.7.36.jar!/org/slf4j/impl/StaticLoggerBinder.class]
SLF4J: Found binding in [jar:file:/home/jenkins/.gradle/caches/modules-2/files-2.1/org.slf4j/slf4j-log4j12/1.7.30/c21f55139d8141d2231214fb1feaf50a1edca95e/slf4j-log4j12-1.7.30.jar!/org/slf4j/impl/StaticLoggerBinder.class]
SLF4J: See http://www.slf4j.org/codes.html#multiple_bindings for an explanation.
SLF4J: Actual binding is of type [org.slf4j.impl.JDK14LoggerFactory]
> Task :sdks:java:extensions:sql:shell:startScripts
> Task :runners:flink:1.15:job-server:startScripts
> Task :runners:flink:1.16:job-server:startScripts
> Task :runners:flink:1.14:job-server:startScripts
> Task :runners:flink:1.12:job-server:startScripts
> Task :runners:flink:1.13:job-server:startScripts
> Task :sdks:java:extensions:sql:runBasicExample
Aug 31, 2023 8:26:28 PM org.apache.beam.sdk.extensions.sql.impl.CalciteQueryPlanner convertToBeamRel
INFO: SQL:
SELECT `PCOLLECTION`.`c1`, `PCOLLECTION`.`c2`, `PCOLLECTION`.`c3`
FROM `beam`.`PCOLLECTION` AS `PCOLLECTION`
WHERE `PCOLLECTION`.`c1` > 1
Aug 31, 2023 8:26:29 PM org.apache.beam.sdk.extensions.sql.impl.CalciteQueryPlanner convertToBeamRel
INFO: SQLPlan>
LogicalProject(c1=[$0], c2=[$1], c3=[$2])
LogicalFilter(condition=[>($0, 1)])
BeamIOSourceRel(table=[[beam, PCOLLECTION]])
Aug 31, 2023 8:26:29 PM org.apache.beam.sdk.extensions.sql.impl.CalciteQueryPlanner convertToBeamRel
INFO: BEAMPlan>
BeamCalcRel(expr#0..2=[{inputs}], expr#3=[1], expr#4=[>($t0, $t3)], proj#0..2=[{exprs}], $condition=[$t4])
BeamIOSourceRel(table=[[beam, PCOLLECTION]])
Aug 31, 2023 8:26:30 PM org.apache.beam.sdk.extensions.sql.impl.CalciteQueryPlanner convertToBeamRel
INFO: SQL:
SELECT `CASE1_RESULT`.`c2`, SUM(`CASE1_RESULT`.`c3`)
FROM `beam`.`CASE1_RESULT` AS `CASE1_RESULT`
GROUP BY `CASE1_RESULT`.`c2`
Aug 31, 2023 8:26:30 PM org.apache.beam.sdk.extensions.sql.impl.CalciteQueryPlanner convertToBeamRel
INFO: SQLPlan>
LogicalAggregate(group=[{0}], EXPR$1=[SUM($1)])
LogicalProject(c2=[$1], c3=[$2])
BeamIOSourceRel(table=[[beam, CASE1_RESULT]])
Aug 31, 2023 8:26:30 PM org.apache.beam.sdk.extensions.sql.impl.CalciteQueryPlanner convertToBeamRel
INFO: BEAMPlan>
BeamAggregationRel(group=[{1}], EXPR$1=[SUM($2)])
BeamIOSourceRel(table=[[beam, CASE1_RESULT]])
Aug 31, 2023 8:26:31 PM org.apache.beam.sdk.Pipeline validate
WARNING: The following transforms do not have stable unique names: log_result, SqlTransform
> Task :runners:flink:1.12:job-server:distTar
> Task :runners:flink:1.15:job-server:distTar
> Task :runners:flink:1.16:job-server:distTar
> Task :runners:flink:1.14:job-server:distTar
> Task :sdks:java:extensions:sql:runBasicExample
PCOLLECTION: [3, row, 3.0]
PCOLLECTION: [2, row, 2.0]
> Task :sdks:java:extensions:sql:shell:distTar
> Task :runners:flink:1.13:job-server:distTar
> Task :sdks:java:extensions:sql:runBasicExample
CASE1_RESULT: [row, 5.0]
> Task :sdks:java:extensions:sql:runPojoExample
SLF4J: Class path contains multiple SLF4J bindings.
SLF4J: Found binding in [jar:file:/home/jenkins/.gradle/caches/modules-2/files-2.1/org.slf4j/slf4j-jdk14/1.7.30/d35953dd2fe54ebe39fdf18cfd82fe6eb35b25ed/slf4j-jdk14-1.7.30.jar!/org/slf4j/impl/StaticLoggerBinder.class]
SLF4J: Found binding in [jar:file:/home/jenkins/.gradle/caches/modules-2/files-2.1/org.slf4j/slf4j-reload4j/1.7.36/db708f7d959dee1857ac524636e85ecf2e1781c1/slf4j-reload4j-1.7.36.jar!/org/slf4j/impl/StaticLoggerBinder.class]
SLF4J: Found binding in [jar:file:/home/jenkins/.gradle/caches/modules-2/files-2.1/org.slf4j/slf4j-log4j12/1.7.30/c21f55139d8141d2231214fb1feaf50a1edca95e/slf4j-log4j12-1.7.30.jar!/org/slf4j/impl/StaticLoggerBinder.class]
SLF4J: See http://www.slf4j.org/codes.html#multiple_bindings for an explanation.
SLF4J: Actual binding is of type [org.slf4j.impl.JDK14LoggerFactory]
> Task :sdks:java:extensions:sql:jdbc:shadowTestJar
> Task :sdks:java:extensions:sql:runPojoExample
Aug 31, 2023 8:26:42 PM org.apache.beam.sdk.extensions.sql.impl.CalciteQueryPlanner convertToBeamRel
INFO: SQL:
SELECT `PCOLLECTION`.`id`, `PCOLLECTION`.`name`
FROM `beam`.`PCOLLECTION` AS `PCOLLECTION`
WHERE `PCOLLECTION`.`countryOfResidence` = 'Wonderland'
Aug 31, 2023 8:26:43 PM org.apache.beam.sdk.extensions.sql.impl.CalciteQueryPlanner convertToBeamRel
INFO: SQLPlan>
LogicalProject(id=[$2], name=[$1])
LogicalFilter(condition=[=($0, 'Wonderland')])
BeamIOSourceRel(table=[[beam, PCOLLECTION]])
Aug 31, 2023 8:26:43 PM org.apache.beam.sdk.extensions.sql.impl.CalciteQueryPlanner convertToBeamRel
INFO: BEAMPlan>
BeamCalcRel(expr#0..2=[{inputs}], expr#3=['Wonderland':VARCHAR], expr#4=[=($t0, $t3)], id=[$t2], name=[$t1], $condition=[$t4])
BeamIOSourceRel(table=[[beam, PCOLLECTION]])
Aug 31, 2023 8:26:44 PM org.apache.beam.sdk.extensions.sql.impl.CalciteQueryPlanner convertToBeamRel
INFO: SQL:
SELECT COUNT(`PCOLLECTION`.`id`)
FROM `beam`.`PCOLLECTION` AS `PCOLLECTION`
Aug 31, 2023 8:26:44 PM org.apache.beam.sdk.extensions.sql.impl.CalciteQueryPlanner convertToBeamRel
INFO: SQLPlan>
LogicalAggregate(group=[{}], EXPR$0=[COUNT()])
BeamIOSourceRel(table=[[beam, PCOLLECTION]])
Aug 31, 2023 8:26:44 PM org.apache.beam.sdk.extensions.sql.impl.CalciteQueryPlanner convertToBeamRel
INFO: BEAMPlan>
BeamAggregationRel(group=[{}], EXPR$0=[COUNT()])
BeamIOSourceRel(table=[[beam, PCOLLECTION]])
Aug 31, 2023 8:26:44 PM org.apache.beam.sdk.extensions.sql.impl.CalciteQueryPlanner convertToBeamRel
INFO: SQL:
SELECT `customers`.`name`, 'order id:' || CAST(`orders`.`id` AS VARCHAR)
FROM `beam`.`orders` AS `orders`
INNER JOIN `beam`.`customers` AS `customers` ON `orders`.`customerId` = `customers`.`id`
WHERE `customers`.`name` = 'Grault'
Aug 31, 2023 8:26:44 PM org.apache.beam.sdk.extensions.sql.impl.CalciteQueryPlanner convertToBeamRel
INFO: SQLPlan>
LogicalProject(name=[$3], EXPR$1=[||('order id:', CAST($1):VARCHAR NOT NULL)])
LogicalFilter(condition=[=($3, 'Grault')])
LogicalJoin(condition=[=($0, $4)], joinType=[inner])
BeamIOSourceRel(table=[[beam, orders]])
BeamIOSourceRel(table=[[beam, customers]])
Aug 31, 2023 8:26:44 PM org.apache.beam.sdk.extensions.sql.impl.CalciteQueryPlanner convertToBeamRel
INFO: BEAMPlan>
BeamCalcRel(expr#0..4=[{inputs}], expr#5=['order id:'], expr#6=[CAST($t1):VARCHAR NOT NULL], expr#7=[||($t5, $t6)], name=[$t3], EXPR$1=[$t7])
BeamCoGBKJoinRel(condition=[=($0, $4)], joinType=[inner])
BeamIOSourceRel(table=[[beam, orders]])
BeamCalcRel(expr#0..2=[{inputs}], expr#3=['Grault':VARCHAR], expr#4=[=($t1, $t3)], proj#0..2=[{exprs}], $condition=[$t4])
BeamIOSourceRel(table=[[beam, customers]])
Aug 31, 2023 8:26:45 PM org.apache.beam.sdk.Pipeline validate
WARNING: The following transforms do not have stable unique names: Create.Values, MapElements, SqlTransform
[4, Grault]: is from Wonderland
[3, Baz]: is from Wonderland
[1, Foo]: is from Wonderland
[3]: total customers in Wonderland
[Grault, order id:8]: ordered by 'Grault'
[Grault, order id:7]: ordered by 'Grault'
> Task :runners:flink:1.12:job-server:distZip
> Task :runners:flink:1.15:job-server:distZip
> Task :runners:flink:1.16:job-server:distZip
> Task :runners:flink:1.14:job-server:distZip
> Task :sdks:java:extensions:sql:shell:distZip
> Task :runners:flink:1.13:job-server:distZip
> Task :sdks:java:extensions:sql:shell:assemble
> Task :sdks:java:extensions:sql:shell:analyzeClassesDependencies
> Task :sdks:java:extensions:sql:shell:analyzeDependencies
> Task :sdks:java:extensions:sql:shell:test NO-SOURCE
> Task :sdks:java:extensions:sql:shell:check
> Task :sdks:java:extensions:sql:shell:build
> Task :sdks:java:extensions:sql:shell:buildDependents
> Task :runners:flink:1.12:job-server:shadowJar
> Task :runners:flink:1.13:job-server:shadowJar
> Task :runners:flink:1.16:job-server:shadowJar
> Task :runners:flink:1.15:job-server:shadowJar
> Task :runners:flink:1.14:job-server:shadowJar
> Task :runners:flink:1.16:job-server:shadowJar FROM-CACHE
> Task :runners:flink:1.16:job-server:startShadowScripts
> Task :runners:flink:1.16:job-server:shadowDistTar
> Task :sdks:java:extensions:sql:jdbc:test
> Task :runners:flink:1.16:job-server:shadowDistZip
> Task :runners:flink:1.16:job-server:assemble
> Task :runners:flink:1.16:job-server:test NO-SOURCE
> Task :runners:flink:1.16:job-server:check
> Task :runners:flink:1.16:job-server:build
> Task :runners:flink:1.16:job-server:buildDependents
> Task :sdks:java:extensions:sql:jdbc:test FAILED
> Task :runners:flink:1.12:job-server:startShadowScripts
> Task :runners:flink:1.13:job-server:startShadowScripts
> Task :runners:flink:1.12:job-server:shadowDistTar
> Task :runners:flink:1.13:job-server:shadowDistTar
> Task :runners:flink:1.14:job-server:startShadowScripts
> Task :runners:flink:1.14:job-server:shadowDistTar
> Task :runners:flink:1.15:job-server:startShadowScripts
> Task :runners:flink:1.15:job-server:shadowDistTar
> Task :runners:flink:1.12:job-server:shadowDistZip
> Task :runners:flink:1.13:job-server:shadowDistZip
> Task :runners:flink:1.12:job-server:assemble
> Task :runners:flink:1.12:job-server:test NO-SOURCE
> Task :runners:flink:1.12:job-server:check
> Task :runners:flink:1.12:job-server:build
> Task :runners:flink:1.12:job-server:buildDependents
> Task :runners:flink:1.13:job-server:assemble
> Task :runners:flink:1.13:job-server:test NO-SOURCE
> Task :runners:flink:1.13:job-server:check
> Task :runners:flink:1.13:job-server:build
> Task :runners:flink:1.13:job-server:buildDependents
> Task :runners:flink:1.14:job-server:shadowDistZip
> Task :runners:flink:1.15:job-server:shadowDistZip
> Task :runners:flink:1.14:job-server:assemble
> Task :runners:flink:1.14:job-server:test NO-SOURCE
> Task :runners:flink:1.14:job-server:check
> Task :runners:flink:1.14:job-server:build
> Task :runners:flink:1.14:job-server:buildDependents
> Task :runners:flink:1.15:job-server:assemble
> Task :runners:flink:1.15:job-server:test NO-SOURCE
> Task :runners:flink:1.15:job-server:check
> Task :runners:flink:1.15:job-server:build
> Task :runners:flink:1.15:job-server:buildDependents
> Task :sdks:java:extensions:sql:expansion-service:buildDependents
> Task :sdks:java:extensions:sql:zetasql:buildDependents
FAILURE: Build failed with an exception.
* What went wrong:
Execution failed for task ':sdks:java:extensions:sql:jdbc:test'.
> Failed to load cache entry 916b499c18cf5e41b77334c661a5e33b for task ':sdks:java:extensions:sql:jdbc:test': Could not load from local cache: Timeout waiting to lock Build cache (/home/jenkins/.gradle/caches/build-cache-1). It is currently in use by another Gradle instance.
Owner PID: 2735583
Our PID: 2738975
Owner Operation:
Our operation:
Lock file: /home/jenkins/.gradle/caches/build-cache-1/build-cache-1.lock
* Try:
> Run with --stacktrace option to get the stack trace.
> Run with --info or --debug option to get more log output.
* Get more help at https://help.gradle.org
Deprecated Gradle features were used in this build, making it incompatible with Gradle 8.0.
You can use '--warning-mode all' to show the individual deprecation warnings and determine if they come from your own scripts or plugins.
See https://docs.gradle.org/7.6.2/userguide/command_line_interface.html#sec:command_line_warnings
BUILD FAILED in 10m 20s
326 actionable tasks: 220 executed, 106 from cache
Publishing build scan...
https://ge.apache.org/s/yfnmpr5ybkoq6
Build step 'Invoke Gradle script' changed build result to FAILURE
Build step 'Invoke Gradle script' marked build as failure
---------------------------------------------------------------------
To unsubscribe, e-mail: builds-unsubscribe@beam.apache.org
For additional commands, e-mail: builds-help@beam.apache.org
Jenkins build is back to normal : beam_PreCommit_SQL_Cron #5507
Posted by Apache Jenkins Server <je...@builds.apache.org>.
See <https://ci-beam.apache.org/job/beam_PreCommit_SQL_Cron/5507/display/redirect>
---------------------------------------------------------------------
To unsubscribe, e-mail: builds-unsubscribe@beam.apache.org
For additional commands, e-mail: builds-help@beam.apache.org