You are viewing a plain text version of this content. The canonical link for it is here.
Posted to commits@sling.apache.org by Apache Jenkins Server <je...@builds.apache.org> on 2016/06/27 13:56:16 UTC

Jenkins build is still unstable: sling-trunk-1.8 #3434

See <https://builds.apache.org/job/sling-trunk-1.8/3434/>


Build failed in Jenkins: sling-trunk-1.8 #3436

Posted by Apache Jenkins Server <je...@builds.apache.org>.
See <https://builds.apache.org/job/sling-trunk-1.8/3436/changes>

Changes:

[olli] SLING-3027 Improve Launchpad Karaf Features

use latest releases

[bdelacretaz] Use released modules

[bdelacretaz] Rename o.a.s.repoinit.oak-jcr to o.a.s.jcr.repoinit

------------------------------------------
[...truncated 13938 lines...]
A         testing/org.apache.sling.testing.paxexam/src/main/java/org/apache/sling/testing/paxexam/SlingOptions.java
A         testing/org.apache.sling.testing.paxexam/pom.xml
A         testing/org.apache.sling.testing.paxexam/README.md
A         testing/tools
A         testing/tools/src
A         testing/tools/src/test
A         testing/tools/src/test/java
A         testing/tools/src/test/java/org
A         testing/tools/src/test/java/org/apache
A         testing/tools/src/test/java/org/apache/sling
A         testing/tools/src/test/java/org/apache/sling/testing
A         testing/tools/src/test/java/org/apache/sling/testing/tools
A         testing/tools/src/test/java/org/apache/sling/testing/tools/test
AU        testing/tools/src/test/java/org/apache/sling/testing/tools/test/TestServerSetup.java
AU        testing/tools/src/test/java/org/apache/sling/testing/tools/test/ServerSetupSingletonTest.java
AU        testing/tools/src/test/java/org/apache/sling/testing/tools/test/TestSetupPhase.java
A         testing/tools/src/test/java/org/apache/sling/testing/tools/sling
AU        testing/tools/src/test/java/org/apache/sling/testing/tools/sling/SlingClientTest.java
A         testing/tools/src/test/java/org/apache/sling/testing/tools/sling/SlingInstancesRuleTest.java
A         testing/tools/src/main
A         testing/tools/src/main/java
A         testing/tools/src/main/java/org
A         testing/tools/src/main/java/org/apache
A         testing/tools/src/main/java/org/apache/sling
A         testing/tools/src/main/java/org/apache/sling/testing
A         testing/tools/src/main/java/org/apache/sling/testing/tools
A         testing/tools/src/main/java/org/apache/sling/testing/tools/http
AU        testing/tools/src/main/java/org/apache/sling/testing/tools/http/Request.java
AU        testing/tools/src/main/java/org/apache/sling/testing/tools/http/RequestDocumentor.java
AU        testing/tools/src/main/java/org/apache/sling/testing/tools/http/RequestCustomizer.java
AU        testing/tools/src/main/java/org/apache/sling/testing/tools/http/RequestBuilder.java
AU        testing/tools/src/main/java/org/apache/sling/testing/tools/http/RetryingContentChecker.java
AU        testing/tools/src/main/java/org/apache/sling/testing/tools/http/package-info.java
AU        testing/tools/src/main/java/org/apache/sling/testing/tools/http/RequestExecutor.java
A         testing/tools/src/main/java/org/apache/sling/testing/tools/jarexec
AU        testing/tools/src/main/java/org/apache/sling/testing/tools/jarexec/JarExecutor.java
AU        testing/tools/src/main/java/org/apache/sling/testing/tools/jarexec/ShutdownHookSingleProcessDestroyer.java
AU        testing/tools/src/main/java/org/apache/sling/testing/tools/jarexec/package-info.java
A         testing/tools/src/main/java/org/apache/sling/testing/tools/osgi
AU        testing/tools/src/main/java/org/apache/sling/testing/tools/osgi/package-info.java
AU        testing/tools/src/main/java/org/apache/sling/testing/tools/osgi/WebconsoleClient.java
A         testing/tools/src/main/java/org/apache/sling/testing/tools/retry
AU        testing/tools/src/main/java/org/apache/sling/testing/tools/retry/package-info.java
AU        testing/tools/src/main/java/org/apache/sling/testing/tools/retry/RetryLoop.java
A         testing/tools/src/main/java/org/apache/sling/testing/tools/serversetup
AU        testing/tools/src/main/java/org/apache/sling/testing/tools/serversetup/ServerSetup.java
AU        testing/tools/src/main/java/org/apache/sling/testing/tools/serversetup/ServerSetupSingleton.java
AU        testing/tools/src/main/java/org/apache/sling/testing/tools/serversetup/SetupPhase.java
AU        testing/tools/src/main/java/org/apache/sling/testing/tools/serversetup/StartRunnableJarPhase.java
AU        testing/tools/src/main/java/org/apache/sling/testing/tools/serversetup/package-info.java
A         testing/tools/src/main/java/org/apache/sling/testing/tools/junit
AU        testing/tools/src/main/java/org/apache/sling/testing/tools/junit/package-info.java
AU        testing/tools/src/main/java/org/apache/sling/testing/tools/junit/RemoteLogDumper.java
A         testing/tools/src/main/java/org/apache/sling/testing/tools/junit/TestDescriptionRule.java
A         testing/tools/src/main/java/org/apache/sling/testing/tools/junit/TestNameLoggingFilter.java
A         testing/tools/src/main/java/org/apache/sling/testing/tools/junit/TestDescriptionInterceptor.java
A         testing/tools/src/main/java/org/apache/sling/testing/tools/sling
AU        testing/tools/src/main/java/org/apache/sling/testing/tools/sling/SlingClient.java
A         testing/tools/src/main/java/org/apache/sling/testing/tools/sling/SlingInstanceManager.java
A         testing/tools/src/main/java/org/apache/sling/testing/tools/sling/SlingInstancesRule.java
A         testing/tools/src/main/java/org/apache/sling/testing/tools/sling/SlingInstance.java
A         testing/tools/src/main/java/org/apache/sling/testing/tools/sling/SlingInstanceState.java
AU        testing/tools/src/main/java/org/apache/sling/testing/tools/sling/TimeoutsProvider.java
AU        testing/tools/src/main/java/org/apache/sling/testing/tools/sling/package-info.java
AU        testing/tools/src/main/java/org/apache/sling/testing/tools/sling/SlingTestBase.java
AU        testing/tools/src/main/java/org/apache/sling/testing/tools/sling/BundlesInstaller.java
AU        testing/tools/pom.xml
A         testing/samples
A         testing/samples/module-with-it
A         testing/samples/module-with-it/src
A         testing/samples/module-with-it/src/test
A         testing/samples/module-with-it/src/test/java
A         testing/samples/module-with-it/src/test/java/org
A         testing/samples/module-with-it/src/test/java/org/apache
A         testing/samples/module-with-it/src/test/java/org/apache/sling
A         testing/samples/module-with-it/src/test/java/org/apache/sling/testing
A         testing/samples/module-with-it/src/test/java/org/apache/sling/testing/samples
A         testing/samples/module-with-it/src/test/java/org/apache/sling/testing/samples/modulewit
AU        testing/samples/module-with-it/src/test/java/org/apache/sling/testing/samples/modulewit/BasicTeleportedIT.java
A         testing/samples/module-with-it/src/main
A         testing/samples/module-with-it/src/main/provisioning
AU        testing/samples/module-with-it/src/main/provisioning/model.txt
AU        testing/samples/module-with-it/pom.xml
A         testing/samples/module-with-it/.gitignore
A         testing/samples/bundle-with-it
A         testing/samples/bundle-with-it/pom.xml
A         testing/samples/bundle-with-it/src
A         testing/samples/bundle-with-it/src/test
A         testing/samples/bundle-with-it/src/test/java
A         testing/samples/bundle-with-it/src/test/java/org
A         testing/samples/bundle-with-it/src/test/java/org/apache
A         testing/samples/bundle-with-it/src/test/java/org/apache/sling
A         testing/samples/bundle-with-it/src/test/java/org/apache/sling/junit
A         testing/samples/bundle-with-it/src/test/java/org/apache/sling/junit/teleporter
A         testing/samples/bundle-with-it/src/test/java/org/apache/sling/junit/teleporter/customizers
A         testing/samples/bundle-with-it/src/test/java/org/apache/sling/junit/teleporter/customizers/BWIT_TeleporterCustomizer.java
A         testing/samples/bundle-with-it/src/test/java/org/apache/sling/testing
A         testing/samples/bundle-with-it/src/test/java/org/apache/sling/testing/samples
A         testing/samples/bundle-with-it/src/test/java/org/apache/sling/testing/samples/bundlewit
A         testing/samples/bundle-with-it/src/test/java/org/apache/sling/testing/samples/bundlewit/ResourceMimeTypeDetectorIT.java
A         testing/samples/bundle-with-it/src/test/java/org/apache/sling/testing/samples/bundlewit/MimeTypeServletHttpIT.java
A         testing/samples/bundle-with-it/src/test/java/org/apache/sling/testing/samples/bundlewit/MockResource.java
A         testing/samples/bundle-with-it/src/test/java/org/apache/sling/testing/samples/bundlewit/OsgiConsoleHttpIT.java
A         testing/samples/bundle-with-it/src/test/java/org/apache/sling/testing/samples/bundlewit/SampleUnitTest.java
A         testing/samples/bundle-with-it/src/test/java/org/apache/sling/testing/samples/bundlewit/FilterIT.java
A         testing/samples/bundle-with-it/src/test/java/org/apache/sling/testing/samples/bundlewit/BasicTeleportedIT.java
A         testing/samples/bundle-with-it/src/main
A         testing/samples/bundle-with-it/src/main/java
A         testing/samples/bundle-with-it/src/main/java/org
A         testing/samples/bundle-with-it/src/main/java/org/apache
A         testing/samples/bundle-with-it/src/main/java/org/apache/sling
A         testing/samples/bundle-with-it/src/main/java/org/apache/sling/testing
A         testing/samples/bundle-with-it/src/main/java/org/apache/sling/testing/samples
A         testing/samples/bundle-with-it/src/main/java/org/apache/sling/testing/samples/bundlewit
A         testing/samples/bundle-with-it/src/main/java/org/apache/sling/testing/samples/bundlewit/impl
A         testing/samples/bundle-with-it/src/main/java/org/apache/sling/testing/samples/bundlewit/impl/ResourceMimeTypeDetectorImpl.java
A         testing/samples/bundle-with-it/src/main/java/org/apache/sling/testing/samples/bundlewit/impl/MimeTypeServlet.java
A         testing/samples/bundle-with-it/src/main/java/org/apache/sling/testing/samples/bundlewit/api
A         testing/samples/bundle-with-it/src/main/java/org/apache/sling/testing/samples/bundlewit/api/ResourceMimeTypeDetector.java
A         testing/samples/bundle-with-it/src/main/java/org/apache/sling/testing/samples/bundlewit/api/package-info.java
A         testing/hamcrest
A         testing/hamcrest/src
A         testing/hamcrest/src/test
A         testing/hamcrest/src/test/java
A         testing/hamcrest/src/test/java/org
A         testing/hamcrest/src/test/java/org/apache
A         testing/hamcrest/src/test/java/org/apache/sling
A         testing/hamcrest/src/test/java/org/apache/sling/testing
A         testing/hamcrest/src/test/java/org/apache/sling/testing/hamcrest
AU        testing/hamcrest/src/test/java/org/apache/sling/testing/hamcrest/ResourceMatchersTest.java
A         testing/hamcrest/src/main
A         testing/hamcrest/src/main/java
A         testing/hamcrest/src/main/java/org
A         testing/hamcrest/src/main/java/org/apache
A         testing/hamcrest/src/main/java/org/apache/sling
A         testing/hamcrest/src/main/java/org/apache/sling/hamcrest
A         testing/hamcrest/src/main/java/org/apache/sling/hamcrest/matchers
AU        testing/hamcrest/src/main/java/org/apache/sling/hamcrest/matchers/ResourceNameMatcher.java
A         testing/hamcrest/src/main/java/org/apache/sling/hamcrest/matchers/ResourceChildrenMatcher.java
A         testing/hamcrest/src/main/java/org/apache/sling/hamcrest/matchers/ResourcePropertiesMatcher.java
A         testing/hamcrest/src/main/java/org/apache/sling/hamcrest/ResourceMatchers.java
A         testing/hamcrest/pom.xml
A         testing/serversetup
A         testing/serversetup/pom.xml
A         testing/serversetup/src
A         testing/serversetup/src/test
A         testing/serversetup/src/test/java
A         testing/serversetup/src/test/java/org
A         testing/serversetup/src/test/java/org/apache
A         testing/serversetup/src/test/java/org/apache/sling
A         testing/serversetup/src/test/java/org/apache/sling/testing
A         testing/serversetup/src/test/java/org/apache/sling/testing/serversetup
A         testing/serversetup/src/test/java/org/apache/sling/testing/serversetup/test
A         testing/serversetup/src/test/java/org/apache/sling/testing/serversetup/test/ServerSetupSingletonTest.java
A         testing/serversetup/src/test/java/org/apache/sling/testing/serversetup/test/TestSetupPhase.java
A         testing/serversetup/src/test/java/org/apache/sling/testing/serversetup/test/TestServerSetup.java
A         testing/serversetup/src/main
A         testing/serversetup/src/main/java
A         testing/serversetup/src/main/java/org
A         testing/serversetup/src/main/java/org/apache
A         testing/serversetup/src/main/java/org/apache/sling
A         testing/serversetup/src/main/java/org/apache/sling/testing
A         testing/serversetup/src/main/java/org/apache/sling/testing/serversetup
A         testing/serversetup/src/main/java/org/apache/sling/testing/serversetup/ServerSetup.java
A         testing/serversetup/src/main/java/org/apache/sling/testing/serversetup/ServerSetupSingleton.java
A         testing/serversetup/src/main/java/org/apache/sling/testing/serversetup/SetupPhase.java
A         testing/serversetup/src/main/java/org/apache/sling/testing/serversetup/jarexec
A         testing/serversetup/src/main/java/org/apache/sling/testing/serversetup/jarexec/JarExecutor.java
A         testing/serversetup/src/main/java/org/apache/sling/testing/serversetup/jarexec/ShutdownHookSingleProcessDestroyer.java
A         testing/serversetup/src/main/java/org/apache/sling/testing/serversetup/jarexec/package-info.java
A         testing/serversetup/src/main/java/org/apache/sling/testing/serversetup/StartRunnableJarPhase.java
A         testing/serversetup/src/main/java/org/apache/sling/testing/serversetup/instance
A         testing/serversetup/src/main/java/org/apache/sling/testing/serversetup/instance/package-info.java
A         testing/serversetup/src/main/java/org/apache/sling/testing/serversetup/instance/SlingTestBase.java
A         testing/serversetup/src/main/java/org/apache/sling/testing/serversetup/instance/SlingInstanceManager.java
A         testing/serversetup/src/main/java/org/apache/sling/testing/serversetup/instance/SlingInstancesRule.java
A         testing/serversetup/src/main/java/org/apache/sling/testing/serversetup/instance/SlingInstance.java
A         testing/serversetup/src/main/java/org/apache/sling/testing/serversetup/instance/SlingInstanceState.java
A         testing/serversetup/src/main/java/org/apache/sling/testing/serversetup/package-info.java
A         .mvn
A         .mvn/jvm.config
AU        NOTICE
AU        LICENSE
AU        check_release_matches_tag.sh
A         .travis.yml
A         src
A         src/misc
A         src/misc/sling-6-source-release.javadoc.patch
AU        src/misc/README.txt
A         src/main
A         src/main/javadoc
AU        src/main/javadoc/overview.html
 U        .
At revision 1750404

Parsing POMs
Downloaded artifact http://repo.maven.apache.org/maven2/org/apache/apache/17/apache-17.pom
Downloaded artifact http://repo.maven.apache.org/maven2/org/apache/sling/sling/26/sling-26.pom
Downloaded artifact http://repo.maven.apache.org/maven2/org/apache/sling/sling/25/sling-25.pom
ERROR: Failed to parse POMs
java.io.IOException: remote file operation failed: <https://builds.apache.org/job/sling-trunk-1.8/ws/trunk> at hudson.remoting.Channel@24ee8056:jenkins-test-593: hudson.remoting.ProxyException: hudson.maven.MavenModuleSetBuild$MavenExecutionException: org.apache.maven.project.ProjectBuildingException: Some problems were encountered while processing the POMs:
[FATAL] Non-resolvable parent POM: Could not find artifact org.apache.sling:sling:pom:27-SNAPSHOT and 'parent.relativePath' points at no local POM @ line 24, column 11

	at hudson.FilePath.act(FilePath.java:986)
	at hudson.FilePath.act(FilePath.java:968)
	at hudson.maven.MavenModuleSetBuild$MavenModuleSetBuildExecution.parsePoms(MavenModuleSetBuild.java:960)
	at hudson.maven.MavenModuleSetBuild$MavenModuleSetBuildExecution.doRun(MavenModuleSetBuild.java:679)
	at hudson.model.AbstractBuild$AbstractBuildExecution.run(AbstractBuild.java:534)
	at hudson.model.Run.execute(Run.java:1738)
	at hudson.maven.MavenModuleSetBuild.run(MavenModuleSetBuild.java:531)
	at hudson.model.ResourceController.execute(ResourceController.java:98)
	at hudson.model.Executor.run(Executor.java:410)
Caused by: hudson.remoting.ProxyException: hudson.maven.MavenModuleSetBuild$MavenExecutionException: org.apache.maven.project.ProjectBuildingException: Some problems were encountered while processing the POMs:
[FATAL] Non-resolvable parent POM: Could not find artifact org.apache.sling:sling:pom:27-SNAPSHOT and 'parent.relativePath' points at no local POM @ line 24, column 11

	at hudson.maven.MavenModuleSetBuild$PomParser.invoke(MavenModuleSetBuild.java:1364)
	at hudson.maven.MavenModuleSetBuild$PomParser.invoke(MavenModuleSetBuild.java:1098)
	at hudson.FilePath$FileCallableWrapper.call(FilePath.java:2719)
	at hudson.remoting.UserRequest.perform(UserRequest.java:120)
	at hudson.remoting.UserRequest.perform(UserRequest.java:48)
	at hudson.remoting.Request$2.run(Request.java:326)
	at hudson.remoting.InterceptingExecutorService$1.call(InterceptingExecutorService.java:68)
	at java.util.concurrent.FutureTask.run(FutureTask.java:262)
	at java.util.concurrent.ThreadPoolExecutor.runWorker(ThreadPoolExecutor.java:1145)
	at java.util.concurrent.ThreadPoolExecutor$Worker.run(ThreadPoolExecutor.java:615)
	at java.lang.Thread.run(Thread.java:745)
	at ......remote call to jenkins-test-593(Native Method)
	at hudson.remoting.Channel.attachCallSiteStackTrace(Channel.java:1416)
	at hudson.remoting.UserResponse.retrieve(UserRequest.java:220)
	at hudson.remoting.Channel.call(Channel.java:781)
	at hudson.FilePath.act(FilePath.java:979)
	... 8 more
Caused by: hudson.remoting.ProxyException: org.apache.maven.project.ProjectBuildingException: Some problems were encountered while processing the POMs:
[FATAL] Non-resolvable parent POM: Could not find artifact org.apache.sling:sling:pom:27-SNAPSHOT and 'parent.relativePath' points at no local POM @ line 24, column 11

	at org.apache.maven.project.DefaultProjectBuilder.build(DefaultProjectBuilder.java:364)
	at hudson.maven.MavenEmbedder.buildProjects(MavenEmbedder.java:361)
	at hudson.maven.MavenEmbedder.readProjects(MavenEmbedder.java:331)
	at hudson.maven.MavenModuleSetBuild$PomParser.invoke(MavenModuleSetBuild.java:1301)
	at hudson.maven.MavenModuleSetBuild$PomParser.invoke(MavenModuleSetBuild.java:1098)
	at hudson.FilePath$FileCallableWrapper.call(FilePath.java:2719)
	at hudson.remoting.UserRequest.perform(UserRequest.java:120)
	at hudson.remoting.UserRequest.perform(UserRequest.java:48)
	at hudson.remoting.Request$2.run(Request.java:326)
	at hudson.remoting.InterceptingExecutorService$1.call(InterceptingExecutorService.java:68)
	at java.util.concurrent.FutureTask.run(FutureTask.java:262)
	at java.util.concurrent.ThreadPoolExecutor.runWorker(ThreadPoolExecutor.java:1145)
	at java.util.concurrent.ThreadPoolExecutor$Worker.run(ThreadPoolExecutor.java:615)
	at java.lang.Thread.run(Thread.java:745)

Jenkins build is still unstable: sling-trunk-1.8 #3435

Posted by Apache Jenkins Server <je...@builds.apache.org>.
See <https://builds.apache.org/job/sling-trunk-1.8/changes>