You are viewing a plain text version of this content. The canonical link for it is here.
Posted to commits@flex.apache.org by fl...@gmail.com on 2015/03/22 13:41:12 UTC
rc_flex-sdk_mustella-mobile - Build # 164 - Still Failing!
rc_flex-sdk_mustella-mobile - Build # 164 - Still Failing:
http://flex-mustella.cloudapp.net/job/rc_flex-sdk_mustella-mobile/164/
Changes for Build #163
No changes
Changes for Build #164
No changes
--------------------------------
[...truncated 13161 lines...]
[java] post ApolloAdjuster: C:\jenkins_slave\workspace\rc_flex-sdk_mustella-mobile\mustella\tests\mobile\SkinnablePopUpContainer\swfs\SkinnablePopUpContainerApp.xml
[java] new test file: C:\jenkins_slave\workspace\rc_flex-sdk_mustella-mobile\mustella\tests\mobile\SkinnablePopUpContainer\swfs\SkinnablePopUpContainerApp.xml
[java] ******** cmdArr before:
[java] C:\ApacheFlex\dependencies\AdobeAIRSDK\3.7\bin\adl.exe
[java] C:\jenkins_slave\workspace\rc_flex-sdk_mustella-mobile\mustella\tests\mobile\SkinnablePopUpContainer\swfs\SkinnablePopUpContainerApp.xml
[java] ******** moreParameters before:
[java] -screensize
[java] 640x960:640x960
[java] -profile
[java] mobileDevice
[java] -XscreenDPI
[java] 240
[java] ******** cmdArr after:
[java] C:\ApacheFlex\dependencies\AdobeAIRSDK\3.7\bin\adl.exe
[java] C:\jenkins_slave\workspace\rc_flex-sdk_mustella-mobile\mustella\tests\mobile\SkinnablePopUpContainer\swfs\SkinnablePopUpContainerApp.xml
[java] -screensize
[java] 640x960:640x960
[java] -profile
[java] mobileDevice
[java] -XscreenDPI
[java] 240
[java] getting directory from the swf file
[java] derived directory: C:\jenkins_slave\workspace\rc_flex-sdk_mustella-mobile\mustella\tests\mobile\SkinnablePopUpContainer\swfs
[java] Launching:
[java] C:\ApacheFlex\dependencies\AdobeAIRSDK\3.7\bin\adl.exe C:\jenkins_slave\workspace\rc_flex-sdk_mustella-mobile\mustella\tests\mobile\SkinnablePopUpContainer\swfs\SkinnablePopUpContainerApp.xml -screensize 640x960:640x960 -profile mobileDevice -XscreenDPI 240 Launching: C:\ApacheFlex\dependencies\AdobeAIRSDK\3.7\bin\adl.exe C:\jenkins_slave\workspace\rc_flex-sdk_mustella-mobile\mustella\tests\mobile\SkinnablePopUpContainer\swfs\SkinnablePopUpContainerApp.xml
[java] USING directory: C:\jenkins_slave\workspace\rc_flex-sdk_mustella-mobile\mustella\tests\mobile\SkinnablePopUpContainer\swfs
[java] time: 07:34:15.890
[java] Total Results so far: 1
[java] SCRIPTDONE! 07:34:21.905
[java] GET /ScriptComplete?0 HTTP/1.1
[java] Before Wait loop 07:34:21.905 waiting = 0
[java] After Wait loop 07:34:21.905 waiting = 0
[java] clobberProcess false
[java] Total Results so far: 2
[java] waited 1700
[java] ClobberProcess, it was already null
[java] removing the xml app file
[java] Grab log, do parse = false
[java] Grabbing the log from: C:\Users\ApacheFlex\AppData/Roaming\Macromedia/Flash Player/Logs/flashlog.txt to: C:\jenkins_slave\workspace\rc_flex-sdk_mustella-mobile\mustella\tests\mobile\SkinnablePopUpContainer\swfs\SkinnablePopUpContainerApp.log
[java] apollo adj with : C:\jenkins_slave\workspace\rc_flex-sdk_mustella-mobile\mustella\tests\mobile\ViewAndViewNavigator\swfs\ViewAndViewNavigatorMainTabbed.swf
[java] apollo adj thinks it's a swf
[java] writing Apollo file!
[java] full swf is C:\jenkins_slave\workspace\rc_flex-sdk_mustella-mobile\mustella\tests\mobile\ViewAndViewNavigator\swfs\ViewAndViewNavigatorMainTabbed.swf
[java] post ApolloAdjuster: C:\jenkins_slave\workspace\rc_flex-sdk_mustella-mobile\mustella\tests\mobile\ViewAndViewNavigator\swfs\ViewAndViewNavigatorMainTabbed.xml
[java] new test file: C:\jenkins_slave\workspace\rc_flex-sdk_mustella-mobile\mustella\tests\mobile\ViewAndViewNavigator\swfs\ViewAndViewNavigatorMainTabbed.xml
[java] ******** cmdArr before:
[java] C:\ApacheFlex\dependencies\AdobeAIRSDK\3.7\bin\adl.exe
[java] C:\jenkins_slave\workspace\rc_flex-sdk_mustella-mobile\mustella\tests\mobile\ViewAndViewNavigator\swfs\ViewAndViewNavigatorMainTabbed.xml
[java] ******** moreParameters before:
[java] -screensize
[java] 640x960:640x960
[java] -profile
[java] mobileDevice
[java] -XscreenDPI
[java] 240
[java] ******** cmdArr after:
[java] C:\ApacheFlex\dependencies\AdobeAIRSDK\3.7\bin\adl.exe
[java] C:\jenkins_slave\workspace\rc_flex-sdk_mustella-mobile\mustella\tests\mobile\ViewAndViewNavigator\swfs\ViewAndViewNavigatorMainTabbed.xml
[java] -screensize
[java] 640x960:640x960
[java] -profile
[java] mobileDevice
[java] -XscreenDPI
[java] 240
[java] getting directory from the swf file
[java] derived directory: C:\jenkins_slave\workspace\rc_flex-sdk_mustella-mobile\mustella\tests\mobile\ViewAndViewNavigator\swfs
[java] Launching:
[java] C:\ApacheFlex\dependencies\AdobeAIRSDK\3.7\bin\adl.exe C:\jenkins_slave\workspace\rc_flex-sdk_mustella-mobile\mustella\tests\mobile\ViewAndViewNavigator\swfs\ViewAndViewNavigatorMainTabbed.xml -screensize 640x960:640x960 -profile mobileDevice -XscreenDPI 240 Launching: C:\ApacheFlex\dependencies\AdobeAIRSDK\3.7\bin\adl.exe C:\jenkins_slave\workspace\rc_flex-sdk_mustella-mobile\mustella\tests\mobile\ViewAndViewNavigator\swfs\ViewAndViewNavigatorMainTabbed.xml
[java] USING directory: C:\jenkins_slave\workspace\rc_flex-sdk_mustella-mobile\mustella\tests\mobile\ViewAndViewNavigator\swfs
[java] time: 07:34:23.971
[java] SCRIPTDONE! 07:34:30.153
[java] GET /ScriptComplete?0 HTTP/1.1
[java] Before Wait loop 07:34:30.153 waiting = 0
[java] After Wait loop 07:34:30.153 waiting = 0
[java] clobberProcess false
[java] Total Results so far: 4
[java] removing the xml app file
[java] Grab log, do parse = false
[java] Grabbing the log from: C:\Users\ApacheFlex\AppData/Roaming\Macromedia/Flash Player/Logs/flashlog.txt to: C:\jenkins_slave\workspace\rc_flex-sdk_mustella-mobile\mustella\tests\mobile\ViewAndViewNavigator\swfs\ViewAndViewNavigatorMainTabbed.log
[java] apollo adj with : C:\jenkins_slave\workspace\rc_flex-sdk_mustella-mobile\mustella\tests\mobile\components\ActionBar\swfs\ActionBar.swf
[java] apollo adj thinks it's a swf
[java] writing Apollo file!
[java] full swf is C:\jenkins_slave\workspace\rc_flex-sdk_mustella-mobile\mustella\tests\mobile\components\ActionBar\swfs\ActionBar.swf
[java] post ApolloAdjuster: C:\jenkins_slave\workspace\rc_flex-sdk_mustella-mobile\mustella\tests\mobile\components\ActionBar\swfs\ActionBar.xml
[java] new test file: C:\jenkins_slave\workspace\rc_flex-sdk_mustella-mobile\mustella\tests\mobile\components\ActionBar\swfs\ActionBar.xml
[java] ******** cmdArr before:
[java] C:\ApacheFlex\dependencies\AdobeAIRSDK\3.7\bin\adl.exe
[java] C:\jenkins_slave\workspace\rc_flex-sdk_mustella-mobile\mustella\tests\mobile\components\ActionBar\swfs\ActionBar.xml
[java] ******** moreParameters before:
[java] -screensize
[java] 640x960:640x960
[java] -profile
[java] mobileDevice
[java] -XscreenDPI
[java] 240
[java] ******** cmdArr after:
[java] C:\ApacheFlex\dependencies\AdobeAIRSDK\3.7\bin\adl.exe
[java] C:\jenkins_slave\workspace\rc_flex-sdk_mustella-mobile\mustella\tests\mobile\components\ActionBar\swfs\ActionBar.xml
[java] -screensize
[java] 640x960:640x960
[java] -profile
[java] mobileDevice
[java] -XscreenDPI
[java] 240
[java] getting directory from the swf file
[java] derived directory: C:\jenkins_slave\workspace\rc_flex-sdk_mustella-mobile\mustella\tests\mobile\components\ActionBar\swfs
[java] Launching:
[java] C:\ApacheFlex\dependencies\AdobeAIRSDK\3.7\bin\adl.exe C:\jenkins_slave\workspace\rc_flex-sdk_mustella-mobile\mustella\tests\mobile\components\ActionBar\swfs\ActionBar.xml -screensize 640x960:640x960 -profile mobileDevice -XscreenDPI 240 Launching: C:\ApacheFlex\dependencies\AdobeAIRSDK\3.7\bin\adl.exe C:\jenkins_slave\workspace\rc_flex-sdk_mustella-mobile\mustella\tests\mobile\components\ActionBar\swfs\ActionBar.xml
[java] USING directory: C:\jenkins_slave\workspace\rc_flex-sdk_mustella-mobile\mustella\tests\mobile\components\ActionBar\swfs
[java] time: 07:34:32.066
[java] waited 1600
[java] ClobberProcess, it was already null
[java] Wrote file: c:/jenkins_slave/workspace/rc_flex-sdk_mustella-mobile/mustella/tests/mobile/components/ActionBar/styles/baselines/ActionBar_TitleDisplay_TextDecoration@android_240ppi.png.bad.png.xml length: 41892
[java] Wrote file: c:/jenkins_slave/workspace/rc_flex-sdk_mustella-mobile/mustella/tests/mobile/components/ActionBar/styles/baselines/ActionBar_TitleDisplay_TextDecoration@android_240ppi.png.bad.png length: 2375
[java] FAIL: mobile/components/ActionBar/styles/ActionBar_Styles ActionBar_TitleDisplay_TextDecoration
[java] SCRIPTDONE! 07:34:38.872
[java] GET /ScriptComplete?0 HTTP/1.1
[java] Before Wait loop 07:34:38.872 waiting = 0
[java] After Wait loop 07:34:38.872 waiting = 0
[java] clobberProcess false
[java] Total Results so far: 5
[java] waited 1600
[java] ClobberProcess, it was already null
[java] removing the xml app file
[java] Grab log, do parse = false
[java] Grabbing the log from: C:\Users\ApacheFlex\AppData/Roaming\Macromedia/Flash Player/Logs/flashlog.txt to: C:\jenkins_slave\workspace\rc_flex-sdk_mustella-mobile\mustella\tests\mobile\components\ActionBar\swfs\ActionBar.log
[java] apollo adj with : C:\jenkins_slave\workspace\rc_flex-sdk_mustella-mobile\mustella\tests\mobile\components\ActionBar\swfs\ActionBarTest.swf
[java] apollo adj thinks it's a swf
[java] writing Apollo file!
[java] full swf is C:\jenkins_slave\workspace\rc_flex-sdk_mustella-mobile\mustella\tests\mobile\components\ActionBar\swfs\ActionBarTest.swf
[java] post ApolloAdjuster: C:\jenkins_slave\workspace\rc_flex-sdk_mustella-mobile\mustella\tests\mobile\components\ActionBar\swfs\ActionBarTest.xml
[java] new test file: C:\jenkins_slave\workspace\rc_flex-sdk_mustella-mobile\mustella\tests\mobile\components\ActionBar\swfs\ActionBarTest.xml
[java] ******** cmdArr before:
[java] C:\ApacheFlex\dependencies\AdobeAIRSDK\3.7\bin\adl.exe
[java] C:\jenkins_slave\workspace\rc_flex-sdk_mustella-mobile\mustella\tests\mobile\components\ActionBar\swfs\ActionBarTest.xml
[java] ******** moreParameters before:
[java] -screensize
[java] 640x960:640x960
[java] -profile
[java] mobileDevice
[java] -XscreenDPI
[java] 240
[java] ******** cmdArr after:
[java] C:\ApacheFlex\dependencies\AdobeAIRSDK\3.7\bin\adl.exe
[java] C:\jenkins_slave\workspace\rc_flex-sdk_mustella-mobile\mustella\tests\mobile\components\ActionBar\swfs\ActionBarTest.xml
[java] -screensize
[java] 640x960:640x960
[java] -profile
[java] mobileDevice
[java] -XscreenDPI
[java] 240
[java] getting directory from the swf file
[java] derived directory: C:\jenkins_slave\workspace\rc_flex-sdk_mustella-mobile\mustella\tests\mobile\components\ActionBar\swfs
[java] Launching:
[java] C:\ApacheFlex\dependencies\AdobeAIRSDK\3.7\bin\adl.exe C:\jenkins_slave\workspace\rc_flex-sdk_mustella-mobile\mustella\tests\mobile\components\ActionBar\swfs\ActionBarTest.xml -screensize 640x960:640x960 -profile mobileDevice -XscreenDPI 240 Launching: C:\ApacheFlex\dependencies\AdobeAIRSDK\3.7\bin\adl.exe C:\jenkins_slave\workspace\rc_flex-sdk_mustella-mobile\mustella\tests\mobile\components\ActionBar\swfs\ActionBarTest.xml
[java] USING directory: C:\jenkins_slave\workspace\rc_flex-sdk_mustella-mobile\mustella\tests\mobile\components\ActionBar\swfs
[java] time: 07:34:40.851
[java] SCRIPTDONE! 07:34:48.045
[java] GET /ScriptComplete?0 HTTP/1.1
[java] Before Wait loop 07:34:48.045 waiting = 0
[java] After Wait loop 07:34:48.045 waiting = 0
[java] clobberProcess false
[java] Total Results so far: 8
[java] removing the xml app file
[java] Grab log, do parse = false
[java] Grabbing the log from: C:\Users\ApacheFlex\AppData/Roaming\Macromedia/Flash Player/Logs/flashlog.txt to: C:\jenkins_slave\workspace\rc_flex-sdk_mustella-mobile\mustella\tests\mobile\components\ActionBar\swfs\ActionBarTest.log
[java] at the end of main
[java] Shutting down the results server
[java] shutting down the baseline server
[java] done waiting for results...bye
[java] =====================================================
[java] Passes: 6
[java] Fails: 2
[java] =====================================================
[java]
[java] =====================================================
[java] =====================================================
[java] Passed:
[java] =====================================================
[java] mobile/SkinnablePopUpContainer/tests/SpucProperties isModal Passed
[java] mobile/ViewAndViewNavigator/tests/ViewAndViewNavigator_orientationTabbed orientationStatesUnDefinedActionBarOverlayLeftTabbed Passed
[java] mobile/ViewAndViewNavigator/tests/ViewAndViewNavigator_orientationTabbed orientationStatesUnDefinedActionBarOverlayRightTabbed Passed
[java] mobile/components/ActionBar/properties/ActionBar_ViewNavigator_Properties ActionBar_ViewNavigator_titleLayout_vertical Passed
[java] mobile/components/ActionBar/properties/ActionBar_ViewNavigator_Properties ActionBar_ViewNavigator_titleLayout_tile Passed
[java] mobile/components/ActionBar/properties/ActionBar_ViewNavigator_Properties ActionBar_ViewNavigator_titleLayout_basic Passed
[java] =====================================================
[java] Failed:
[java] =====================================================
[java] C:\jenkins_slave\workspace\rc_flex-sdk_mustella-mobile\mustella\tests\mobile\CSSMediaQueries\swfs\ClassSelectorApp.xml Failed Timed out
[java] mobile/components/ActionBar/styles/ActionBar_Styles ActionBar_TitleDisplay_TextDecoration Failed CompareBitmap(body:step 2) compare returned[object BitmapData]
[java]
[java]
[java] =====================================================
[java] Passes: 6
[java] Fails: 2
[java] =====================================================
[java]
[java]
[java] Wrote summary to results.txt
[java] Wrote failures to failures.txt
BUILD FAILED
C:\jenkins_slave\workspace\rc_flex-sdk_mustella-mobile\mustella\build.xml:1547: The following error occurred while executing this line:
C:\jenkins_slave\workspace\rc_flex-sdk_mustella-mobile\mustella\build.xml:1665: Java returned: 1
Total time: 3 minutes 17 seconds
waited 1600
ClobberProcess, it was already null
============ JENKINS MUSTELLA RUN REPORT ============
Date/Time: 03-22-2015 12:34
Run duration: 0 days 1 hours 51 mins 15 seconds
Settings:
player.version = 11.1
air.version = 3.7
FLASHPLAYER_DEBUGGER = C:\ApacheFlex\dependencies\FlashPlayer_Debug\flashplayer11_1r102_55_win_sa_debug_32bit.exe
AIR_HOME = C:\ApacheFlex\dependencies\AdobeAIRSDK\3.7
Build:
type = mobile
command = -mobile
set = tests/mobile
Log:
- Made Cygwin ignore carriage returns
- Set FLASH_VERSION to '11.1' and AIR_VERSION to '3.7'
- Set AIR_HOME to 'C:\ApacheFlex\dependencies\AdobeAIRSDK\3.7'
- Set FLASHPLAYER_DEBUGGER to 'C:\ApacheFlex\dependencies\FlashPlayer_Debug\flashplayer11_1r102_55_win_sa_debug_32bit.exe'
- Cleaned up 'local.properties' files from previous runs
- Created fresh 'local.properties' files with containing run specific values
- Ran 'clean', 'main' and 'other.locales' ant targets to prepare the SDK for testing
- Ran Mustella on the SDK with these parameters: '-mobile tests/mobile'
- Some tests failed: running '-failures'
- Some of tests failed, even after running '-failures'...
=====================================================
Build step 'Execute shell' marked build as failure
Archiving artifacts
Email was triggered for: Failure - Any
Sending email for trigger: Failure - Any
(sent from ext-email)
rc_flex-sdk_mustella-mobile - Build # 166 - Fixed!
Posted by fl...@gmail.com.
rc_flex-sdk_mustella-mobile - Build # 166 - Fixed:
http://flex-mustella.cloudapp.net/job/rc_flex-sdk_mustella-mobile/166/
Changes for Build #163
No changes
Changes for Build #164
No changes
Changes for Build #165
No changes
Changes for Build #166
[erik] Fix minor version number issue
--------------------------------
[...truncated 8068 lines...]
[java] ******** cmdArr before:
[java] C:\ApacheFlex\dependencies\AdobeAIRSDK\4.0\bin\adl.exe
[java] C:\jenkins_slave\workspace\rc_flex-sdk_mustella-mobile\mustella\tests\mobile\transitions\ViewTransition\swfs\TabbedViewTransition.xml
[java] ******** moreParameters before:
[java] -screensize
[java] 640x960:640x960
[java] -profile
[java] mobileDevice
[java] -XscreenDPI
[java] 240
[java] ******** cmdArr after:
[java] C:\ApacheFlex\dependencies\AdobeAIRSDK\4.0\bin\adl.exe
[java] C:\jenkins_slave\workspace\rc_flex-sdk_mustella-mobile\mustella\tests\mobile\transitions\ViewTransition\swfs\TabbedViewTransition.xml
[java] -screensize
[java] 640x960:640x960
[java] -profile
[java] mobileDevice
[java] -XscreenDPI
[java] 240
[java] getting directory from the swf file
[java] derived directory: C:\jenkins_slave\workspace\rc_flex-sdk_mustella-mobile\mustella\tests\mobile\transitions\ViewTransition\swfs
[java] Launching:
[java] C:\ApacheFlex\dependencies\AdobeAIRSDK\4.0\bin\adl.exe C:\jenkins_slave\workspace\rc_flex-sdk_mustella-mobile\mustella\tests\mobile\transitions\ViewTransition\swfs\TabbedViewTransition.xml -screensize 640x960:640x960 -profile mobileDevice -XscreenDPI 240 Launching: C:\ApacheFlex\dependencies\AdobeAIRSDK\4.0\bin\adl.exe C:\jenkins_slave\workspace\rc_flex-sdk_mustella-mobile\mustella\tests\mobile\transitions\ViewTransition\swfs\TabbedViewTransition.xml
[java] USING directory: C:\jenkins_slave\workspace\rc_flex-sdk_mustella-mobile\mustella\tests\mobile\transitions\ViewTransition\swfs
[java] time: 07:30:34.045
[java] Total Results so far: 0
[java] removing the xml app file
[java] Grab log, do parse = false
[java] Grabbing the log from: C:\Users\ApacheFlex\AppData/Roaming\Macromedia/Flash Player/Logs/flashlog.txt to: C:\jenkins_slave\workspace\rc_flex-sdk_mustella-mobile\mustella\tests\mobile\transitions\ViewTransition\swfs\TabbedViewTransition.log
[java] Grablog: never saw the ScriptDone for C:\jenkins_slave\workspace\rc_flex-sdk_mustella-mobile\mustella\tests\mobile\transitions\ViewTransition\swfs\TabbedViewTransition.swf
[java] apollo adj with : C:\jenkins_slave\workspace\rc_flex-sdk_mustella-mobile\mustella\tests\mobile\transitions\ViewTransition\swfs\ViewTransition.swf
[java] apollo adj thinks it's a swf
[java] writing Apollo file!
[java] full swf is C:\jenkins_slave\workspace\rc_flex-sdk_mustella-mobile\mustella\tests\mobile\transitions\ViewTransition\swfs\ViewTransition.swf
[java] post ApolloAdjuster: C:\jenkins_slave\workspace\rc_flex-sdk_mustella-mobile\mustella\tests\mobile\transitions\ViewTransition\swfs\ViewTransition.xml
[java] new test file: C:\jenkins_slave\workspace\rc_flex-sdk_mustella-mobile\mustella\tests\mobile\transitions\ViewTransition\swfs\ViewTransition.xml
[java] ******** cmdArr before:
[java] C:\ApacheFlex\dependencies\AdobeAIRSDK\4.0\bin\adl.exe
[java] C:\jenkins_slave\workspace\rc_flex-sdk_mustella-mobile\mustella\tests\mobile\transitions\ViewTransition\swfs\ViewTransition.xml
[java] ******** moreParameters before:
[java] -screensize
[java] 640x960:640x960
[java] -profile
[java] mobileDevice
[java] -XscreenDPI
[java] 240
[java] ******** cmdArr after:
[java] C:\ApacheFlex\dependencies\AdobeAIRSDK\4.0\bin\adl.exe
[java] C:\jenkins_slave\workspace\rc_flex-sdk_mustella-mobile\mustella\tests\mobile\transitions\ViewTransition\swfs\ViewTransition.xml
[java] -screensize
[java] 640x960:640x960
[java] -profile
[java] mobileDevice
[java] -XscreenDPI
[java] 240
[java] getting directory from the swf file
[java] derived directory: C:\jenkins_slave\workspace\rc_flex-sdk_mustella-mobile\mustella\tests\mobile\transitions\ViewTransition\swfs
[java] Launching:
[java] C:\ApacheFlex\dependencies\AdobeAIRSDK\4.0\bin\adl.exe C:\jenkins_slave\workspace\rc_flex-sdk_mustella-mobile\mustella\tests\mobile\transitions\ViewTransition\swfs\ViewTransition.xml -screensize 640x960:640x960 -profile mobileDevice -XscreenDPI 240 Launching: C:\ApacheFlex\dependencies\AdobeAIRSDK\4.0\bin\adl.exe C:\jenkins_slave\workspace\rc_flex-sdk_mustella-mobile\mustella\tests\mobile\transitions\ViewTransition\swfs\ViewTransition.xml
[java] USING directory: C:\jenkins_slave\workspace\rc_flex-sdk_mustella-mobile\mustella\tests\mobile\transitions\ViewTransition\swfs
[java] time: 07:30:34.432
[java] Total Results so far: 0
[java] removing the xml app file
[java] Grab log, do parse = false
[java] Grabbing the log from: C:\Users\ApacheFlex\AppData/Roaming\Macromedia/Flash Player/Logs/flashlog.txt to: C:\jenkins_slave\workspace\rc_flex-sdk_mustella-mobile\mustella\tests\mobile\transitions\ViewTransition\swfs\ViewTransition.log
[java] Grablog: never saw the ScriptDone for C:\jenkins_slave\workspace\rc_flex-sdk_mustella-mobile\mustella\tests\mobile\transitions\ViewTransition\swfs\ViewTransition.swf
[java] apollo adj with : C:\jenkins_slave\workspace\rc_flex-sdk_mustella-mobile\mustella\tests\mobile\utils\MultiDPIBitmapSource\swfs\MultiDPIBitmapSourceInteg.swf
[java] apollo adj thinks it's a swf
[java] writing Apollo file!
[java] full swf is C:\jenkins_slave\workspace\rc_flex-sdk_mustella-mobile\mustella\tests\mobile\utils\MultiDPIBitmapSource\swfs\MultiDPIBitmapSourceInteg.swf
[java] post ApolloAdjuster: C:\jenkins_slave\workspace\rc_flex-sdk_mustella-mobile\mustella\tests\mobile\utils\MultiDPIBitmapSource\swfs\MultiDPIBitmapSourceInteg.xml
[java] new test file: C:\jenkins_slave\workspace\rc_flex-sdk_mustella-mobile\mustella\tests\mobile\utils\MultiDPIBitmapSource\swfs\MultiDPIBitmapSourceInteg.xml
[java] ******** cmdArr before:
[java] C:\ApacheFlex\dependencies\AdobeAIRSDK\4.0\bin\adl.exe
[java] C:\jenkins_slave\workspace\rc_flex-sdk_mustella-mobile\mustella\tests\mobile\utils\MultiDPIBitmapSource\swfs\MultiDPIBitmapSourceInteg.xml
[java] ******** moreParameters before:
[java] -screensize
[java] 640x960:640x960
[java] -profile
[java] mobileDevice
[java] -XscreenDPI
[java] 240
[java] ******** cmdArr after:
[java] C:\ApacheFlex\dependencies\AdobeAIRSDK\4.0\bin\adl.exe
[java] C:\jenkins_slave\workspace\rc_flex-sdk_mustella-mobile\mustella\tests\mobile\utils\MultiDPIBitmapSource\swfs\MultiDPIBitmapSourceInteg.xml
[java] -screensize
[java] 640x960:640x960
[java] -profile
[java] mobileDevice
[java] -XscreenDPI
[java] 240
[java] getting directory from the swf file
[java] derived directory: C:\jenkins_slave\workspace\rc_flex-sdk_mustella-mobile\mustella\tests\mobile\utils\MultiDPIBitmapSource\swfs
[java] Launching:
[java] C:\ApacheFlex\dependencies\AdobeAIRSDK\4.0\bin\adl.exe C:\jenkins_slave\workspace\rc_flex-sdk_mustella-mobile\mustella\tests\mobile\utils\MultiDPIBitmapSource\swfs\MultiDPIBitmapSourceInteg.xml -screensize 640x960:640x960 -profile mobileDevice -XscreenDPI 240 Launching: C:\ApacheFlex\dependencies\AdobeAIRSDK\4.0\bin\adl.exe C:\jenkins_slave\workspace\rc_flex-sdk_mustella-mobile\mustella\tests\mobile\utils\MultiDPIBitmapSource\swfs\MultiDPIBitmapSourceInteg.xml
[java] USING directory: C:\jenkins_slave\workspace\rc_flex-sdk_mustella-mobile\mustella\tests\mobile\utils\MultiDPIBitmapSource\swfs
[java] time: 07:30:34.917
[java] Total Results so far: 0
[java] removing the xml app file
[java] Grab log, do parse = false
[java] Grabbing the log from: C:\Users\ApacheFlex\AppData/Roaming\Macromedia/Flash Player/Logs/flashlog.txt to: C:\jenkins_slave\workspace\rc_flex-sdk_mustella-mobile\mustella\tests\mobile\utils\MultiDPIBitmapSource\swfs\MultiDPIBitmapSourceInteg.log
[java] Grablog: never saw the ScriptDone for C:\jenkins_slave\workspace\rc_flex-sdk_mustella-mobile\mustella\tests\mobile\utils\MultiDPIBitmapSource\swfs\MultiDPIBitmapSourceInteg.swf
[java] apollo adj with : C:\jenkins_slave\workspace\rc_flex-sdk_mustella-mobile\mustella\tests\mobile\utils\MultiDPIBitmapSource\swfs\MultiDPIBitmapSourceMain.swf
[java] apollo adj thinks it's a swf
[java] writing Apollo file!
[java] full swf is C:\jenkins_slave\workspace\rc_flex-sdk_mustella-mobile\mustella\tests\mobile\utils\MultiDPIBitmapSource\swfs\MultiDPIBitmapSourceMain.swf
[java] post ApolloAdjuster: C:\jenkins_slave\workspace\rc_flex-sdk_mustella-mobile\mustella\tests\mobile\utils\MultiDPIBitmapSource\swfs\MultiDPIBitmapSourceMain.xml
[java] new test file: C:\jenkins_slave\workspace\rc_flex-sdk_mustella-mobile\mustella\tests\mobile\utils\MultiDPIBitmapSource\swfs\MultiDPIBitmapSourceMain.xml
[java] ******** cmdArr before:
[java] C:\ApacheFlex\dependencies\AdobeAIRSDK\4.0\bin\adl.exe
[java] C:\jenkins_slave\workspace\rc_flex-sdk_mustella-mobile\mustella\tests\mobile\utils\MultiDPIBitmapSource\swfs\MultiDPIBitmapSourceMain.xml
[java] ******** moreParameters before:
[java] -screensize
[java] 640x960:640x960
[java] -profile
[java] mobileDevice
[java] -XscreenDPI
[java] 240
[java] ******** cmdArr after:
[java] C:\ApacheFlex\dependencies\AdobeAIRSDK\4.0\bin\adl.exe
[java] C:\jenkins_slave\workspace\rc_flex-sdk_mustella-mobile\mustella\tests\mobile\utils\MultiDPIBitmapSource\swfs\MultiDPIBitmapSourceMain.xml
[java] -screensize
[java] 640x960:640x960
[java] -profile
[java] mobileDevice
[java] -XscreenDPI
[java] 240
[java] getting directory from the swf file
[java] derived directory: C:\jenkins_slave\workspace\rc_flex-sdk_mustella-mobile\mustella\tests\mobile\utils\MultiDPIBitmapSource\swfs
[java] Launching:
[java] C:\ApacheFlex\dependencies\AdobeAIRSDK\4.0\bin\adl.exe C:\jenkins_slave\workspace\rc_flex-sdk_mustella-mobile\mustella\tests\mobile\utils\MultiDPIBitmapSource\swfs\MultiDPIBitmapSourceMain.xml -screensize 640x960:640x960 -profile mobileDevice -XscreenDPI 240 Launching: C:\ApacheFlex\dependencies\AdobeAIRSDK\4.0\bin\adl.exe C:\jenkins_slave\workspace\rc_flex-sdk_mustella-mobile\mustella\tests\mobile\utils\MultiDPIBitmapSource\swfs\MultiDPIBitmapSourceMain.xml
[java] USING directory: C:\jenkins_slave\workspace\rc_flex-sdk_mustella-mobile\mustella\tests\mobile\utils\MultiDPIBitmapSource\swfs
[java] time: 07:30:35.358
[java] Total Results so far: 0
[java] removing the xml app file
[java] Grab log, do parse = false
[java] Grabbing the log from: C:\Users\ApacheFlex\AppData/Roaming\Macromedia/Flash Player/Logs/flashlog.txt to: C:\jenkins_slave\workspace\rc_flex-sdk_mustella-mobile\mustella\tests\mobile\utils\MultiDPIBitmapSource\swfs\MultiDPIBitmapSourceMain.log
[java] Grablog: never saw the ScriptDone for C:\jenkins_slave\workspace\rc_flex-sdk_mustella-mobile\mustella\tests\mobile\utils\MultiDPIBitmapSource\swfs\MultiDPIBitmapSourceMain.swf
[java] apollo adj with : C:\jenkins_slave\workspace\rc_flex-sdk_mustella-mobile\mustella\tests\mobile\utils\MultiDPIBitmapSource\swfs\MultiDPIBitmapSourceScaling.swf
[java] apollo adj thinks it's a swf
[java] writing Apollo file!
[java] full swf is C:\jenkins_slave\workspace\rc_flex-sdk_mustella-mobile\mustella\tests\mobile\utils\MultiDPIBitmapSource\swfs\MultiDPIBitmapSourceScaling.swf
[java] post ApolloAdjuster: C:\jenkins_slave\workspace\rc_flex-sdk_mustella-mobile\mustella\tests\mobile\utils\MultiDPIBitmapSource\swfs\MultiDPIBitmapSourceScaling.xml
[java] new test file: C:\jenkins_slave\workspace\rc_flex-sdk_mustella-mobile\mustella\tests\mobile\utils\MultiDPIBitmapSource\swfs\MultiDPIBitmapSourceScaling.xml
[java] ******** cmdArr before:
[java] C:\ApacheFlex\dependencies\AdobeAIRSDK\4.0\bin\adl.exe
[java] C:\jenkins_slave\workspace\rc_flex-sdk_mustella-mobile\mustella\tests\mobile\utils\MultiDPIBitmapSource\swfs\MultiDPIBitmapSourceScaling.xml
[java] ******** moreParameters before:
[java] -screensize
[java] 640x960:640x960
[java] -profile
[java] mobileDevice
[java] -XscreenDPI
[java] 240
[java] ******** cmdArr after:
[java] C:\ApacheFlex\dependencies\AdobeAIRSDK\4.0\bin\adl.exe
[java] C:\jenkins_slave\workspace\rc_flex-sdk_mustella-mobile\mustella\tests\mobile\utils\MultiDPIBitmapSource\swfs\MultiDPIBitmapSourceScaling.xml
[java] -screensize
[java] 640x960:640x960
[java] -profile
[java] mobileDevice
[java] -XscreenDPI
[java] 240
[java] getting directory from the swf file
[java] derived directory: C:\jenkins_slave\workspace\rc_flex-sdk_mustella-mobile\mustella\tests\mobile\utils\MultiDPIBitmapSource\swfs
[java] Launching:
[java] C:\ApacheFlex\dependencies\AdobeAIRSDK\4.0\bin\adl.exe C:\jenkins_slave\workspace\rc_flex-sdk_mustella-mobile\mustella\tests\mobile\utils\MultiDPIBitmapSource\swfs\MultiDPIBitmapSourceScaling.xml -screensize 640x960:640x960 -profile mobileDevice -XscreenDPI 240 Launching: C:\ApacheFlex\dependencies\AdobeAIRSDK\4.0\bin\adl.exe C:\jenkins_slave\workspace\rc_flex-sdk_mustella-mobile\mustella\tests\mobile\utils\MultiDPIBitmapSource\swfs\MultiDPIBitmapSourceScaling.xml
[java] USING directory: C:\jenkins_slave\workspace\rc_flex-sdk_mustella-mobile\mustella\tests\mobile\utils\MultiDPIBitmapSource\swfs
[java] time: 07:30:35.798
[java] Total Results so far: 0
[java] removing the xml app file
[java] Grab log, do parse = false
[java] Grabbing the log from: C:\Users\ApacheFlex\AppData/Roaming\Macromedia/Flash Player/Logs/flashlog.txt to: C:\jenkins_slave\workspace\rc_flex-sdk_mustella-mobile\mustella\tests\mobile\utils\MultiDPIBitmapSource\swfs\MultiDPIBitmapSourceScaling.log
[java] Grablog: never saw the ScriptDone for C:\jenkins_slave\workspace\rc_flex-sdk_mustella-mobile\mustella\tests\mobile\utils\MultiDPIBitmapSource\swfs\MultiDPIBitmapSourceScaling.swf
[java] at the end of main
[java] Shutting down the results server
[java] shutting down the baseline server
[java] done waiting for results...bye
[java] =====================================================
[java] Passes: 0
[java] Fails: 0
[java] =====================================================
[java]
[java] =====================================================
[java] =====================================================
[java] Passed:
[java] =====================================================
[java] =====================================================
[java] Failed:
[java] =====================================================
[java]
[java]
[java] =====================================================
[java] Passes: 0
[java] Fails: 0
[java] =====================================================
[java]
[java]
[java] Wrote summary to results.txt
[java] Wrote failures to failures.txt
call_runners:
run:
BUILD SUCCESSFUL
Total time: 16 minutes 23 seconds
============ JENKINS MUSTELLA RUN REPORT ============
Date/Time: 03-23-2015 12:30
Run duration: 0 days 0 hours 44 mins 23 seconds
Settings:
player.version = 13.0
air.version = 4.0
FLASHPLAYER_DEBUGGER = C:\ApacheFlex\dependencies\FlashPlayer_Debug\flashplayer13_0r0_214_win_sa_debug.exe
AIR_HOME = C:\ApacheFlex\dependencies\AdobeAIRSDK\4.0
Build:
type = mobile
command = -mobile
set = tests/mobile
Log:
- Made Cygwin ignore carriage returns
- Set FLASH_VERSION to '13.0' and AIR_VERSION to '4.0'
- Set AIR_HOME to 'C:\ApacheFlex\dependencies\AdobeAIRSDK\4.0'
- Set FLASHPLAYER_DEBUGGER to 'C:\ApacheFlex\dependencies\FlashPlayer_Debug\flashplayer13_0r0_214_win_sa_debug.exe'
- Cleaned up 'local.properties' files from previous runs
- Created fresh 'local.properties' files with containing run specific values
- Ran 'clean', 'main' and 'other.locales' ant targets to prepare the SDK for testing
- Ran Mustella on the SDK with these parameters: '-mobile tests/mobile'
- All tests passed on the first run
=====================================================
Archiving artifacts
WARN: No artifacts found that match the file pattern "mustella/tests/**/*.bad.png*". Configuration error?
WARN: java.lang.InterruptedException: no matches found within 10000
Email was triggered for: Fixed
Trigger Success was overridden by another trigger and will not send an email.
Sending email for trigger: Fixed
(sent from ext-email)
rc_flex-sdk_mustella-mobile - Build # 165 - Still Failing!
Posted by fl...@gmail.com.
rc_flex-sdk_mustella-mobile - Build # 165 - Still Failing:
http://flex-mustella.cloudapp.net/job/rc_flex-sdk_mustella-mobile/165/
Changes for Build #163
No changes
Changes for Build #164
No changes
Changes for Build #165
No changes
--------------------------------
[...truncated 13065 lines...]
[java] apollo adj with : C:\jenkins_slave\workspace\rc_flex-sdk_mustella-mobile\mustella\tests\mobile\SkinnablePopUpContainer\swfs\SkinnablePopUpContainerApp.swf
[java] apollo adj thinks it's a swf
[java] writing Apollo file!
[java] full swf is C:\jenkins_slave\workspace\rc_flex-sdk_mustella-mobile\mustella\tests\mobile\SkinnablePopUpContainer\swfs\SkinnablePopUpContainerApp.swf
[java] post ApolloAdjuster: C:\jenkins_slave\workspace\rc_flex-sdk_mustella-mobile\mustella\tests\mobile\SkinnablePopUpContainer\swfs\SkinnablePopUpContainerApp.xml
[java] new test file: C:\jenkins_slave\workspace\rc_flex-sdk_mustella-mobile\mustella\tests\mobile\SkinnablePopUpContainer\swfs\SkinnablePopUpContainerApp.xml
[java] ******** cmdArr before:
[java] C:\ApacheFlex\dependencies\AdobeAIRSDK\3.7\bin\adl.exe
[java] C:\jenkins_slave\workspace\rc_flex-sdk_mustella-mobile\mustella\tests\mobile\SkinnablePopUpContainer\swfs\SkinnablePopUpContainerApp.xml
[java] ******** moreParameters before:
[java] -screensize
[java] 640x960:640x960
[java] -profile
[java] mobileDevice
[java] -XscreenDPI
[java] 240
[java] ******** cmdArr after:
[java] C:\ApacheFlex\dependencies\AdobeAIRSDK\3.7\bin\adl.exe
[java] C:\jenkins_slave\workspace\rc_flex-sdk_mustella-mobile\mustella\tests\mobile\SkinnablePopUpContainer\swfs\SkinnablePopUpContainerApp.xml
[java] -screensize
[java] 640x960:640x960
[java] -profile
[java] mobileDevice
[java] -XscreenDPI
[java] 240
[java] getting directory from the swf file
[java] derived directory: C:\jenkins_slave\workspace\rc_flex-sdk_mustella-mobile\mustella\tests\mobile\SkinnablePopUpContainer\swfs
[java] Launching:
[java] C:\ApacheFlex\dependencies\AdobeAIRSDK\3.7\bin\adl.exe C:\jenkins_slave\workspace\rc_flex-sdk_mustella-mobile\mustella\tests\mobile\SkinnablePopUpContainer\swfs\SkinnablePopUpContainerApp.xml -screensize 640x960:640x960 -profile mobileDevice -XscreenDPI 240 Launching: C:\ApacheFlex\dependencies\AdobeAIRSDK\3.7\bin\adl.exe C:\jenkins_slave\workspace\rc_flex-sdk_mustella-mobile\mustella\tests\mobile\SkinnablePopUpContainer\swfs\SkinnablePopUpContainerApp.xml
[java] USING directory: C:\jenkins_slave\workspace\rc_flex-sdk_mustella-mobile\mustella\tests\mobile\SkinnablePopUpContainer\swfs
[java] time: 19:51:49.960
[java] Firing Meta Timeout for process start after 12000 millis at: 19:52:01.992
[java] clobberProcess true
[java] ClobberProcess, destroying process
[java] unpacked result: C:\jenkins_slave\workspace\rc_flex-sdk_mustella-mobile\mustella\tests\mobile\SkinnablePopUpContainer\swfs\SkinnablePopUpContainerApp.xml Failed Timed out 0 Sun Mar 22 19:51:50 ACT 2015 0.0
[java] removing the xml app file
[java] Grab log, do parse = false
[java] Grabbing the log from: C:\Users\ApacheFlex\AppData/Roaming\Macromedia/Flash Player/Logs/flashlog.txt to: C:\jenkins_slave\workspace\rc_flex-sdk_mustella-mobile\mustella\tests\mobile\SkinnablePopUpContainer\swfs\SkinnablePopUpContainerApp.log
[java] Grablog: never saw the ScriptDone for C:\jenkins_slave\workspace\rc_flex-sdk_mustella-mobile\mustella\tests\mobile\SkinnablePopUpContainer\swfs\SkinnablePopUpContainerApp.swf
[java] apollo adj with : C:\jenkins_slave\workspace\rc_flex-sdk_mustella-mobile\mustella\tests\mobile\ViewAndViewNavigator\swfs\ViewAndViewNavigatorMainTabbed.swf
[java] apollo adj thinks it's a swf
[java] writing Apollo file!
[java] full swf is C:\jenkins_slave\workspace\rc_flex-sdk_mustella-mobile\mustella\tests\mobile\ViewAndViewNavigator\swfs\ViewAndViewNavigatorMainTabbed.swf
[java] post ApolloAdjuster: C:\jenkins_slave\workspace\rc_flex-sdk_mustella-mobile\mustella\tests\mobile\ViewAndViewNavigator\swfs\ViewAndViewNavigatorMainTabbed.xml
[java] new test file: C:\jenkins_slave\workspace\rc_flex-sdk_mustella-mobile\mustella\tests\mobile\ViewAndViewNavigator\swfs\ViewAndViewNavigatorMainTabbed.xml
[java] ******** cmdArr before:
[java] C:\ApacheFlex\dependencies\AdobeAIRSDK\3.7\bin\adl.exe
[java] C:\jenkins_slave\workspace\rc_flex-sdk_mustella-mobile\mustella\tests\mobile\ViewAndViewNavigator\swfs\ViewAndViewNavigatorMainTabbed.xml
[java] ******** moreParameters before:
[java] -screensize
[java] 640x960:640x960
[java] -profile
[java] mobileDevice
[java] -XscreenDPI
[java] 240
[java] ******** cmdArr after:
[java] C:\ApacheFlex\dependencies\AdobeAIRSDK\3.7\bin\adl.exe
[java] C:\jenkins_slave\workspace\rc_flex-sdk_mustella-mobile\mustella\tests\mobile\ViewAndViewNavigator\swfs\ViewAndViewNavigatorMainTabbed.xml
[java] -screensize
[java] 640x960:640x960
[java] -profile
[java] mobileDevice
[java] -XscreenDPI
[java] 240
[java] getting directory from the swf file
[java] derived directory: C:\jenkins_slave\workspace\rc_flex-sdk_mustella-mobile\mustella\tests\mobile\ViewAndViewNavigator\swfs
[java] Launching:
[java] C:\ApacheFlex\dependencies\AdobeAIRSDK\3.7\bin\adl.exe C:\jenkins_slave\workspace\rc_flex-sdk_mustella-mobile\mustella\tests\mobile\ViewAndViewNavigator\swfs\ViewAndViewNavigatorMainTabbed.xml -screensize 640x960:640x960 -profile mobileDevice -XscreenDPI 240 Launching: C:\ApacheFlex\dependencies\AdobeAIRSDK\3.7\bin\adl.exe C:\jenkins_slave\workspace\rc_flex-sdk_mustella-mobile\mustella\tests\mobile\ViewAndViewNavigator\swfs\ViewAndViewNavigatorMainTabbed.xml
[java] USING directory: C:\jenkins_slave\workspace\rc_flex-sdk_mustella-mobile\mustella\tests\mobile\ViewAndViewNavigator\swfs
[java] time: 19:52:02.062
[java] Total Results so far: 1
[java] SCRIPTDONE! 19:52:08.378
[java] GET /ScriptComplete?0 HTTP/1.1
[java] Before Wait loop 19:52:08.378 waiting = 0
[java] After Wait loop 19:52:08.378 waiting = 0
[java] clobberProcess false
[java] Total Results so far: 3
[java] removing the xml app file
[java] Grab log, do parse = false
[java] Grabbing the log from: C:\Users\ApacheFlex\AppData/Roaming\Macromedia/Flash Player/Logs/flashlog.txt to: C:\jenkins_slave\workspace\rc_flex-sdk_mustella-mobile\mustella\tests\mobile\ViewAndViewNavigator\swfs\ViewAndViewNavigatorMainTabbed.log
[java] apollo adj with : C:\jenkins_slave\workspace\rc_flex-sdk_mustella-mobile\mustella\tests\mobile\components\ActionBar\swfs\ActionBar.swf
[java] apollo adj thinks it's a swf
[java] writing Apollo file!
[java] full swf is C:\jenkins_slave\workspace\rc_flex-sdk_mustella-mobile\mustella\tests\mobile\components\ActionBar\swfs\ActionBar.swf
[java] post ApolloAdjuster: C:\jenkins_slave\workspace\rc_flex-sdk_mustella-mobile\mustella\tests\mobile\components\ActionBar\swfs\ActionBar.xml
[java] new test file: C:\jenkins_slave\workspace\rc_flex-sdk_mustella-mobile\mustella\tests\mobile\components\ActionBar\swfs\ActionBar.xml
[java] ******** cmdArr before:
[java] C:\ApacheFlex\dependencies\AdobeAIRSDK\3.7\bin\adl.exe
[java] C:\jenkins_slave\workspace\rc_flex-sdk_mustella-mobile\mustella\tests\mobile\components\ActionBar\swfs\ActionBar.xml
[java] ******** moreParameters before:
[java] -screensize
[java] 640x960:640x960
[java] -profile
[java] mobileDevice
[java] -XscreenDPI
[java] 240
[java] ******** cmdArr after:
[java] C:\ApacheFlex\dependencies\AdobeAIRSDK\3.7\bin\adl.exe
[java] C:\jenkins_slave\workspace\rc_flex-sdk_mustella-mobile\mustella\tests\mobile\components\ActionBar\swfs\ActionBar.xml
[java] -screensize
[java] 640x960:640x960
[java] -profile
[java] mobileDevice
[java] -XscreenDPI
[java] 240
[java] getting directory from the swf file
[java] derived directory: C:\jenkins_slave\workspace\rc_flex-sdk_mustella-mobile\mustella\tests\mobile\components\ActionBar\swfs
[java] Launching:
[java] C:\ApacheFlex\dependencies\AdobeAIRSDK\3.7\bin\adl.exe C:\jenkins_slave\workspace\rc_flex-sdk_mustella-mobile\mustella\tests\mobile\components\ActionBar\swfs\ActionBar.xml -screensize 640x960:640x960 -profile mobileDevice -XscreenDPI 240 Launching: C:\ApacheFlex\dependencies\AdobeAIRSDK\3.7\bin\adl.exe C:\jenkins_slave\workspace\rc_flex-sdk_mustella-mobile\mustella\tests\mobile\components\ActionBar\swfs\ActionBar.xml
[java] USING directory: C:\jenkins_slave\workspace\rc_flex-sdk_mustella-mobile\mustella\tests\mobile\components\ActionBar\swfs
[java] time: 19:52:10.462
[java] waited 1800
[java] ClobberProcess, it was already null
[java] Wrote file: c:/jenkins_slave/workspace/rc_flex-sdk_mustella-mobile/mustella/tests/mobile/components/ActionBar/styles/baselines/ActionBar_TitleDisplay_TextDecoration@android_240ppi.png.bad.png.xml length: 41892
[java] Wrote file: c:/jenkins_slave/workspace/rc_flex-sdk_mustella-mobile/mustella/tests/mobile/components/ActionBar/styles/baselines/ActionBar_TitleDisplay_TextDecoration@android_240ppi.png.bad.png length: 2375
[java] FAIL: mobile/components/ActionBar/styles/ActionBar_Styles ActionBar_TitleDisplay_TextDecoration
[java] SCRIPTDONE! 19:52:17.374
[java] GET /ScriptComplete?0 HTTP/1.1
[java] Before Wait loop 19:52:17.374 waiting = 0
[java] After Wait loop 19:52:17.374 waiting = 0
[java] clobberProcess false
[java] Total Results so far: 4
[java] removing the xml app file
[java] Grab log, do parse = false
[java] Grabbing the log from: C:\Users\ApacheFlex\AppData/Roaming\Macromedia/Flash Player/Logs/flashlog.txt to: C:\jenkins_slave\workspace\rc_flex-sdk_mustella-mobile\mustella\tests\mobile\components\ActionBar\swfs\ActionBar.log
[java] apollo adj with : C:\jenkins_slave\workspace\rc_flex-sdk_mustella-mobile\mustella\tests\mobile\components\ActionBar\swfs\ActionBarTest.swf
[java] apollo adj thinks it's a swf
[java] writing Apollo file!
[java] full swf is C:\jenkins_slave\workspace\rc_flex-sdk_mustella-mobile\mustella\tests\mobile\components\ActionBar\swfs\ActionBarTest.swf
[java] post ApolloAdjuster: C:\jenkins_slave\workspace\rc_flex-sdk_mustella-mobile\mustella\tests\mobile\components\ActionBar\swfs\ActionBarTest.xml
[java] new test file: C:\jenkins_slave\workspace\rc_flex-sdk_mustella-mobile\mustella\tests\mobile\components\ActionBar\swfs\ActionBarTest.xml
[java] ******** cmdArr before:
[java] C:\ApacheFlex\dependencies\AdobeAIRSDK\3.7\bin\adl.exe
[java] C:\jenkins_slave\workspace\rc_flex-sdk_mustella-mobile\mustella\tests\mobile\components\ActionBar\swfs\ActionBarTest.xml
[java] ******** moreParameters before:
[java] -screensize
[java] 640x960:640x960
[java] -profile
[java] mobileDevice
[java] -XscreenDPI
[java] 240
[java] ******** cmdArr after:
[java] C:\ApacheFlex\dependencies\AdobeAIRSDK\3.7\bin\adl.exe
[java] C:\jenkins_slave\workspace\rc_flex-sdk_mustella-mobile\mustella\tests\mobile\components\ActionBar\swfs\ActionBarTest.xml
[java] -screensize
[java] 640x960:640x960
[java] -profile
[java] mobileDevice
[java] -XscreenDPI
[java] 240
[java] getting directory from the swf file
[java] derived directory: C:\jenkins_slave\workspace\rc_flex-sdk_mustella-mobile\mustella\tests\mobile\components\ActionBar\swfs
[java] Launching:
[java] C:\ApacheFlex\dependencies\AdobeAIRSDK\3.7\bin\adl.exe C:\jenkins_slave\workspace\rc_flex-sdk_mustella-mobile\mustella\tests\mobile\components\ActionBar\swfs\ActionBarTest.xml -screensize 640x960:640x960 -profile mobileDevice -XscreenDPI 240 Launching: C:\ApacheFlex\dependencies\AdobeAIRSDK\3.7\bin\adl.exe C:\jenkins_slave\workspace\rc_flex-sdk_mustella-mobile\mustella\tests\mobile\components\ActionBar\swfs\ActionBarTest.xml
[java] USING directory: C:\jenkins_slave\workspace\rc_flex-sdk_mustella-mobile\mustella\tests\mobile\components\ActionBar\swfs
[java] time: 19:52:19.263
[java] waited 1600
[java] ClobberProcess, it was already null
[java] SCRIPTDONE! 19:52:26.500
[java] GET /ScriptComplete?0 HTTP/1.1
[java] Before Wait loop 19:52:26.500 waiting = 0
[java] After Wait loop 19:52:26.500 waiting = 0
[java] clobberProcess false
[java] Total Results so far: 7
[java] removing the xml app file
[java] Grab log, do parse = false
[java] Grabbing the log from: C:\Users\ApacheFlex\AppData/Roaming\Macromedia/Flash Player/Logs/flashlog.txt to: C:\jenkins_slave\workspace\rc_flex-sdk_mustella-mobile\mustella\tests\mobile\components\ActionBar\swfs\ActionBarTest.log
[java] at the end of main
[java] Shutting down the results server
[java] shutting down the baseline server
[java] done waiting for results...bye
[java] =====================================================
[java] Passes: 5
[java] Fails: 2
[java] =====================================================
[java]
[java] =====================================================
[java] =====================================================
[java] Passed:
[java] =====================================================
[java] mobile/ViewAndViewNavigator/tests/ViewAndViewNavigator_orientationTabbed orientationStatesUnDefinedActionBarOverlayLeftTabbed Passed
[java] mobile/ViewAndViewNavigator/tests/ViewAndViewNavigator_orientationTabbed orientationStatesUnDefinedActionBarOverlayRightTabbed Passed
[java] mobile/components/ActionBar/properties/ActionBar_ViewNavigator_Properties ActionBar_ViewNavigator_titleLayout_vertical Passed
[java] mobile/components/ActionBar/properties/ActionBar_ViewNavigator_Properties ActionBar_ViewNavigator_titleLayout_tile Passed
[java] mobile/components/ActionBar/properties/ActionBar_ViewNavigator_Properties ActionBar_ViewNavigator_titleLayout_basic Passed
[java] =====================================================
[java] Failed:
[java] =====================================================
[java] C:\jenkins_slave\workspace\rc_flex-sdk_mustella-mobile\mustella\tests\mobile\SkinnablePopUpContainer\swfs\SkinnablePopUpContainerApp.xml Failed Timed out
[java] mobile/components/ActionBar/styles/ActionBar_Styles ActionBar_TitleDisplay_TextDecoration Failed CompareBitmap(body:step 2) compare returned[object BitmapData]
[java]
[java]
[java] =====================================================
[java] Passes: 5
[java] Fails: 2
[java] =====================================================
[java]
[java]
[java] Wrote summary to results.txt
[java] Wrote failures to failures.txt
waited 1600
ClobberProcess, it was already null
BUILD FAILED
C:\jenkins_slave\workspace\rc_flex-sdk_mustella-mobile\mustella\build.xml:1547: The following error occurred while executing this line:
C:\jenkins_slave\workspace\rc_flex-sdk_mustella-mobile\mustella\build.xml:1665: Java returned: 1
Total time: 2 minutes 46 seconds
============ JENKINS MUSTELLA RUN REPORT ============
Date/Time: 03-23-2015 00:52
Run duration: 0 days 1 hours 49 mins 40 seconds
Settings:
player.version = 11.7
air.version = 3.7
FLASHPLAYER_DEBUGGER = C:\ApacheFlex\dependencies\FlashPlayer_Debug\flashplayer11_7r700_232_win_sa_debug.exe
AIR_HOME = C:\ApacheFlex\dependencies\AdobeAIRSDK\3.7
Build:
type = mobile
command = -mobile
set = tests/mobile
Log:
- Made Cygwin ignore carriage returns
- Set FLASH_VERSION to '11.7' and AIR_VERSION to '3.7'
- Set AIR_HOME to 'C:\ApacheFlex\dependencies\AdobeAIRSDK\3.7'
- Set FLASHPLAYER_DEBUGGER to 'C:\ApacheFlex\dependencies\FlashPlayer_Debug\flashplayer11_7r700_232_win_sa_debug.exe'
- Cleaned up 'local.properties' files from previous runs
- Created fresh 'local.properties' files with containing run specific values
- Ran 'clean', 'main' and 'other.locales' ant targets to prepare the SDK for testing
- Ran Mustella on the SDK with these parameters: '-mobile tests/mobile'
- Some tests failed: running '-failures'
- Some of tests failed, even after running '-failures'...
=====================================================
Build step 'Execute shell' marked build as failure
Archiving artifacts
Email was triggered for: Failure - Any
Sending email for trigger: Failure - Any
(sent from ext-email)