You are viewing a plain text version of this content. The canonical link for it is here.
Posted to dev@calcite.apache.org by Apache Jenkins Server <je...@builds.apache.org> on 2024/02/20 02:08:23 UTC
Build failed in Jenkins: Calcite » Calcite-snapshots #816
See <https://ci-builds.apache.org/job/Calcite/job/Calcite-snapshots/816/display/redirect?page=changes>
Changes:
[jiajunbernoulli] [CALCITE-6273] Add sqrt negative test in SqlOperatorTest
------------------------------------------
[...truncated 9.05 KB...]
> Task :buildSrc:buildext:autostyleKotlinCheck
> Task :buildSrc:buildext:autostyleKotlinGradleCheck
> Task :buildSrc:buildext:autostyleCheck
> Task :buildSrc:buildext:processTestResources NO-SOURCE
> Task :buildSrc:javacc:autostyleKotlinCheck
> Task :buildSrc:javacc:autostyleKotlinGradleCheck
> Task :buildSrc:javacc:autostyleCheck
> Task :buildSrc:javacc:processTestResources NO-SOURCE
> Task :buildSrc:javacc:compileKotlin
w: <https://ci-builds.apache.org/job/Calcite/job/Calcite-snapshots/ws/buildSrc/subprojects/javacc/src/main/kotlin/org/apache/calcite/buildtools/javacc/JavaCCTask.kt>: (66, 13): 'setter for main: String?' is deprecated. Deprecated in Java
> Task :buildSrc:javacc:compileJava NO-SOURCE
> Task :buildSrc:javacc:classes
> Task :buildSrc:javacc:inspectClassesForKotlinIC
> Task :buildSrc:fmpp:compileKotlin
> Task :buildSrc:fmpp:compileJava NO-SOURCE
> Task :buildSrc:fmpp:classes
> Task :buildSrc:fmpp:inspectClassesForKotlinIC
> Task :buildSrc:javacc:jar
> Task :buildSrc:javacc:assemble
> Task :buildSrc:javacc:compileTestKotlin NO-SOURCE
> Task :buildSrc:javacc:compileTestJava NO-SOURCE
> Task :buildSrc:fmpp:jar
> Task :buildSrc:fmpp:assemble
> Task :buildSrc:fmpp:compileTestKotlin NO-SOURCE
> Task :buildSrc:buildext:compileKotlin
> Task :buildSrc:javacc:pluginUnderTestMetadata
> Task :buildSrc:fmpp:compileTestJava NO-SOURCE
> Task :buildSrc:javacc:testClasses UP-TO-DATE
> Task :buildSrc:buildext:compileJava NO-SOURCE
> Task :buildSrc:javacc:test NO-SOURCE
> Task :buildSrc:buildext:classes
> Task :buildSrc:buildext:inspectClassesForKotlinIC
> Task :buildSrc:fmpp:pluginUnderTestMetadata
> Task :buildSrc:fmpp:testClasses UP-TO-DATE
> Task :buildSrc:fmpp:test NO-SOURCE
> Task :buildSrc:buildext:jar
> Task :buildSrc:buildext:assemble
> Task :buildSrc:buildext:compileTestKotlin NO-SOURCE
> Task :buildSrc:test NO-SOURCE
> Task :buildSrc:check
> Task :buildSrc:build
> Task :buildSrc:buildext:compileTestJava NO-SOURCE
> Task :buildSrc:buildext:pluginUnderTestMetadata
> Task :buildSrc:buildext:testClasses UP-TO-DATE
> Task :buildSrc:buildext:test NO-SOURCE
> Task :buildSrc:fmpp:validatePlugins
> Task :buildSrc:fmpp:check
> Task :buildSrc:javacc:validatePlugins
> Task :buildSrc:fmpp:build
> Task :buildSrc:javacc:check
> Task :buildSrc:javacc:build
> Task :buildSrc:buildext:validatePlugins
> Task :buildSrc:buildext:check
> Task :buildSrc:buildext:build
> Configure project :
Building Apache Calcite 1.37.0-SNAPSHOT
Build [0;1mcalcite [0;1;31mFAILURE[0;1m[0m reason:
Caused by: Please correct the following before proceeding with the release:
1) Project property 'asfNexusUsername' is not specified
2) Project property 'asfNexusPassword' is not specified
at com.github.vlsi.gradle.release.StageVoteReleasePlugin.runValidations(StageVoteReleasePlugin.kt:422)
at com.github.vlsi.gradle.release.StageVoteReleasePlugin.access$runValidations(StageVoteReleasePlugin.kt:63)
at com.github.vlsi.gradle.release.StageVoteReleasePlugin$configureRoot$13.execute(StageVoteReleasePlugin.kt:329)
at com.github.vlsi.gradle.release.StageVoteReleasePlugin$configureRoot$13.execute(StageVoteReleasePlugin.kt:63)
[0;0;90mat org.gradle.configuration.internal.DefaultListenerBuildOperationDecorator$BuildOperationEmittingInvocationHandler$1.lambda$run$0(DefaultListenerBuildOperationDecorator.java:255)
[0m [0;0;90mat org.gradle.configuration.internal.DefaultUserCodeApplicationContext$CurrentApplication.reapply(DefaultUserCodeApplicationContext.java:98)
[0m [0;0;90mat org.gradle.configuration.internal.DefaultListenerBuildOperationDecorator$BuildOperationEmittingInvocationHandler$1.run(DefaultListenerBuildOperationDecorator.java:253)
[0m [0;0;90mat org.gradle.internal.operations.DefaultBuildOperationRunner$1.execute(DefaultBuildOperationRunner.java:29)
[0m [0;0;90mat org.gradle.internal.operations.DefaultBuildOperationRunner$1.execute(DefaultBuildOperationRunner.java:26)
[0m [0;0;90mat org.gradle.internal.operations.DefaultBuildOperationRunner$2.execute(DefaultBuildOperationRunner.java:66)
[0m [0;0;90mat org.gradle.internal.operations.DefaultBuildOperationRunner$2.execute(DefaultBuildOperationRunner.java:59)
[0m [0;0;90mat org.gradle.internal.operations.DefaultBuildOperationRunner.execute(DefaultBuildOperationRunner.java:157)
[0m [0;0;90mat org.gradle.internal.operations.DefaultBuildOperationRunner.execute(DefaultBuildOperationRunner.java:59)
[0m [0;0;90mat org.gradle.internal.operations.DefaultBuildOperationRunner.run(DefaultBuildOperationRunner.java:47)
[0m [0;0;90mat org.gradle.internal.operations.DefaultBuildOperationExecutor.run(DefaultBuildOperationExecutor.java:68)
[0m [0;0;90mat org.gradle.configuration.internal.DefaultListenerBuildOperationDecorator$BuildOperationEmittingInvocationHandler.invoke(DefaultListenerBuildOperationDecorator.java:250)
[0m [0;0;90mat org.gradle.internal.dispatch.ReflectionDispatch.dispatch(ReflectionDispatch.java:36)
[0m [0;0;90mat org.gradle.internal.dispatch.ReflectionDispatch.dispatch(ReflectionDispatch.java:24)
[0m [0;0;90mat org.gradle.internal.event.AbstractBroadcastDispatch.dispatch(AbstractBroadcastDispatch.java:43)
[0m [0;0;90mat org.gradle.internal.event.BroadcastDispatch$SingletonDispatch.dispatch(BroadcastDispatch.java:245)
[0m [0;0;90mat org.gradle.internal.event.BroadcastDispatch$SingletonDispatch.dispatch(BroadcastDispatch.java:157)
[0m [0;0;90mat org.gradle.internal.event.AbstractBroadcastDispatch.dispatch(AbstractBroadcastDispatch.java:83)
[0m [0;0;90mat org.gradle.internal.event.AbstractBroadcastDispatch.dispatch(AbstractBroadcastDispatch.java:69)
[0m [0;0;90mat org.gradle.internal.event.BroadcastDispatch$CompositeDispatch.dispatch(BroadcastDispatch.java:346)
[0m [0;0;90mat org.gradle.internal.event.BroadcastDispatch$CompositeDispatch.dispatch(BroadcastDispatch.java:249)
[0m [0;0;90mat org.gradle.internal.event.ListenerBroadcast.dispatch(ListenerBroadcast.java:141)
[0m [0;0;90mat org.gradle.internal.event.ListenerBroadcast.dispatch(ListenerBroadcast.java:37)
[0m [0;0;90mat org.gradle.internal.dispatch.ProxyDispatchAdapter$DispatchingInvocationHandler.invoke(ProxyDispatchAdapter.java:94)
[0m [0;0;90mat org.gradle.execution.taskgraph.DefaultTaskExecutionGraph$NotifyTaskGraphWhenReady.run(DefaultTaskExecutionGraph.java:366)
[0m [0;0;90mat org.gradle.internal.operations.DefaultBuildOperationRunner$1.execute(DefaultBuildOperationRunner.java:29)
[0m [0;0;90mat org.gradle.internal.operations.DefaultBuildOperationRunner$1.execute(DefaultBuildOperationRunner.java:26)
[0m [0;0;90mat org.gradle.internal.operations.DefaultBuildOperationRunner$2.execute(DefaultBuildOperationRunner.java:66)
[0m [0;0;90mat org.gradle.internal.operations.DefaultBuildOperationRunner$2.execute(DefaultBuildOperationRunner.java:59)
[0m [0;0;90mat org.gradle.internal.operations.DefaultBuildOperationRunner.execute(DefaultBuildOperationRunner.java:157)
[0m [0;0;90mat org.gradle.internal.operations.DefaultBuildOperationRunner.execute(DefaultBuildOperationRunner.java:59)
[0m [0;0;90mat org.gradle.internal.operations.DefaultBuildOperationRunner.run(DefaultBuildOperationRunner.java:47)
[0m [0;0;90mat org.gradle.internal.operations.DefaultBuildOperationExecutor.run(DefaultBuildOperationExecutor.java:68)
[0m [0;0;90mat org.gradle.execution.taskgraph.DefaultTaskExecutionGraph.lambda$fireWhenReady$0(DefaultTaskExecutionGraph.java:346)
[0m [0;0;90mat org.gradle.internal.Factories$1.create(Factories.java:31)
[0m [0;0;90mat org.gradle.internal.work.DefaultWorkerLeaseService.withReplacedLocks(DefaultWorkerLeaseService.java:345)
[0m [0;0;90mat org.gradle.api.internal.project.DefaultProjectStateRegistry$DefaultBuildProjectRegistry.withMutableStateOfAllProjects(DefaultProjectStateRegistry.java:205)
[0m [0;0;90mat org.gradle.api.internal.project.DefaultProjectStateRegistry$DefaultBuildProjectRegistry.withMutableStateOfAllProjects(DefaultProjectStateRegistry.java:198)
[0m [0;0;90mat org.gradle.execution.taskgraph.DefaultTaskExecutionGraph.fireWhenReady(DefaultTaskExecutionGraph.java:345)
[0m [0;0;90mat org.gradle.execution.taskgraph.DefaultTaskExecutionGraph.populate(DefaultTaskExecutionGraph.java:106)
[0m [0;0;90mat org.gradle.internal.build.DefaultBuildWorkPreparer.finalizeWorkGraph(DefaultBuildWorkPreparer.java:53)
[0m [0;0;90mat org.gradle.internal.build.BuildOperationFiringBuildWorkPreparer.finalizeWorkGraph(BuildOperationFiringBuildWorkPreparer.java:73)
[0m [0;0;90mat org.gradle.internal.build.DefaultBuildLifecycleController.lambda$finalizeWorkGraph$5(DefaultBuildLifecycleController.java:156)
[0m [0;0;90mat org.gradle.internal.model.StateTransitionController.lambda$doTransition$12(StateTransitionController.java:236)
[0m [0;0;90mat org.gradle.internal.model.StateTransitionController.doTransition(StateTransitionController.java:247)
[0m [0;0;90mat org.gradle.internal.model.StateTransitionController.doTransition(StateTransitionController.java:235)
[0m [0;0;90mat org.gradle.internal.model.StateTransitionController.lambda$transition$4(StateTransitionController.java:157)
[0m [0;0;90mat org.gradle.internal.work.DefaultSynchronizer.withLock(DefaultSynchronizer.java:34)
[0m [0;0;90mat org.gradle.internal.model.StateTransitionController.transition(StateTransitionController.java:157)
[0m [0;0;90mat org.gradle.internal.build.DefaultBuildLifecycleController.finalizeWorkGraph(DefaultBuildLifecycleController.java:152)
[0m [0;0;90mat org.gradle.internal.build.DefaultBuildWorkGraphController$DefaultBuildWorkGraph.finalizeGraph(DefaultBuildWorkGraphController.java:176)
[0m [0;0;90mat org.gradle.composite.internal.DefaultBuildController.finalizeWorkGraph(DefaultBuildController.java:111)
[0m [0;0;90mat org.gradle.composite.internal.DefaultBuildControllers.populateWorkGraphs(DefaultBuildControllers.java:79)
[0m [0;0;90mat org.gradle.composite.internal.DefaultIncludedBuildTaskGraph$DefaultBuildTreeWorkGraph$1.run(DefaultIncludedBuildTaskGraph.java:198)
[0m [0;0;90mat org.gradle.internal.operations.DefaultBuildOperationRunner$1.execute(DefaultBuildOperationRunner.java:29)
[0m [0;0;90mat org.gradle.internal.operations.DefaultBuildOperationRunner$1.execute(DefaultBuildOperationRunner.java:26)
[0m [0;0;90mat org.gradle.internal.operations.DefaultBuildOperationRunner$2.execute(DefaultBuildOperationRunner.java:66)
[0m [0;0;90mat org.gradle.internal.operations.DefaultBuildOperationRunner$2.execute(DefaultBuildOperationRunner.java:59)
[0m [0;0;90mat org.gradle.internal.operations.DefaultBuildOperationRunner.execute(DefaultBuildOperationRunner.java:157)
[0m [0;0;90mat org.gradle.internal.operations.DefaultBuildOperationRunner.execute(DefaultBuildOperationRunner.java:59)
[0m [0;0;90mat org.gradle.internal.operations.DefaultBuildOperationRunner.run(DefaultBuildOperationRunner.java:47)
[0m [0;0;90mat org.gradle.internal.operations.DefaultBuildOperationExecutor.run(DefaultBuildOperationExecutor.java:68)
[0m [0;0;90mat org.gradle.composite.internal.DefaultIncludedBuildTaskGraph$DefaultBuildTreeWorkGraph.scheduleWork(DefaultIncludedBuildTaskGraph.java:192)
[0m [0;0;90mat org.gradle.internal.buildtree.DefaultBuildTreeWorkPreparer.scheduleRequestedTasks(DefaultBuildTreeWorkPreparer.java:37)
[0m [0;0;90mat org.gradle.internal.buildtree.DefaultBuildTreeLifecycleController.lambda$doScheduleAndRunTasks$3(DefaultBuildTreeLifecycleController.java:96)
[0m [0;0;90mat org.gradle.composite.internal.DefaultIncludedBuildTaskGraph.withNewWorkGraph(DefaultIncludedBuildTaskGraph.java:109)
[0m [0;0;90mat org.gradle.internal.buildtree.DefaultBuildTreeLifecycleController.doScheduleAndRunTasks(DefaultBuildTreeLifecycleController.java:95)
[0m [0;0;90mat org.gradle.internal.buildtree.DefaultBuildTreeLifecycleController.lambda$scheduleAndRunTasks$1(DefaultBuildTreeLifecycleController.java:76)
[0m [0;0;90mat org.gradle.internal.buildtree.DefaultBuildTreeLifecycleController.lambda$runBuild$5(DefaultBuildTreeLifecycleController.java:113)
[0m [0;0;90mat org.gradle.internal.model.StateTransitionController.lambda$transition$5(StateTransitionController.java:166)
[0m [0;0;90mat org.gradle.internal.model.StateTransitionController.doTransition(StateTransitionController.java:247)
[0m [0;0;90mat org.gradle.internal.model.StateTransitionController.lambda$transition$6(StateTransitionController.java:166)
[0m [0;0;90mat org.gradle.internal.work.DefaultSynchronizer.withLock(DefaultSynchronizer.java:44)
[0m [0;0;90mat org.gradle.internal.model.StateTransitionController.transition(StateTransitionController.java:166)
[0m [0;0;90mat org.gradle.internal.buildtree.DefaultBuildTreeLifecycleController.runBuild(DefaultBuildTreeLifecycleController.java:110)
[0m [0;0;90mat org.gradle.internal.buildtree.DefaultBuildTreeLifecycleController.scheduleAndRunTasks(DefaultBuildTreeLifecycleController.java:76)
[0m [0;0;90mat org.gradle.internal.buildtree.DefaultBuildTreeLifecycleController.scheduleAndRunTasks(DefaultBuildTreeLifecycleController.java:71)
[0m [0;0;90mat org.gradle.tooling.internal.provider.ExecuteBuildActionRunner.run(ExecuteBuildActionRunner.java:31)
[0m [0;0;90mat org.gradle.launcher.exec.ChainingBuildActionRunner.run(ChainingBuildActionRunner.java:35)
[0m [0;0;90mat org.gradle.internal.buildtree.ProblemReportingBuildActionRunner.run(ProblemReportingBuildActionRunner.java:49)
[0m [0;0;90mat org.gradle.launcher.exec.BuildOutcomeReportingBuildActionRunner.run(BuildOutcomeReportingBuildActionRunner.java:65)
[0m [0;0;90mat org.gradle.tooling.internal.provider.FileSystemWatchingBuildActionRunner.run(FileSystemWatchingBuildActionRunner.java:136)
[0m [0;0;90mat org.gradle.launcher.exec.BuildCompletionNotifyingBuildActionRunner.run(BuildCompletionNotifyingBuildActionRunner.java:41)
[0m [0;0;90mat org.gradle.launcher.exec.RootBuildLifecycleBuildActionExecutor.lambda$execute$0(RootBuildLifecycleBuildActionExecutor.java:40)
[0m [0;0;90mat org.gradle.composite.internal.DefaultRootBuildState.run(DefaultRootBuildState.java:122)
[0m [0;0;90mat org.gradle.launcher.exec.RootBuildLifecycleBuildActionExecutor.execute(RootBuildLifecycleBuildActionExecutor.java:40)
[0m [0;0;90mat org.gradle.internal.buildtree.DefaultBuildTreeContext.execute(DefaultBuildTreeContext.java:40)
[0m [0;0;90mat org.gradle.launcher.exec.BuildTreeLifecycleBuildActionExecutor.lambda$execute$0(BuildTreeLifecycleBuildActionExecutor.java:65)
[0m [0;0;90mat org.gradle.internal.buildtree.BuildTreeState.run(BuildTreeState.java:53)
[0m [0;0;90mat org.gradle.launcher.exec.BuildTreeLifecycleBuildActionExecutor.execute(BuildTreeLifecycleBuildActionExecutor.java:65)
[0m [0;0;90mat org.gradle.launcher.exec.RunAsBuildOperationBuildActionExecutor$3.call(RunAsBuildOperationBuildActionExecutor.java:61)
[0m [0;0;90mat org.gradle.launcher.exec.RunAsBuildOperationBuildActionExecutor$3.call(RunAsBuildOperationBuildActionExecutor.java:57)
[0m [0;0;90mat org.gradle.internal.operations.DefaultBuildOperationRunner$CallableBuildOperationWorker.execute(DefaultBuildOperationRunner.java:204)
[0m [0;0;90mat org.gradle.internal.operations.DefaultBuildOperationRunner$CallableBuildOperationWorker.execute(DefaultBuildOperationRunner.java:199)
[0m [0;0;90mat org.gradle.internal.operations.DefaultBuildOperationRunner$2.execute(DefaultBuildOperationRunner.java:66)
[0m [0;0;90mat org.gradle.internal.operations.DefaultBuildOperationRunner$2.execute(DefaultBuildOperationRunner.java:59)
[0m [0;0;90mat org.gradle.internal.operations.DefaultBuildOperationRunner.execute(DefaultBuildOperationRunner.java:157)
[0m [0;0;90mat org.gradle.internal.operations.DefaultBuildOperationRunner.execute(DefaultBuildOperationRunner.java:59)
[0m [0;0;90mat org.gradle.internal.operations.DefaultBuildOperationRunner.call(DefaultBuildOperationRunner.java:53)
[0m [0;0;90mat org.gradle.internal.operations.DefaultBuildOperationExecutor.call(DefaultBuildOperationExecutor.java:73)
[0m [0;0;90mat org.gradle.launcher.exec.RunAsBuildOperationBuildActionExecutor.execute(RunAsBuildOperationBuildActionExecutor.java:57)
[0m [0;0;90mat org.gradle.launcher.exec.RunAsWorkerThreadBuildActionExecutor.lambda$execute$0(RunAsWorkerThreadBuildActionExecutor.java:36)
[0m [0;0;90mat org.gradle.internal.work.DefaultWorkerLeaseService.withLocks(DefaultWorkerLeaseService.java:249)
[0m [0;0;90mat org.gradle.internal.work.DefaultWorkerLeaseService.runAsWorkerThread(DefaultWorkerLeaseService.java:109)
[0m [0;0;90mat org.gradle.launcher.exec.RunAsWorkerThreadBuildActionExecutor.execute(RunAsWorkerThreadBuildActionExecutor.java:36)
[0m [0;0;90mat org.gradle.tooling.internal.provider.continuous.ContinuousBuildActionExecutor.execute(ContinuousBuildActionExecutor.java:110)
[0m [0;0;90mat org.gradle.tooling.internal.provider.SubscribableBuildActionExecutor.execute(SubscribableBuildActionExecutor.java:64)
[0m [0;0;90mat org.gradle.internal.session.DefaultBuildSessionContext.execute(DefaultBuildSessionContext.java:46)
[0m [0;0;90mat org.gradle.tooling.internal.provider.BuildSessionLifecycleBuildActionExecuter$ActionImpl.apply(BuildSessionLifecycleBuildActionExecuter.java:100)
[0m [0;0;90mat org.gradle.tooling.internal.provider.BuildSessionLifecycleBuildActionExecuter$ActionImpl.apply(BuildSessionLifecycleBuildActionExecuter.java:88)
[0m [0;0;90mat org.gradle.internal.session.BuildSessionState.run(BuildSessionState.java:69)
[0m [0;0;90mat org.gradle.tooling.internal.provider.BuildSessionLifecycleBuildActionExecuter.execute(BuildSessionLifecycleBuildActionExecuter.java:62)
[0m [0;0;90mat org.gradle.tooling.internal.provider.BuildSessionLifecycleBuildActionExecuter.execute(BuildSessionLifecycleBuildActionExecuter.java:41)
[0m [0;0;90mat org.gradle.tooling.internal.provider.StartParamsValidatingActionExecuter.execute(StartParamsValidatingActionExecuter.java:63)
[0m [0;0;90mat org.gradle.tooling.internal.provider.StartParamsValidatingActionExecuter.execute(StartParamsValidatingActionExecuter.java:31)
[0m [0;0;90mat org.gradle.tooling.internal.provider.SessionFailureReportingActionExecuter.execute(SessionFailureReportingActionExecuter.java:52)
[0m [0;0;90mat org.gradle.tooling.internal.provider.SessionFailureReportingActionExecuter.execute(SessionFailureReportingActionExecuter.java:40)
[0m [0;0;90mat org.gradle.tooling.internal.provider.SetupLoggingActionExecuter.execute(SetupLoggingActionExecuter.java:47)
[0m [0;0;90mat org.gradle.tooling.internal.provider.SetupLoggingActionExecuter.execute(SetupLoggingActionExecuter.java:31)
[0m [0;0;90mat org.gradle.launcher.daemon.server.exec.ExecuteBuild.doBuild(ExecuteBuild.java:65)
[0m [0;0;90mat org.gradle.launcher.daemon.server.exec.BuildCommandOnly.execute(BuildCommandOnly.java:37)
[0m [0;0;90mat org.gradle.launcher.daemon.server.api.DaemonCommandExecution.proceed(DaemonCommandExecution.java:104)
[0m [0;0;90mat org.gradle.launcher.daemon.server.exec.WatchForDisconnection.execute(WatchForDisconnection.java:39)
[0m [0;0;90mat org.gradle.launcher.daemon.server.api.DaemonCommandExecution.proceed(DaemonCommandExecution.java:104)
[0m [0;0;90mat org.gradle.launcher.daemon.server.exec.ResetDeprecationLogger.execute(ResetDeprecationLogger.java:29)
[0m [0;0;90mat org.gradle.launcher.daemon.server.api.DaemonCommandExecution.proceed(DaemonCommandExecution.java:104)
[0m [0;0;90mat org.gradle.launcher.daemon.server.exec.RequestStopIfSingleUsedDaemon.execute(RequestStopIfSingleUsedDaemon.java:35)
[0m [0;0;90mat org.gradle.launcher.daemon.server.api.DaemonCommandExecution.proceed(DaemonCommandExecution.java:104)
[0m [0;0;90mat org.gradle.launcher.daemon.server.exec.ForwardClientInput$2.create(ForwardClientInput.java:78)
[0m [0;0;90mat org.gradle.launcher.daemon.server.exec.ForwardClientInput$2.create(ForwardClientInput.java:75)
[0m [0;0;90mat org.gradle.util.internal.Swapper.swap(Swapper.java:38)
[0m [0;0;90mat org.gradle.launcher.daemon.server.exec.ForwardClientInput.execute(ForwardClientInput.java:75)
[0m [0;0;90mat org.gradle.launcher.daemon.server.api.DaemonCommandExecution.proceed(DaemonCommandExecution.java:104)
[0m [0;0;90mat org.gradle.launcher.daemon.server.exec.LogAndCheckHealth.execute(LogAndCheckHealth.java:50)
[0m [0;0;90mat org.gradle.launcher.daemon.server.api.DaemonCommandExecution.proceed(DaemonCommandExecution.java:104)
[0m [0;0;90mat org.gradle.launcher.daemon.server.exec.LogToClient.doBuild(LogToClient.java:63)
[0m [0;0;90mat org.gradle.launcher.daemon.server.exec.BuildCommandOnly.execute(BuildCommandOnly.java:37)
[0m [0;0;90mat org.gradle.launcher.daemon.server.api.DaemonCommandExecution.proceed(DaemonCommandExecution.java:104)
[0m [0;0;90mat org.gradle.launcher.daemon.server.exec.EstablishBuildEnvironment.doBuild(EstablishBuildEnvironment.java:84)
[0m [0;0;90mat org.gradle.launcher.daemon.server.exec.BuildCommandOnly.execute(BuildCommandOnly.java:37)
[0m [0;0;90mat org.gradle.launcher.daemon.server.api.DaemonCommandExecution.proceed(DaemonCommandExecution.java:104)
[0m [0;0;90mat org.gradle.launcher.daemon.server.exec.StartBuildOrRespondWithBusy$1.run(StartBuildOrRespondWithBusy.java:52)
[0m [0;0;90mat org.gradle.launcher.daemon.server.DaemonStateCoordinator$1.run(DaemonStateCoordinator.java:297)
[0m [0;0;90mat org.gradle.internal.concurrent.ExecutorPolicy$CatchAndRecordFailures.onExecute(ExecutorPolicy.java:64)
[0m [0;0;90mat org.gradle.internal.concurrent.ManagedExecutorImpl$1.run(ManagedExecutorImpl.java:49)
[0m
FAILURE: Build failed with an exception.
* What went wrong:
Please correct the following before proceeding with the release:
1) Project property 'asfNexusUsername' is not specified
2) Project property 'asfNexusPassword' is not specified
* Try:
> Run with --stacktrace option to get the stack trace.
> Run with --info or --debug option to get more log output.
* Get more help at https://help.gradle.org
Deprecated Gradle features were used in this build, making it incompatible with Gradle 8.0.
You can use '--warning-mode all' to show the individual deprecation warnings and determine if they come from your own scripts or plugins.
See https://docs.gradle.org/7.6.1/userguide/command_line_interface.html#sec:command_line_warnings
BUILD FAILED in 4m 8s
30 actionable tasks: 30 executed
Publishing build scan...
https://ge.apache.org/s/3tqw3qelsduym
See the profiling report at: file://<https://ci-builds.apache.org/job/Calcite/job/Calcite-snapshots/ws/build/reports/profile/profile-2024-02-20-02-05-33.html>
A fine-grained performance profile is available: use the --scan option.
Build step 'Invoke Gradle script' changed build result to FAILURE
Build step 'Invoke Gradle script' marked build as failure
Recording test results
ERROR: Step ‘Publish JUnit test result report’ failed: No test report files were found. Configuration error?
Jenkins build is back to normal : Calcite » Calcite-snapshots #817
Posted by Apache Jenkins Server <je...@builds.apache.org>.
See <https://ci-builds.apache.org/job/Calcite/job/Calcite-snapshots/817/display/redirect?page=changes>