You are viewing a plain text version of this content. The canonical link for it is here.
Posted to builds@beam.apache.org by Apache Jenkins Server <je...@builds.apache.org> on 2019/04/18 18:31:08 UTC
Build failed in Jenkins: beam_PreCommit_Java_Cron #1201
See <https://builds.apache.org/job/beam_PreCommit_Java_Cron/1201/display/redirect?page=changes>
Changes:
[jbonofre] [BEAM-7097] Upgrade MqttIO to use fusesource mqtt-client 1.15
[iemejia] [BEAM-7027] Use same method to find a new local available port in IO
[iemejia] [BEAM-7027] IO tests should not be annotated with Categories
[iemejia] [BEAM-7027] Add missing @RunWith(JUnit4.class) annotation to IO tests
[iemejia] [BEAM-7027] Restrict access level in some IO tests utility classes
------------------------------------------
[...truncated 494.60 KB...]
[IOManagerAsync shutdown hook] INFO org.apache.flink.runtime.io.disk.iomanager.IOManager - I/O manager removed spill file directory /tmp/flink-io-c7706a51-8f0f-4300-872e-7aa6b8f69342
[IOManagerAsync shutdown hook] INFO org.apache.flink.runtime.io.disk.iomanager.IOManager - I/O manager removed spill file directory /tmp/flink-io-d236eef5-e140-4456-8022-aa5afd0df8c2
[IOManagerAsync shutdown hook] INFO org.apache.flink.runtime.io.disk.iomanager.IOManager - I/O manager removed spill file directory /tmp/flink-io-5eb9004f-2f15-40c0-9593-c2a33e217f58
[IOManagerAsync shutdown hook] INFO org.apache.flink.runtime.io.disk.iomanager.IOManager - I/O manager removed spill file directory /tmp/flink-io-bb1d9360-eb1a-4dab-93d2-08fb0b91bf36
[IOManagerAsync shutdown hook] INFO org.apache.flink.runtime.io.disk.iomanager.IOManager - I/O manager removed spill file directory /tmp/flink-io-f2225ebe-96b3-4134-8227-9aa7d82c618b
[IOManagerAsync shutdown hook] INFO org.apache.flink.runtime.io.disk.iomanager.IOManager - I/O manager removed spill file directory /tmp/flink-io-a17307e0-01fa-4945-bb54-04b22b17f39e
[IOManagerAsync shutdown hook] INFO org.apache.flink.runtime.io.disk.iomanager.IOManager - I/O manager removed spill file directory /tmp/flink-io-b4fde016-368d-4669-9775-c88c1da3058a
[IOManagerAsync shutdown hook] INFO org.apache.flink.runtime.io.disk.iomanager.IOManager - I/O manager removed spill file directory /tmp/flink-io-73406b55-2b7d-42a3-a1a2-1f7c3695fbe7
[IOManagerAsync shutdown hook] INFO org.apache.flink.runtime.io.disk.iomanager.IOManager - I/O manager removed spill file directory /tmp/flink-io-859b4988-0128-4efe-b036-ff35473881b1
[IOManagerAsync shutdown hook] INFO org.apache.flink.runtime.io.disk.iomanager.IOManager - I/O manager removed spill file directory /tmp/flink-io-5651dfb6-5197-4c32-8433-0aca8d9542ac
[IOManagerAsync shutdown hook] INFO org.apache.flink.runtime.io.disk.iomanager.IOManager - I/O manager removed spill file directory /tmp/flink-io-8987b423-c0a1-47f3-bb36-7b20d0394344
[IOManagerAsync shutdown hook] INFO org.apache.flink.runtime.io.disk.iomanager.IOManager - I/O manager removed spill file directory /tmp/flink-io-f8c7eddd-ce0d-45e1-8288-8da4f798cd6c
[IOManagerAsync shutdown hook] INFO org.apache.flink.runtime.io.disk.iomanager.IOManager - I/O manager removed spill file directory /tmp/flink-io-beabde4a-2fe1-49fd-b9e9-e7ddd8e82251
[IOManagerAsync shutdown hook] INFO org.apache.flink.runtime.io.disk.iomanager.IOManager - I/O manager removed spill file directory /tmp/flink-io-a03117c2-9104-4ea6-aecf-28159fd60d39
[IOManagerAsync shutdown hook] INFO org.apache.flink.runtime.io.disk.iomanager.IOManager - I/O manager removed spill file directory /tmp/flink-io-3f80d758-60d7-4f89-b923-5a69de79e2fa
[IOManagerAsync shutdown hook] INFO org.apache.flink.runtime.io.disk.iomanager.IOManager - I/O manager removed spill file directory /tmp/flink-io-ffa92c9f-4c4a-42f2-8d46-fecb24227e4e
[IOManagerAsync shutdown hook] INFO org.apache.flink.runtime.io.disk.iomanager.IOManager - I/O manager removed spill file directory /tmp/flink-io-f1fc989f-4ac2-4abb-bc60-58b9f7fa5436
[IOManagerAsync shutdown hook] INFO org.apache.flink.runtime.io.disk.iomanager.IOManager - I/O manager removed spill file directory /tmp/flink-io-dc362fa6-bab7-436e-8d2c-c80e603f801b
[IOManagerAsync shutdown hook] INFO org.apache.flink.runtime.io.disk.iomanager.IOManager - I/O manager removed spill file directory /tmp/flink-io-392dc78b-ecb9-40c8-8119-32bf3e68e8e5
[IOManagerAsync shutdown hook] INFO org.apache.flink.runtime.io.disk.iomanager.IOManager - I/O manager removed spill file directory /tmp/flink-io-1320ac8c-4860-4139-8be6-d234516c7af8
[IOManagerAsync shutdown hook] INFO org.apache.flink.runtime.io.disk.iomanager.IOManager - I/O manager removed spill file directory /tmp/flink-io-b847ec3f-be50-4a98-b04d-ac4b2516c4ff
[IOManagerAsync shutdown hook] INFO org.apache.flink.runtime.io.disk.iomanager.IOManager - I/O manager removed spill file directory /tmp/flink-io-996a74b0-eb9b-4535-83e7-84aa08bae81d
[IOManagerAsync shutdown hook] INFO org.apache.flink.runtime.io.disk.iomanager.IOManager - I/O manager removed spill file directory /tmp/flink-io-9cb310c7-0730-4ac2-a30a-0f5332840310
[IOManagerAsync shutdown hook] INFO org.apache.flink.runtime.io.disk.iomanager.IOManager - I/O manager removed spill file directory /tmp/flink-io-e249b318-9d9d-4c1b-ab6e-23ec2f669ee3
> Task :beam-sdks-java-io-common:test
> Task :beam-sdks-java-io-common:check
> Task :beam-sdks-java-io-common:build
> Task :beam-runners-flink-1.7:check
> Task :beam-runners-flink-1.7:build
> Task :beam-runners-flink-1.7:buildDependents
> Task :beam-runners-samza-job-server:shadowJar
> Task :beam-sdks-java-extensions-sql-jdbc:shadowJarTest
> Task :beam-runners-samza-job-server:startShadowScripts
> Task :beam-runners-samza-job-server:shadowDistTar
> Task :beam-sdks-java-extensions-sql-jdbc:preCommit
> Task :beam-sdks-java-core:spotbugsMain
> Task :beam-sdks-java-core:test
> Task :beam-sdks-java-extensions-sql:validateShadedJarDoesntLeakNonProjectClasses
> Task :beam-sdks-java-extensions-sql:check
> Task :beam-sdks-java-extensions-sql:build
> Task :beam-runners-samza-job-server:shadowDistZip
> Task :beam-runners-samza-job-server:assemble
> Task :beam-runners-samza-job-server:analyzeClassesDependencies SKIPPED
> Task :beam-runners-samza-job-server:analyzeTestClassesDependencies SKIPPED
> Task :beam-runners-samza-job-server:analyzeDependencies SKIPPED
> Task :beam-runners-samza-job-server:checkstyleMain NO-SOURCE
> Task :beam-runners-samza-job-server:checkstyleTest NO-SOURCE
> Task :beam-runners-samza-job-server:javadoc NO-SOURCE
> Task :beam-runners-samza-job-server:spotbugsMain NO-SOURCE
> Task :beam-runners-samza-job-server:test NO-SOURCE
> Task :beam-runners-samza-job-server:check UP-TO-DATE
> Task :beam-runners-samza-job-server:build
> Task :beam-runners-samza-job-server:buildDependents
> Task :beam-runners-samza:buildDependents
> Task :beam-sdks-java-core:spotbugsMain
The following classes needed for analysis were missing:
com.google.auto.value.AutoValue$Builder
com.google.auto.value.AutoValue
> Task :beam-sdks-java-core:validateShadedJarDoesntLeakNonProjectClasses
> Task :beam-sdks-java-core:check
> Task :beam-sdks-java-core:build
> Task :beam-sdks-java-core:buildNeeded
> Task :beam-runners-direct-java:jar
> Task :beam-runners-direct-java:packageTests
> Task :beam-runners-direct-java:assemble
> Task :beam-runners-direct-java:analyzeClassesDependencies SKIPPED
> Task :beam-runners-direct-java:analyzeTestClassesDependencies SKIPPED
> Task :beam-runners-direct-java:analyzeDependencies SKIPPED
> Task :beam-runners-direct-java:checkstyleMain
> Task :beam-runners-direct-java:checkstyleTest
> Task :beam-sdks-java-extensions-kryo:test
> Task :beam-sdks-java-extensions-kryo:check
> Task :beam-sdks-java-extensions-kryo:build
> Task :beam-runners-direct-java:javadoc
> Task :beam-sdks-java-extensions-json-jackson:test
> Task :beam-sdks-java-io-hadoop-input-format:test
> Task :beam-sdks-java-extensions-euphoria:test
> Task :beam-sdks-java-extensions-join-library:test
> Task :beam-sdks-java-extensions-sketching:test
> Task :beam-sdks-java-extensions-sorter:test
> Task :beam-sdks-java-io-amazon-web-services:test
> Task :beam-sdks-java-io-hadoop-format:test
> Task :beam-sdks-java-io-hadoop-input-format:test FAILED
> Task :beam-sdks-java-extensions-json-jackson:check
> Task :beam-sdks-java-extensions-json-jackson:build
> Task :beam-sdks-java-extensions-json-jackson:buildDependents
> Task :beam-runners-direct-java:spotbugsMain
The following classes needed for analysis were missing:
com.google.auto.value.AutoValue$Builder
com.google.auto.value.AutoValue
> Task :beam-sdks-java-extensions-sketching:check
> Task :beam-sdks-java-extensions-sketching:build
> Task :beam-sdks-java-extensions-sketching:buildDependents
> Task :beam-sdks-java-io-amqp:test
> Task :beam-sdks-java-extensions-join-library:check
> Task :beam-sdks-java-extensions-join-library:build
> Task :beam-runners-direct-java:test
> Task :beam-sdks-java-io-amqp:check
> Task :beam-sdks-java-io-amqp:build
> Task :beam-sdks-java-io-amqp:buildDependents
> Task :beam-sdks-java-extensions-sorter:check
> Task :beam-sdks-java-extensions-sorter:build
> Task :beam-sdks-java-extensions-sorter:buildDependents
> Task :beam-sdks-java-io-cassandra:test
> Task :beam-sdks-java-io-clickhouse:test
> Task :beam-sdks-java-io-elasticsearch-tests-2:test
> Task :beam-sdks-java-io-amazon-web-services:check
> Task :beam-sdks-java-io-amazon-web-services:build
> Task :beam-sdks-java-io-amazon-web-services:buildDependents
> Task :beam-sdks-java-io-elasticsearch-tests-common:test NO-SOURCE
> Task :beam-sdks-java-io-elasticsearch-tests-common:check
> Task :beam-sdks-java-io-elasticsearch-tests-common:build
> Task :beam-sdks-java-extensions-euphoria:check
> Task :beam-sdks-java-extensions-euphoria:build
> Task :beam-sdks-java-extensions-euphoria:buildDependents
> Task :beam-sdks-java-extensions-kryo:buildDependents
> Task :beam-sdks-java-io-elasticsearch-tests-5:test
> Task :beam-sdks-java-io-elasticsearch-tests-6:test
> Task :beam-sdks-java-io-hadoop-file-system:test
> Task :beam-sdks-java-io-hbase:test
> Task :beam-runners-direct-java:validateShadedJarDoesntLeakNonProjectClasses
> Task :beam-runners-direct-java:check
> Task :beam-runners-direct-java:build
> Task :beam-sdks-java-io-hcatalog:test
> Task :beam-sdks-java-io-jdbc:test
> Task :beam-sdks-java-io-hadoop-format:check
> Task :beam-sdks-java-io-hadoop-format:build
> Task :beam-sdks-java-io-hadoop-file-system:check
> Task :beam-sdks-java-io-hadoop-file-system:build
> Task :beam-sdks-java-io-hadoop-file-system:buildDependents
> Task :beam-sdks-java-io-elasticsearch-tests-2:check
> Task :beam-sdks-java-io-elasticsearch-tests-2:build
> Task :beam-sdks-java-io-elasticsearch-tests-2:buildDependents
> Task :beam-sdks-java-io-jms:test
> Task :beam-sdks-java-io-jms:check
> Task :beam-sdks-java-io-jms:build
> Task :beam-sdks-java-io-jms:buildDependents
> Task :beam-sdks-java-io-jdbc:check
> Task :beam-sdks-java-io-jdbc:build
> Task :beam-sdks-java-io-kafka:test
> Task :beam-sdks-java-io-kinesis:test
> Task :beam-sdks-java-io-kudu:test
> Task :beam-sdks-java-io-kudu:check
> Task :beam-sdks-java-io-kudu:build
> Task :beam-sdks-java-io-kudu:buildDependents
> Task :beam-sdks-java-io-hcatalog:check
> Task :beam-sdks-java-io-hcatalog:build
> Task :beam-sdks-java-io-hcatalog:buildDependents
> Task :beam-sdks-java-io-mongodb:test
> Task :beam-sdks-java-io-mqtt:test
> Task :beam-sdks-java-io-mqtt:check
> Task :beam-sdks-java-io-mqtt:build
> Task :beam-sdks-java-io-mqtt:buildDependents
> Task :beam-sdks-java-io-elasticsearch-tests-6:check
> Task :beam-sdks-java-io-elasticsearch-tests-6:build
> Task :beam-sdks-java-io-elasticsearch-tests-6:buildDependents
> Task :beam-sdks-java-io-kafka:check
> Task :beam-sdks-java-io-kafka:build
> Task :beam-sdks-java-io-mongodb:check
> Task :beam-sdks-java-io-mongodb:build
> Task :beam-sdks-java-io-mongodb:buildDependents
> Task :beam-sdks-java-io-clickhouse:check
> Task :beam-sdks-java-io-clickhouse:build
> Task :beam-sdks-java-io-clickhouse:buildDependents
> Task :beam-sdks-java-io-elasticsearch-tests-5:check
> Task :beam-sdks-java-io-elasticsearch-tests-5:build
> Task :beam-sdks-java-io-elasticsearch-tests-5:buildDependents
> Task :beam-sdks-java-io-elasticsearch-tests-common:buildDependents
> Task :beam-sdks-java-io-parquet:test
> Task :beam-sdks-java-io-parquet:check
> Task :beam-sdks-java-io-parquet:build
> Task :beam-sdks-java-io-parquet:buildDependents
> Task :beam-sdks-java-io-redis:test
> Task :beam-sdks-java-io-redis:check
> Task :beam-sdks-java-io-redis:build
> Task :beam-sdks-java-io-redis:buildDependents
> Task :beam-sdks-java-io-elasticsearch:buildDependents
> Task :beam-sdks-java-javadoc:allJavadoc
> Task :beam-sdks-java-io-rabbitmq:test
> Task :beam-sdks-java-io-solr:test
> Task :beam-sdks-java-io-synthetic:test
> Task :beam-sdks-java-io-tika:test
> Task :beam-sdks-java-io-synthetic:check
> Task :beam-sdks-java-io-synthetic:build
> Task :beam-sdks-java-io-synthetic:buildDependents
> Task :beam-sdks-java-io-xml:test
> Task :beam-sdks-java-io-tika:check
> Task :beam-sdks-java-io-tika:build
> Task :beam-sdks-java-io-tika:buildDependents
> Task :beam-sdks-java-test-utils:test
> Task :beam-sdks-java-test-utils:check
> Task :beam-sdks-java-test-utils:build
> Task :beam-sdks-java-io-xml:check
> Task :beam-sdks-java-io-xml:build
> Task :beam-sdks-java-io-xml:buildDependents
> Task :beam-sdks-java-io-kinesis:check
> Task :beam-sdks-java-io-kinesis:build
> Task :beam-sdks-java-io-kinesis:buildDependents
> Task :beam-sdks-java-io-rabbitmq:check
> Task :beam-sdks-java-io-rabbitmq:build
> Task :beam-sdks-java-io-rabbitmq:buildDependents
> Task :beam-sdks-java-io-solr:check
> Task :beam-sdks-java-io-solr:build
> Task :beam-sdks-java-io-solr:buildDependents
> Task :beam-sdks-java-io-cassandra:check
> Task :beam-sdks-java-io-cassandra:build
> Task :beam-sdks-java-io-cassandra:buildDependents
> Task :beam-sdks-java-io-hbase:check
> Task :beam-sdks-java-io-hbase:build
> Task :beam-sdks-java-io-hbase:buildDependents
> Task :beam-sdks-java-nexmark:shadowJar
> Task :beam-sdks-java-nexmark:validateShadedJarDoesntLeakNonProjectClasses
> Task :beam-sdks-java-nexmark:check
> Task :beam-sdks-java-nexmark:build
> Task :beam-sdks-java-nexmark:buildDependents
> Task :beam-sdks-java-extensions-sql:buildDependents
> Task :beam-sdks-java-io-kafka:buildDependents
> Task :beam-sdks-java-extensions-join-library:buildDependents
FAILURE: Build failed with an exception.
* What went wrong:
Execution failed for task ':beam-sdks-java-io-hadoop-input-format:test'.
> Process 'Gradle Test Executor 72' finished with non-zero exit value 1
This problem might be caused by incorrect test process configuration.
Please refer to the test execution section in the User Manual at https://docs.gradle.org/5.2.1/userguide/java_testing.html#sec:test_execution
* Try:
Run with --stacktrace option to get the stack trace. Run with --info or --debug option to get more log output. Run with --scan to get full insights.
* Get more help at https://help.gradle.org
Deprecated Gradle features were used in this build, making it incompatible with Gradle 6.0.
Use '--warning-mode all' to show the individual deprecation warnings.
See https://docs.gradle.org/5.2.1/userguide/command_line_interface.html#sec:command_line_warnings
BUILD FAILED in 22m 54s
943 actionable tasks: 841 executed, 102 from cache
Publishing build scan...
https://gradle.com/s/n6vhmaekzyc7w
Build step 'Invoke Gradle script' changed build result to FAILURE
Build step 'Invoke Gradle script' marked build as failure
---------------------------------------------------------------------
To unsubscribe, e-mail: builds-unsubscribe@beam.apache.org
For additional commands, e-mail: builds-help@beam.apache.org
Jenkins build is back to normal : beam_PreCommit_Java_Cron #1202
Posted by Apache Jenkins Server <je...@builds.apache.org>.
See <https://builds.apache.org/job/beam_PreCommit_Java_Cron/1202/display/redirect?page=changes>
---------------------------------------------------------------------
To unsubscribe, e-mail: builds-unsubscribe@beam.apache.org
For additional commands, e-mail: builds-help@beam.apache.org