You are viewing a plain text version of this content. The canonical link for it is here.
Posted to dev@jclouds.apache.org by je...@cloudbees.com on 2013/05/29 00:20:05 UTC

Build failed in Jenkins: jclouds-chef-1.5.x-branch #110

See <https://jclouds.ci.cloudbees.com/job/jclouds-chef-1.5.x-branch/110/changes>

Changes:

[Andrew Bayer] Tweaking release plugin config

[Andrew Bayer] Fix resources GAVC

[Andrew Bayer] Don't hardcode finalName any more

------------------------------------------
[...truncated 1813 lines...]
Downloading: http://clojars.org/repo/org/apache/jclouds/jclouds-project/1.5.11-SNAPSHOT/maven-metadata.xml
Downloading: http://repository.apache.org/snapshots/org/apache/jclouds/jclouds-project/1.5.11-SNAPSHOT/maven-metadata.xml
Downloaded: http://repository.apache.org/snapshots/org/apache/jclouds/jclouds-project/1.5.11-SNAPSHOT/maven-metadata.xml (828 B at 3.9 KB/sec)
Downloaded: https://repository.apache.org/content/repositories/snapshots/org/apache/jclouds/jclouds-project/1.5.11-SNAPSHOT/maven-metadata.xml (828 B at 1.4 KB/sec)
Downloading: https://repository.apache.org/content/repositories/snapshots/org/apache/jclouds/jclouds-project/1.5.11-SNAPSHOT/jclouds-project-1.5.11-20130524.212917-23.pom
Downloaded: https://repository.apache.org/content/repositories/snapshots/org/apache/jclouds/jclouds-project/1.5.11-SNAPSHOT/jclouds-project-1.5.11-20130524.212917-23.pom (36 KB at 60.6 KB/sec)
Downloading: http://repo.cloudbees.com/content/repositories/central/org/bouncycastle/bcprov-jdk16/1.46/bcprov-jdk16-1.46.pom
Downloaded: http://repo.cloudbees.com/content/repositories/central/org/bouncycastle/bcprov-jdk16/1.46/bcprov-jdk16-1.46.pom (819 B at 66.7 KB/sec)
Downloading: http://repo.cloudbees.com/content/repositories/central/javax/ws/rs/jsr311-api/1.1.1/jsr311-api-1.1.1.pom
Downloaded: http://repo.cloudbees.com/content/repositories/central/javax/ws/rs/jsr311-api/1.1.1/jsr311-api-1.1.1.pom (6 KB at 445.1 KB/sec)
Downloading: http://repo.cloudbees.com/content/repositories/central/com/google/inject/extensions/guice-assistedinject/3.0/guice-assistedinject-3.0.pom
Downloaded: http://repo.cloudbees.com/content/repositories/central/com/google/inject/extensions/guice-assistedinject/3.0/guice-assistedinject-3.0.pom (549 B at 48.7 KB/sec)
Downloading: http://repo.cloudbees.com/content/repositories/central/com/google/inject/extensions/extensions-parent/3.0/extensions-parent-3.0.pom
Downloaded: http://repo.cloudbees.com/content/repositories/central/com/google/inject/extensions/extensions-parent/3.0/extensions-parent-3.0.pom (4 KB at 251.5 KB/sec)
Downloading: http://repo.cloudbees.com/content/repositories/central/com/google/inject/guice-parent/3.0/guice-parent-3.0.pom
Downloaded: http://repo.cloudbees.com/content/repositories/central/com/google/inject/guice-parent/3.0/guice-parent-3.0.pom (13 KB at 974.7 KB/sec)
Downloading: http://repo.cloudbees.com/content/repositories/central/com/google/google/5/google-5.pom
Downloaded: http://repo.cloudbees.com/content/repositories/central/com/google/google/5/google-5.pom (3 KB at 141.2 KB/sec)
Downloading: http://repo.cloudbees.com/content/repositories/central/com/google/inject/guice/3.0/guice-3.0.pom
Downloaded: http://repo.cloudbees.com/content/repositories/central/com/google/inject/guice/3.0/guice-3.0.pom (8 KB at 646.5 KB/sec)
Downloading: http://repo.cloudbees.com/content/repositories/central/javax/inject/javax.inject/1/javax.inject-1.pom
Downloaded: http://repo.cloudbees.com/content/repositories/central/javax/inject/javax.inject/1/javax.inject-1.pom (612 B at 54.3 KB/sec)
Downloading: http://repo.cloudbees.com/content/repositories/central/aopalliance/aopalliance/1.0/aopalliance-1.0.pom
Downloaded: http://repo.cloudbees.com/content/repositories/central/aopalliance/aopalliance/1.0/aopalliance-1.0.pom (363 B at 29.5 KB/sec)
Downloading: http://repo.cloudbees.com/content/repositories/central/org/99soft/guice/rocoto/6.1/rocoto-6.1.pom
Downloaded: http://repo.cloudbees.com/content/repositories/central/org/99soft/guice/rocoto/6.1/rocoto-6.1.pom (5 KB at 241.9 KB/sec)
Downloading: http://repo.cloudbees.com/content/repositories/central/org/99soft/oss-parent/7/oss-parent-7.pom
Downloaded: http://repo.cloudbees.com/content/repositories/central/org/99soft/oss-parent/7/oss-parent-7.pom (18 KB at 1581.6 KB/sec)
Downloading: http://repo.cloudbees.com/content/repositories/central/javax/annotation/jsr250-api/1.0/jsr250-api-1.0.pom
Downloaded: http://repo.cloudbees.com/content/repositories/central/javax/annotation/jsr250-api/1.0/jsr250-api-1.0.pom (1023 B at 90.8 KB/sec)
Downloading: http://repo.cloudbees.com/content/repositories/central/com/google/code/gson/gson/2.2/gson-2.2.pom
Downloaded: http://repo.cloudbees.com/content/repositories/central/com/google/code/gson/gson/2.2/gson-2.2.pom (8 KB at 608.9 KB/sec)
Downloading: http://repo.cloudbees.com/content/repositories/central/org/sonatype/oss/oss-parent/7/oss-parent-7.pom
Downloaded: http://repo.cloudbees.com/content/repositories/central/org/sonatype/oss/oss-parent/7/oss-parent-7.pom (5 KB at 261.7 KB/sec)
Downloading: http://repo.cloudbees.com/content/repositories/central/com/google/guava/guava/13.0/guava-13.0.pom
Downloaded: http://repo.cloudbees.com/content/repositories/central/com/google/guava/guava/13.0/guava-13.0.pom (6 KB at 289.9 KB/sec)
Downloading: http://repo.cloudbees.com/content/repositories/central/com/google/guava/guava-parent/13.0/guava-parent-13.0.pom
Downloaded: http://repo.cloudbees.com/content/repositories/central/com/google/guava/guava-parent/13.0/guava-parent-13.0.pom (3 KB at 207.8 KB/sec)
Downloading: https://repository-jclouds.forge.cloudbees.com/snapshot/org/apache/jclouds/jclouds-scriptbuilder/1.5.11-SNAPSHOT/maven-metadata.xml
Downloading: https://oss.sonatype.org/content/repositories/snapshots/org/apache/jclouds/jclouds-scriptbuilder/1.5.11-SNAPSHOT/maven-metadata.xml
Downloading: https://repository.apache.org/content/repositories/snapshots/org/apache/jclouds/jclouds-scriptbuilder/1.5.11-SNAPSHOT/maven-metadata.xml
Downloading: http://clojars.org/repo/org/apache/jclouds/jclouds-scriptbuilder/1.5.11-SNAPSHOT/maven-metadata.xml
Downloading: http://repository.apache.org/snapshots/org/apache/jclouds/jclouds-scriptbuilder/1.5.11-SNAPSHOT/maven-metadata.xml
Downloaded: http://repository.apache.org/snapshots/org/apache/jclouds/jclouds-scriptbuilder/1.5.11-SNAPSHOT/maven-metadata.xml (2 KB at 5.8 KB/sec)
Downloaded: https://repository.apache.org/content/repositories/snapshots/org/apache/jclouds/jclouds-scriptbuilder/1.5.11-SNAPSHOT/maven-metadata.xml (2 KB at 2.0 KB/sec)
Downloading: https://repository-jclouds.forge.cloudbees.com/snapshot/org/apache/jclouds/jclouds-scriptbuilder/1.5.11-SNAPSHOT/jclouds-scriptbuilder-1.5.11-20130524.213742-22.pom
Downloading: https://repository.apache.org/content/repositories/snapshots/org/apache/jclouds/jclouds-scriptbuilder/1.5.11-SNAPSHOT/jclouds-scriptbuilder-1.5.11-20130524.213742-22.pom
Downloaded: https://repository.apache.org/content/repositories/snapshots/org/apache/jclouds/jclouds-scriptbuilder/1.5.11-SNAPSHOT/jclouds-scriptbuilder-1.5.11-20130524.213742-22.pom (3 KB at 5.1 KB/sec)
Downloading: https://repository-jclouds.forge.cloudbees.com/snapshot/org/apache/jclouds/jclouds-blobstore/1.5.11-SNAPSHOT/maven-metadata.xml
Downloading: https://oss.sonatype.org/content/repositories/snapshots/org/apache/jclouds/jclouds-blobstore/1.5.11-SNAPSHOT/maven-metadata.xml
Downloading: https://repository.apache.org/content/repositories/snapshots/org/apache/jclouds/jclouds-blobstore/1.5.11-SNAPSHOT/maven-metadata.xml
Downloading: http://clojars.org/repo/org/apache/jclouds/jclouds-blobstore/1.5.11-SNAPSHOT/maven-metadata.xml
Downloading: http://repository.apache.org/snapshots/org/apache/jclouds/jclouds-blobstore/1.5.11-SNAPSHOT/maven-metadata.xml
Downloaded: http://repository.apache.org/snapshots/org/apache/jclouds/jclouds-blobstore/1.5.11-SNAPSHOT/maven-metadata.xml (2 KB at 5.7 KB/sec)
Downloaded: https://repository.apache.org/content/repositories/snapshots/org/apache/jclouds/jclouds-blobstore/1.5.11-SNAPSHOT/maven-metadata.xml (2 KB at 2.1 KB/sec)
Downloading: https://repository-jclouds.forge.cloudbees.com/snapshot/org/apache/jclouds/jclouds-blobstore/1.5.11-SNAPSHOT/jclouds-blobstore-1.5.11-20130524.215135-21.pom
Downloading: https://repository.apache.org/content/repositories/snapshots/org/apache/jclouds/jclouds-blobstore/1.5.11-SNAPSHOT/jclouds-blobstore-1.5.11-20130524.215135-21.pom
Downloaded: https://repository.apache.org/content/repositories/snapshots/org/apache/jclouds/jclouds-blobstore/1.5.11-SNAPSHOT/jclouds-blobstore-1.5.11-20130524.215135-21.pom (4 KB at 6.5 KB/sec)
Downloading: https://repository-jclouds.forge.cloudbees.com/snapshot/org/apache/jclouds/driver/jclouds-slf4j/1.5.11-SNAPSHOT/maven-metadata.xml
Downloading: https://oss.sonatype.org/content/repositories/snapshots/org/apache/jclouds/driver/jclouds-slf4j/1.5.11-SNAPSHOT/maven-metadata.xml
Downloading: https://repository.apache.org/content/repositories/snapshots/org/apache/jclouds/driver/jclouds-slf4j/1.5.11-SNAPSHOT/maven-metadata.xml
Downloading: http://clojars.org/repo/org/apache/jclouds/driver/jclouds-slf4j/1.5.11-SNAPSHOT/maven-metadata.xml
Downloading: http://repository.apache.org/snapshots/org/apache/jclouds/driver/jclouds-slf4j/1.5.11-SNAPSHOT/maven-metadata.xml
Downloaded: http://repository.apache.org/snapshots/org/apache/jclouds/driver/jclouds-slf4j/1.5.11-SNAPSHOT/maven-metadata.xml (2 KB at 5.7 KB/sec)
Downloaded: https://repository.apache.org/content/repositories/snapshots/org/apache/jclouds/driver/jclouds-slf4j/1.5.11-SNAPSHOT/maven-metadata.xml (2 KB at 2.1 KB/sec)
Downloading: https://repository-jclouds.forge.cloudbees.com/snapshot/org/apache/jclouds/driver/jclouds-slf4j/1.5.11-SNAPSHOT/jclouds-slf4j-1.5.11-20130524.214101-22.pom
Downloading: https://repository.apache.org/content/repositories/snapshots/org/apache/jclouds/driver/jclouds-slf4j/1.5.11-SNAPSHOT/jclouds-slf4j-1.5.11-20130524.214101-22.pom
Downloaded: https://repository.apache.org/content/repositories/snapshots/org/apache/jclouds/driver/jclouds-slf4j/1.5.11-SNAPSHOT/jclouds-slf4j-1.5.11-20130524.214101-22.pom (3 KB at 4.5 KB/sec)
Downloading: http://repo.cloudbees.com/content/repositories/central/org/slf4j/slf4j-api/1.6.4/slf4j-api-1.6.4.pom
Downloaded: http://repo.cloudbees.com/content/repositories/central/org/slf4j/slf4j-api/1.6.4/slf4j-api-1.6.4.pom (3 KB at 238.7 KB/sec)
Downloading: http://repo.cloudbees.com/content/repositories/central/org/slf4j/slf4j-parent/1.6.4/slf4j-parent-1.6.4.pom
Downloaded: http://repo.cloudbees.com/content/repositories/central/org/slf4j/slf4j-parent/1.6.4/slf4j-parent-1.6.4.pom (12 KB at 993.1 KB/sec)
Downloading: http://repo.cloudbees.com/content/repositories/central/ch/qos/logback/logback-classic/1.0.0/logback-classic-1.0.0.pom
Downloaded: http://repo.cloudbees.com/content/repositories/central/ch/qos/logback/logback-classic/1.0.0/logback-classic-1.0.0.pom (13 KB at 195.2 KB/sec)
Downloading: http://repo.cloudbees.com/content/repositories/central/ch/qos/logback/logback-parent/1.0.0/logback-parent-1.0.0.pom
Downloaded: http://repo.cloudbees.com/content/repositories/central/ch/qos/logback/logback-parent/1.0.0/logback-parent-1.0.0.pom (14 KB at 1108.9 KB/sec)
Downloading: http://repo.cloudbees.com/content/repositories/central/ch/qos/logback/logback-core/1.0.0/logback-core-1.0.0.pom
Downloaded: http://repo.cloudbees.com/content/repositories/central/ch/qos/logback/logback-core/1.0.0/logback-core-1.0.0.pom (6 KB at 448.8 KB/sec)
Downloading: https://repository.apache.org/content/repositories/snapshots/org/apache/jclouds/jclouds-core/1.5.11-SNAPSHOT/jclouds-core-1.5.11-20130524.213500-22.jar
Downloading: https://repository.apache.org/content/repositories/snapshots/org/apache/jclouds/jclouds-core/1.5.11-SNAPSHOT/jclouds-core-1.5.11-20130524.213500-22-tests.jar
Downloading: https://repository.apache.org/content/repositories/snapshots/org/apache/jclouds/jclouds-scriptbuilder/1.5.11-SNAPSHOT/jclouds-scriptbuilder-1.5.11-20130524.213742-22.jar
Downloading: https://repository.apache.org/content/repositories/snapshots/org/apache/jclouds/jclouds-blobstore/1.5.11-SNAPSHOT/jclouds-blobstore-1.5.11-20130524.215135-21.jar
Downloading: https://repository.apache.org/content/repositories/snapshots/org/apache/jclouds/driver/jclouds-slf4j/1.5.11-SNAPSHOT/jclouds-slf4j-1.5.11-20130524.214101-22.jar
Downloaded: https://repository.apache.org/content/repositories/snapshots/org/apache/jclouds/driver/jclouds-slf4j/1.5.11-SNAPSHOT/jclouds-slf4j-1.5.11-20130524.214101-22.jar (17 KB at 33.0 KB/sec)
Downloaded: https://repository.apache.org/content/repositories/snapshots/org/apache/jclouds/jclouds-scriptbuilder/1.5.11-SNAPSHOT/jclouds-scriptbuilder-1.5.11-20130524.213742-22.jar (152 KB at 158.4 KB/sec)
Downloaded: https://repository.apache.org/content/repositories/snapshots/org/apache/jclouds/jclouds-blobstore/1.5.11-SNAPSHOT/jclouds-blobstore-1.5.11-20130524.215135-21.jar (197 KB at 191.2 KB/sec)
Downloaded: https://repository.apache.org/content/repositories/snapshots/org/apache/jclouds/jclouds-core/1.5.11-SNAPSHOT/jclouds-core-1.5.11-20130524.213500-22-tests.jar (572 KB at 377.0 KB/sec)
Downloaded: https://repository.apache.org/content/repositories/snapshots/org/apache/jclouds/jclouds-core/1.5.11-SNAPSHOT/jclouds-core-1.5.11-20130524.213500-22.jar (796 KB at 268.5 KB/sec)
Downloading: http://repo.cloudbees.com/content/repositories/central/org/bouncycastle/bcprov-jdk16/1.46/bcprov-jdk16-1.46.jar
Downloading: http://repo.cloudbees.com/content/repositories/central/javax/ws/rs/jsr311-api/1.1.1/jsr311-api-1.1.1.jar
Downloading: http://repo.cloudbees.com/content/repositories/central/aopalliance/aopalliance/1.0/aopalliance-1.0.jar
Downloading: http://repo.cloudbees.com/content/repositories/central/com/google/inject/extensions/guice-assistedinject/3.0/guice-assistedinject-3.0.jar
Downloading: http://repo.cloudbees.com/content/repositories/central/com/google/inject/guice/3.0/guice-3.0.jar
Downloaded: http://repo.cloudbees.com/content/repositories/central/aopalliance/aopalliance/1.0/aopalliance-1.0.jar (5 KB at 49.6 KB/sec)
Downloaded: http://repo.cloudbees.com/content/repositories/central/javax/ws/rs/jsr311-api/1.1.1/jsr311-api-1.1.1.jar (46 KB at 314.4 KB/sec)
Downloading: http://repo.cloudbees.com/content/repositories/central/org/99soft/guice/rocoto/6.1/rocoto-6.1.jar
Downloading: http://repo.cloudbees.com/content/repositories/central/javax/inject/javax.inject/1/javax.inject-1.jar
Downloaded: http://repo.cloudbees.com/content/repositories/central/com/google/inject/extensions/guice-assistedinject/3.0/guice-assistedinject-3.0.jar (37 KB at 430.1 KB/sec)
Downloading: http://repo.cloudbees.com/content/repositories/central/javax/annotation/jsr250-api/1.0/jsr250-api-1.0.jar
Downloaded: http://repo.cloudbees.com/content/repositories/central/javax/annotation/jsr250-api/1.0/jsr250-api-1.0.jar (6 KB at 475.9 KB/sec)
Downloading: http://repo.cloudbees.com/content/repositories/central/com/google/code/gson/gson/2.2/gson-2.2.jar
Downloaded: http://repo.cloudbees.com/content/repositories/central/javax/inject/javax.inject/1/javax.inject-1.jar (3 KB at 22.2 KB/sec)
Downloading: http://repo.cloudbees.com/content/repositories/central/com/google/guava/guava/13.0/guava-13.0.jar
Downloaded: http://repo.cloudbees.com/content/repositories/central/org/99soft/guice/rocoto/6.1/rocoto-6.1.jar (45 KB at 394.8 KB/sec)
Downloading: http://repo.cloudbees.com/content/repositories/central/org/slf4j/slf4j-api/1.6.4/slf4j-api-1.6.4.jar
Downloaded: http://repo.cloudbees.com/content/repositories/central/org/slf4j/slf4j-api/1.6.4/slf4j-api-1.6.4.jar (26 KB at 589.6 KB/sec)
Downloading: http://repo.cloudbees.com/content/repositories/central/ch/qos/logback/logback-classic/1.0.0/logback-classic-1.0.0.jar
Downloaded: http://repo.cloudbees.com/content/repositories/central/com/google/inject/guice/3.0/guice-3.0.jar (694 KB at 2927.6 KB/sec)
Downloading: http://repo.cloudbees.com/content/repositories/central/ch/qos/logback/logback-core/1.0.0/logback-core-1.0.0.jar
Downloaded: http://repo.cloudbees.com/content/repositories/central/com/google/code/gson/gson/2.2/gson-2.2.jar (186 KB at 729.0 KB/sec)
Downloaded: http://repo.cloudbees.com/content/repositories/central/ch/qos/logback/logback-classic/1.0.0/logback-classic-1.0.0.jar (241 KB at 933.8 KB/sec)
Downloaded: http://repo.cloudbees.com/content/repositories/central/ch/qos/logback/logback-core/1.0.0/logback-core-1.0.0.jar (321 KB at 792.6 KB/sec)
Downloaded: http://repo.cloudbees.com/content/repositories/central/org/bouncycastle/bcprov-jdk16/1.46/bcprov-jdk16-1.46.jar (1833 KB at 2411.3 KB/sec)
Downloaded: http://repo.cloudbees.com/content/repositories/central/com/google/guava/guava/13.0/guava-13.0.jar (1847 KB at 3678.8 KB/sec)
mojoStarted org.apache.maven.plugins:maven-clean-plugin:2.5(default-clean)
[INFO] 
[INFO] --- maven-clean-plugin:2.5:clean (default-clean) @ chef ---
mojoSucceeded org.apache.maven.plugins:maven-clean-plugin:2.5(default-clean)
mojoStarted org.apache.maven.plugins:maven-remote-resources-plugin:1.3(default)
[INFO] 
[INFO] --- maven-remote-resources-plugin:1.3:process (default) @ chef ---
Downloading: https://oss.sonatype.org/content/repositories/snapshots/org/apache/jclouds/jclouds-project/1.5.11-SNAPSHOT/maven-metadata.xml
Downloading: https://oss.sonatype.org/content/repositories/snapshots/org/apache/jclouds/jclouds-core/1.5.11-SNAPSHOT/maven-metadata.xml
mojoSucceeded org.apache.maven.plugins:maven-remote-resources-plugin:1.3(default)
mojoStarted org.apache.maven.plugins:maven-remote-resources-plugin:1.3(process-remote-resources)
[INFO] 
[INFO] --- maven-remote-resources-plugin:1.3:process (process-remote-resources) @ chef ---
Downloading: http://repo.cloudbees.com/content/repositories/central/org/apache/jclouds/jclouds-resources/${jclouds.version}/jclouds-resources-${jclouds.version}.jar
Downloading: https://repository-jclouds.forge.cloudbees.com/release/org/apache/jclouds/jclouds-resources/${jclouds.version}/jclouds-resources-${jclouds.version}.jar
Downloading: http://clojars.org/repo/org/apache/jclouds/jclouds-resources/${jclouds.version}/jclouds-resources-${jclouds.version}.jar
mojoFailed org.apache.maven.plugins:maven-remote-resources-plugin:1.3(process-remote-resources)
projectFailed org.apache.jclouds.api:chef:1.5.11-SNAPSHOT
sessionEnded
[INFO] ------------------------------------------------------------------------
[INFO] Reactor Summary:
[INFO] 
[INFO] JClouds Chef :: Parent POM ........................ SUCCESS [41.157s]
[INFO] JClouds Chef :: Core .............................. FAILURE [11.647s]
[INFO] JClouds Chef :: Servlet ........................... SKIPPED
[INFO] JClouds Chef :: Compute ........................... SKIPPED
[INFO] JClouds Chef :: Private Chef ...................... SKIPPED
[INFO] JClouds Chef :: Hosted Chef ....................... SKIPPED
[INFO] JClouds Chef :: Labs .............................. SKIPPED
[INFO] JClouds Chef :: Project POM ....................... SKIPPED
[INFO] ------------------------------------------------------------------------
[INFO] BUILD FAILURE
[INFO] ------------------------------------------------------------------------
[INFO] Total time: 1:05.456s
[INFO] Finished at: Tue May 28 18:19:59 EDT 2013
[Unloading class GregorSamsa$1]
[Unloading class GregorSamsa$0]
[Unloading class GregorSamsa$2]
[Unloading class GregorSamsa]
[INFO] Final Memory: 17M/186M
[INFO] ------------------------------------------------------------------------
Projects to build: [MavenProject: org.apache.jclouds.chef:chef-parent:1.5.11-SNAPSHOT @ <https://jclouds.ci.cloudbees.com/job/jclouds-chef-1.5.x-branch/ws/project/pom.xml,> MavenProject: org.apache.jclouds.api:chef:1.5.11-SNAPSHOT @ <https://jclouds.ci.cloudbees.com/job/jclouds-chef-1.5.x-branch/ws/core/pom.xml,> MavenProject: org.apache.jclouds.chef:chef-servlet:1.5.11-SNAPSHOT @ <https://jclouds.ci.cloudbees.com/job/jclouds-chef-1.5.x-branch/ws/servlet/pom.xml,> MavenProject: org.apache.jclouds.chef:chef-compute:1.5.11-SNAPSHOT @ <https://jclouds.ci.cloudbees.com/job/jclouds-chef-1.5.x-branch/ws/compute/pom.xml,> MavenProject: org.apache.jclouds.labs:privatechef:1.5.11-SNAPSHOT @ <https://jclouds.ci.cloudbees.com/job/jclouds-chef-1.5.x-branch/ws/labs/privatechef/pom.xml,> MavenProject: org.apache.jclouds.labs:hostedchef:1.5.11-SNAPSHOT @ <https://jclouds.ci.cloudbees.com/job/jclouds-chef-1.5.x-branch/ws/labs/hostedchef/pom.xml,> MavenProject: org.apache.jclouds.labs:chef-labs-project:1.5.11-SNAPSHOT @ <https://jclouds.ci.cloudbees.com/job/jclouds-chef-1.5.x-branch/ws/labs/pom.xml,> MavenProject: org.apache.jclouds.chef:chef-project:1.5.11-SNAPSHOT @ <https://jclouds.ci.cloudbees.com/job/jclouds-chef-1.5.x-branch/ws/pom.xml]>
[JENKINS] Archiving <https://jclouds.ci.cloudbees.com/job/jclouds-chef-1.5.x-branch/ws/labs/privatechef/pom.xml> to /home/jclouds/hudson_home/jobs/jclouds-chef-1.5.x-branch/modules/org.apache.jclouds.labs$privatechef/builds/2013-05-28_18-18-43/archive/org.apache.jclouds.labs/privatechef/1.5.11-SNAPSHOT/privatechef-1.5.11-SNAPSHOT.pom
[JENKINS] Archiving <https://jclouds.ci.cloudbees.com/job/jclouds-chef-1.5.x-branch/ws/labs/pom.xml> to /home/jclouds/hudson_home/jobs/jclouds-chef-1.5.x-branch/modules/org.apache.jclouds.labs$chef-labs-project/builds/2013-05-28_18-18-43/archive/org.apache.jclouds.labs/chef-labs-project/1.5.11-SNAPSHOT/chef-labs-project-1.5.11-SNAPSHOT.pom
[JENKINS] Archiving <https://jclouds.ci.cloudbees.com/job/jclouds-chef-1.5.x-branch/ws/servlet/pom.xml> to /home/jclouds/hudson_home/jobs/jclouds-chef-1.5.x-branch/modules/org.apache.jclouds.chef$chef-servlet/builds/2013-05-28_18-18-43/archive/org.apache.jclouds.chef/chef-servlet/1.5.11-SNAPSHOT/chef-servlet-1.5.11-SNAPSHOT.pom
[JENKINS] Archiving <https://jclouds.ci.cloudbees.com/job/jclouds-chef-1.5.x-branch/ws/compute/pom.xml> to /home/jclouds/hudson_home/jobs/jclouds-chef-1.5.x-branch/modules/org.apache.jclouds.chef$chef-compute/builds/2013-05-28_18-18-43/archive/org.apache.jclouds.chef/chef-compute/1.5.11-SNAPSHOT/chef-compute-1.5.11-SNAPSHOT.pom
[JENKINS] Archiving <https://jclouds.ci.cloudbees.com/job/jclouds-chef-1.5.x-branch/ws/core/pom.xml> to /home/jclouds/hudson_home/jobs/jclouds-chef-1.5.x-branch/modules/org.apache.jclouds.api$chef/builds/2013-05-28_18-18-43/archive/org.apache.jclouds.api/chef/1.5.11-SNAPSHOT/chef-1.5.11-SNAPSHOT.pom
[JENKINS] Archiving <https://jclouds.ci.cloudbees.com/job/jclouds-chef-1.5.x-branch/ws/project/pom.xml> to /home/jclouds/hudson_home/jobs/jclouds-chef-1.5.x-branch/modules/org.apache.jclouds.chef$chef-parent/builds/2013-05-28_18-18-43/archive/org.apache.jclouds.chef/chef-parent/1.5.11-SNAPSHOT/chef-parent-1.5.11-SNAPSHOT.pom
[JENKINS] Archiving <https://jclouds.ci.cloudbees.com/job/jclouds-chef-1.5.x-branch/ws/project/target/chef-parent-1.5.11-SNAPSHOT-tests.jar> to /home/jclouds/hudson_home/jobs/jclouds-chef-1.5.x-branch/modules/org.apache.jclouds.chef$chef-parent/builds/2013-05-28_18-18-43/archive/org.apache.jclouds.chef/chef-parent/1.5.11-20130528.221944-10/chef-parent-1.5.11-20130528.221944-10-tests.jar
[JENKINS] Archiving <https://jclouds.ci.cloudbees.com/job/jclouds-chef-1.5.x-branch/ws/labs/hostedchef/pom.xml> to /home/jclouds/hudson_home/jobs/jclouds-chef-1.5.x-branch/modules/org.apache.jclouds.labs$hostedchef/builds/2013-05-28_18-18-43/archive/org.apache.jclouds.labs/hostedchef/1.5.11-SNAPSHOT/hostedchef-1.5.11-SNAPSHOT.pom
[JENKINS] Archiving <https://jclouds.ci.cloudbees.com/job/jclouds-chef-1.5.x-branch/ws/pom.xml> to /home/jclouds/hudson_home/jobs/jclouds-chef-1.5.x-branch/modules/org.apache.jclouds.chef$chef-project/builds/2013-05-28_18-18-43/archive/org.apache.jclouds.chef/chef-project/1.5.11-SNAPSHOT/chef-project-1.5.11-SNAPSHOT.pom
Waiting for Jenkins to finish collecting data
mavenExecutionResult exceptions not empty
message : Failed to execute goal org.apache.maven.plugins:maven-remote-resources-plugin:1.3:process (process-remote-resources) on project chef: Resources archive cannot be found.
cause : Resources archive cannot be found.
Stack trace : 
org.apache.maven.lifecycle.LifecycleExecutionException: Failed to execute goal org.apache.maven.plugins:maven-remote-resources-plugin:1.3:process (process-remote-resources) on project chef: Resources archive cannot be found.
	at org.apache.maven.lifecycle.internal.MojoExecutor.execute(MojoExecutor.java:217)
	at org.apache.maven.lifecycle.internal.MojoExecutor.execute(MojoExecutor.java:153)
	at org.apache.maven.lifecycle.internal.MojoExecutor.execute(MojoExecutor.java:145)
	at org.apache.maven.lifecycle.internal.LifecycleModuleBuilder.buildProject(LifecycleModuleBuilder.java:84)
	at org.apache.maven.lifecycle.internal.LifecycleModuleBuilder.buildProject(LifecycleModuleBuilder.java:59)
	at org.apache.maven.lifecycle.internal.LifecycleStarter.singleThreadedBuild(LifecycleStarter.java:183)
	at org.apache.maven.lifecycle.internal.LifecycleStarter.execute(LifecycleStarter.java:161)
	at org.apache.maven.DefaultMaven.doExecute(DefaultMaven.java:319)
	at org.apache.maven.DefaultMaven.execute(DefaultMaven.java:156)
	at org.jvnet.hudson.maven3.launcher.Maven3Launcher.main(Maven3Launcher.java:79)
	at sun.reflect.NativeMethodAccessorImpl.invoke0(Native Method)
	at sun.reflect.NativeMethodAccessorImpl.invoke(NativeMethodAccessorImpl.java:39)
	at sun.reflect.DelegatingMethodAccessorImpl.invoke(DelegatingMethodAccessorImpl.java:25)
	at java.lang.reflect.Method.invoke(Method.java:597)
	at org.codehaus.plexus.classworlds.launcher.Launcher.launchStandard(Launcher.java:329)
	at org.codehaus.plexus.classworlds.launcher.Launcher.launch(Launcher.java:239)
	at org.jvnet.hudson.maven3.agent.Maven3Main.launch(Maven3Main.java:158)
	at hudson.maven.Maven3Builder.call(Maven3Builder.java:98)
	at hudson.maven.Maven3Builder.call(Maven3Builder.java:64)
	at hudson.remoting.UserRequest.perform(UserRequest.java:118)
	at hudson.remoting.UserRequest.perform(UserRequest.java:48)
	at hudson.remoting.Request$2.run(Request.java:326)
	at hudson.remoting.InterceptingExecutorService$1.call(InterceptingExecutorService.java:72)
	at java.util.concurrent.FutureTask$Sync.innerRun(FutureTask.java:303)
	at java.util.concurrent.FutureTask.run(FutureTask.java:138)
	at java.util.concurrent.ThreadPoolExecutor$Worker.runTask(ThreadPoolExecutor.java:895)
	at java.util.concurrent.ThreadPoolExecutor$Worker.run(ThreadPoolExecutor.java:918)
	at java.lang.Thread.run(Thread.java:662)
Caused by: org.apache.maven.plugin.MojoExecutionException: Resources archive cannot be found.
	at org.apache.maven.plugin.resources.remote.ProcessRemoteResourcesMojo.downloadBundles(ProcessRemoteResourcesMojo.java:1061)
	at org.apache.maven.plugin.resources.remote.ProcessRemoteResourcesMojo.execute(ProcessRemoteResourcesMojo.java:507)
	at org.apache.maven.plugin.DefaultBuildPluginManager.executeMojo(DefaultBuildPluginManager.java:101)
	at org.apache.maven.lifecycle.internal.MojoExecutor.execute(MojoExecutor.java:209)
	... 27 more
Caused by: org.apache.maven.artifact.resolver.ArtifactNotFoundException: Could not find artifact org.apache.jclouds:jclouds-resources:jar:${jclouds.version} in central (http://repo.cloudbees.com/content/repositories/central)

Try downloading the file manually from the project website.

Then, install it using the command: 
    mvn install:install-file -DgroupId=org.apache.jclouds -DartifactId=jclouds-resources -Dversion=${jclouds.version} -Dpackaging=jar -Dfile=/path/to/file

Alternatively, if you host your own repository you can deploy the file there: 
    mvn deploy:deploy-file -DgroupId=org.apache.jclouds -DartifactId=jclouds-resources -Dversion=${jclouds.version} -Dpackaging=jar -Dfile=/path/to/file -Durl=[url] -DrepositoryId=[id]


  org.apache.jclouds:jclouds-resources:jar:${jclouds.version}

from the specified remote repositories:
  central (http://repo.cloudbees.com/content/repositories/central, releases=true, snapshots=false),
  cloudbees-private-snapshot-repository (https://repository-jclouds.forge.cloudbees.com/snapshot, releases=false, snapshots=true),
  cloudbees-private-release-repository (https://repository-jclouds.forge.cloudbees.com/release, releases=true, snapshots=false),
  apache-snapshots (https://repository.apache.org/content/repositories/snapshots, releases=false, snapshots=true),
  sonatype-nexus-snapshots (https://oss.sonatype.org/content/repositories/snapshots, releases=false, snapshots=true),
  clojars (http://clojars.org/repo/, releases=true, snapshots=true),
  apache.snapshots (http://repository.apache.org/snapshots, releases=false, snapshots=true)

	at org.apache.maven.artifact.resolver.DefaultArtifactResolver.resolve(DefaultArtifactResolver.java:219)
	at org.apache.maven.artifact.resolver.DefaultArtifactResolver.resolve(DefaultArtifactResolver.java:157)
	at org.apache.maven.artifact.resolver.DefaultArtifactResolver.resolve(DefaultArtifactResolver.java:525)
	at org.apache.maven.plugin.resources.remote.ProcessRemoteResourcesMojo.downloadBundles(ProcessRemoteResourcesMojo.java:1048)
	... 30 more
Caused by: org.sonatype.aether.resolution.ArtifactResolutionException: Could not find artifact org.apache.jclouds:jclouds-resources:jar:${jclouds.version} in central (http://repo.cloudbees.com/content/repositories/central)
	at org.sonatype.aether.impl.internal.DefaultArtifactResolver.resolve(DefaultArtifactResolver.java:541)
	at org.sonatype.aether.impl.internal.DefaultArtifactResolver.resolveArtifacts(DefaultArtifactResolver.java:220)
	at org.sonatype.aether.impl.internal.DefaultArtifactResolver.resolveArtifact(DefaultArtifactResolver.java:197)
	at org.sonatype.aether.impl.internal.DefaultRepositorySystem.resolveArtifact(DefaultRepositorySystem.java:323)
	at org.apache.maven.artifact.resolver.DefaultArtifactResolver.resolve(DefaultArtifactResolver.java:213)
	... 33 more
Caused by: org.sonatype.aether.transfer.ArtifactNotFoundException: Could not find artifact org.apache.jclouds:jclouds-resources:jar:${jclouds.version} in central (http://repo.cloudbees.com/content/repositories/central)
	at org.sonatype.aether.connector.wagon.WagonRepositoryConnector$4.wrap(WagonRepositoryConnector.java:945)
	at org.sonatype.aether.connector.wagon.WagonRepositoryConnector$4.wrap(WagonRepositoryConnector.java:940)
	at org.sonatype.aether.connector.wagon.WagonRepositoryConnector$GetTask.flush(WagonRepositoryConnector.java:695)
	at org.sonatype.aether.connector.wagon.WagonRepositoryConnector$GetTask.flush(WagonRepositoryConnector.java:689)
	at org.sonatype.aether.connector.wagon.WagonRepositoryConnector.get(WagonRepositoryConnector.java:445)
	at org.sonatype.aether.impl.internal.DefaultArtifactResolver.resolve(DefaultArtifactResolver.java:460)
	... 37 more
Sending e-mails to: dev@jclouds.incubator.apache.org
channel stopped

Jenkins build is back to normal : jclouds-chef-1.5.x-branch #111

Posted by je...@cloudbees.com.
See <https://jclouds.ci.cloudbees.com/job/jclouds-chef-1.5.x-branch/111/changes>