You are viewing a plain text version of this content. The canonical link for it is here.
Posted to dev@pdfbox.apache.org by Apache Jenkins Server <je...@builds.apache.org> on 2024/05/07 19:20:42 UTC
Build failed in Jenkins: PDFBox » PDFBox-3.0.x #306
See <https://ci-builds.apache.org/job/PDFBox/job/PDFBox-3.0.x/306/display/redirect?page=changes>
Changes:
[Tilman Hausherr] PDFBOX-5812: improve exception message + test, as suggested by Toshiaki Ito
------------------------------------------
Started by user Tilman Hausherr
Started by an SCM change
Running as SYSTEM
[EnvInject] - Loading node environment variables.
Building remotely on builds31 (ubuntu) in workspace <https://ci-builds.apache.org/job/PDFBox/job/PDFBox-3.0.x/ws/>
Checking out a fresh workspace because there's no workspace at <https://ci-builds.apache.org/job/PDFBox/job/PDFBox-3.0.x/ws/>
Cleaning local Directory .
Checking out http://svn.apache.org/repos/asf/pdfbox/branches/3.0 at revision '2024-05-07T19:18:18.185 +0000' --quiet
At revision 1917560
Parsing POMs
Modules changed, recalculating dependency graph
Established TCP socket on 42519
maven35-agent.jar already up to date
maven35-interceptor.jar already up to date
maven3-interceptor-commons.jar already up to date
[PDFBox-3.0.x] $ /home/jenkins/tools/java/latest11/bin/java -cp /home/jenkins/maven35-agent.jar:/home/jenkins/tools/maven/apache-maven-3.8.7/boot/plexus-classworlds-2.6.0.jar:/home/jenkins/tools/maven/apache-maven-3.8.7/conf/logging jenkins.maven3.agent.Maven35Main /home/jenkins/tools/maven/apache-maven-3.8.7 /home/jenkins/agent.jar /home/jenkins/maven35-interceptor.jar /home/jenkins/maven3-interceptor-commons.jar 42519
<===[JENKINS REMOTING CAPACITY]===> channel started
Executing Maven: -B -f <https://ci-builds.apache.org/job/PDFBox/job/PDFBox-3.0.x/ws/pom.xml> clean deploy -Dskip-bavaria=false -Ppedantic -Dmaven.source.skip=true org.sonatype.ossindex.maven:ossindex-maven-plugin:audit -Dorg.apache.pdfbox.examples.pdmodel.tsa=http://time.certum.pl
[INFO] Scanning for projects...
[HUDSON] Collecting dependencies info
[HUDSON] Collecting dependencies info
[HUDSON] Collecting dependencies info
[HUDSON] Collecting dependencies info
[HUDSON] Collecting dependencies info
[HUDSON] Collecting dependencies info
[HUDSON] Collecting dependencies info[INFO] ------------------------------------------------------------------------
[INFO] Reactor Build Order:
[HUDSON] Collecting dependencies info[INFO]
[HUDSON] Collecting dependencies info
[HUDSON] Collecting dependencies info
[HUDSON] Collecting dependencies info
[HUDSON] Collecting dependencies info
[INFO] Apache PDFBox parent [pom]
[INFO] Apache PDFBox io [bundle]
[INFO] Apache FontBox [bundle]
[INFO] Apache XmpBox [bundle]
[INFO] Apache PDFBox [bundle]
[INFO] Apache Preflight [bundle]
[INFO] Apache Preflight application [bundle]
[INFO] Apache PDFBox Debugger [jar]
[INFO] Apache PDFBox tools [jar]
[INFO] Apache PDFBox application [bundle]
[INFO] Apache PDFBox Debugger application [bundle]
[INFO] Apache PDFBox examples [jar]
[INFO] Downloading from Nexus: https://repository.apache.org/snapshots/org/sonatype/ossindex/maven/ossindex-maven-plugin/maven-metadata.xml
[INFO]
[INFO] ------------------< org.apache.pdfbox:pdfbox-parent >-------------------
[INFO] Building Apache PDFBox parent 3.0.3-SNAPSHOT [1/12]
[INFO] --------------------------------[ pom ]---------------------------------
[INFO]
[INFO] --- maven-clean-plugin:3.3.2:clean (default-clean) @ pdfbox-parent ---
[INFO]
[INFO] --- maven-enforcer-plugin:3.4.1:enforce (default) @ pdfbox-parent ---
[INFO] Rule 0: org.apache.maven.enforcer.rules.version.RequireMavenVersion passed
[INFO]
[INFO] --- maven-enforcer-plugin:3.4.1:enforce (enforce-maven-version) @ pdfbox-parent ---
[INFO] Rule 0: org.apache.maven.enforcer.rules.version.RequireMavenVersion passed
[INFO]
[INFO] --- maven-enforcer-plugin:3.4.1:enforce (enforce-java-version) @ pdfbox-parent ---
[INFO] Rule 0: org.apache.maven.enforcer.rules.version.RequireJavaVersion passed
[INFO]
[INFO] --- maven-remote-resources-plugin:3.2.0:process (process-resource-bundles) @ pdfbox-parent ---
[INFO] Preparing remote bundle org.apache.apache.resources:apache-jar-resource-bundle:1.5
[INFO] Copying 3 resources from 1 bundle.
[INFO]
[INFO] --- animal-sniffer-maven-plugin:1.23:check (check-java-version) @ pdfbox-parent ---
[INFO] Checking unresolved references to org.codehaus.mojo.signature:java18:1.0
[INFO]
[INFO] --- apache-rat-plugin:0.16.1:check (default) @ pdfbox-parent ---
[INFO] Rat check: Summary over all files. Unapproved: 0, unknown: 0, generated: 0, approved: 11 licenses.
[INFO]
[INFO] --- dependency-check-maven:9.1.0:check (default) @ pdfbox-parent ---
[ERROR] Incompatible or corrupt database found. To resolve this issue please remove the existing database by running purge
[WARNING] Attempt to (de-)serialize anonymous class org.jfrog.hudson.maven2.MavenDependenciesRecorder$1; see: https://jenkins.io/redirect/serialization-of-anonymous-classes/
[INFO] ------------------------------------------------------------------------
[INFO] Reactor Summary for Apache PDFBox parent 3.0.3-SNAPSHOT:
[INFO]
[INFO] Apache PDFBox parent ............................... FAILURE [ 16.781 s]
[INFO] Apache PDFBox io ................................... SKIPPED
[INFO] Apache FontBox ..................................... SKIPPED
[INFO] Apache XmpBox ...................................... SKIPPED
[INFO] Apache PDFBox ...................................... SKIPPED
[INFO] Apache Preflight ................................... SKIPPED
[INFO] Apache Preflight application ....................... SKIPPED
[INFO] Apache PDFBox Debugger ............................. SKIPPED
[INFO] Apache PDFBox tools ................................ SKIPPED
[INFO] Apache PDFBox application .......................... SKIPPED
[INFO] Apache PDFBox Debugger application ................. SKIPPED
[INFO] Apache PDFBox examples ............................. SKIPPED
[INFO] ------------------------------------------------------------------------
[INFO] BUILD FAILURE
[INFO] ------------------------------------------------------------------------
[INFO] Total time: 41.378 s
[INFO] Finished at: 2024-05-07T19:20:15Z
[INFO] ------------------------------------------------------------------------
Waiting for Jenkins to finish collecting data
[ERROR] Failed to execute goal org.owasp:dependency-check-maven:9.1.0:check (default) on project pdfbox-parent: Fatal exception(s) analyzing Apache PDFBox parent: One or more exceptions occurred during analysis:
[ERROR] DatabaseException: Unable to connect to the dependency-check database
[ERROR] caused by DatabaseException: Incompatible or corrupt database found; run the purge command to resolve the issue
[ERROR] -> [Help 1]
[ERROR]
[ERROR] To see the full stack trace of the errors, re-run Maven with the -e switch.
[ERROR] Re-run Maven using the -X switch to enable full debug logging.
[ERROR]
[ERROR] For more information about the errors and possible solutions, please read the following articles:
[ERROR] [Help 1] http://cwiki.apache.org/confluence/display/MAVEN/MojoExecutionException
[JENKINS] Archiving <https://ci-builds.apache.org/job/PDFBox/job/PDFBox-3.0.x/ws/xmpbox/pom.xml> to org.apache.pdfbox/xmpbox/3.0.3-SNAPSHOT/xmpbox-3.0.3-SNAPSHOT.pom
[JENKINS] Archiving <https://ci-builds.apache.org/job/PDFBox/job/PDFBox-3.0.x/ws/tools/pom.xml> to org.apache.pdfbox/pdfbox-tools/3.0.3-SNAPSHOT/pdfbox-tools-3.0.3-SNAPSHOT.pom
[JENKINS] Archiving <https://ci-builds.apache.org/job/PDFBox/job/PDFBox-3.0.x/ws/debugger/pom.xml> to org.apache.pdfbox/pdfbox-debugger/3.0.3-SNAPSHOT/pdfbox-debugger-3.0.3-SNAPSHOT.pom
[JENKINS] Archiving <https://ci-builds.apache.org/job/PDFBox/job/PDFBox-3.0.x/ws/preflight-app/pom.xml> to org.apache.pdfbox/preflight-app/3.0.3-SNAPSHOT/preflight-app-3.0.3-SNAPSHOT.pom
[JENKINS] Archiving <https://ci-builds.apache.org/job/PDFBox/job/PDFBox-3.0.x/ws/app/pom.xml> to org.apache.pdfbox/pdfbox-app/3.0.3-SNAPSHOT/pdfbox-app-3.0.3-SNAPSHOT.pom
[JENKINS] Archiving <https://ci-builds.apache.org/job/PDFBox/job/PDFBox-3.0.x/ws/examples/pom.xml> to org.apache.pdfbox/pdfbox-examples/3.0.3-SNAPSHOT/pdfbox-examples-3.0.3-SNAPSHOT.pom
[JENKINS] Archiving <https://ci-builds.apache.org/job/PDFBox/job/PDFBox-3.0.x/ws/preflight/pom.xml> to org.apache.pdfbox/preflight/3.0.3-SNAPSHOT/preflight-3.0.3-SNAPSHOT.pom
[JENKINS] Archiving <https://ci-builds.apache.org/job/PDFBox/job/PDFBox-3.0.x/ws/pom.xml> to org.apache.pdfbox/pdfbox-parent/3.0.3-SNAPSHOT/pdfbox-parent-3.0.3-SNAPSHOT.pom
[JENKINS] Archiving <https://ci-builds.apache.org/job/PDFBox/job/PDFBox-3.0.x/ws/pdfbox/pom.xml> to org.apache.pdfbox/pdfbox/3.0.3-SNAPSHOT/pdfbox-3.0.3-SNAPSHOT.pom
[JENKINS] Archiving <https://ci-builds.apache.org/job/PDFBox/job/PDFBox-3.0.x/ws/debugger-app/pom.xml> to org.apache.pdfbox/debugger-app/3.0.3-SNAPSHOT/debugger-app-3.0.3-SNAPSHOT.pom
[JENKINS] Archiving <https://ci-builds.apache.org/job/PDFBox/job/PDFBox-3.0.x/ws/io/pom.xml> to org.apache.pdfbox/pdfbox-io/3.0.3-SNAPSHOT/pdfbox-io-3.0.3-SNAPSHOT.pom
[JENKINS] Archiving <https://ci-builds.apache.org/job/PDFBox/job/PDFBox-3.0.x/ws/fontbox/pom.xml> to org.apache.pdfbox/fontbox/3.0.3-SNAPSHOT/fontbox-3.0.3-SNAPSHOT.pom
No mail will be sent out, as 'PDFBox » PDFBox-3.0.x » Apache PDFBox examples #306' does not have a result yet. Please make sure you set a proper result in case of pipeline/build scripts.
Sending e-mails to: dev@pdfbox.apache.org
No mail will be sent out, as 'PDFBox » PDFBox-3.0.x » Apache PDFBox #306' does not have a result yet. Please make sure you set a proper result in case of pipeline/build scripts.
No mail will be sent out, as 'PDFBox » PDFBox-3.0.x » Apache PDFBox Debugger application #306' does not have a result yet. Please make sure you set a proper result in case of pipeline/build scripts.
No mail will be sent out, as 'PDFBox » PDFBox-3.0.x » Apache PDFBox io #306' does not have a result yet. Please make sure you set a proper result in case of pipeline/build scripts.
No mail will be sent out, as 'PDFBox » PDFBox-3.0.x » Apache FontBox #306' does not have a result yet. Please make sure you set a proper result in case of pipeline/build scripts.
No mail will be sent out, as 'PDFBox » PDFBox-3.0.x » Apache XmpBox #306' does not have a result yet. Please make sure you set a proper result in case of pipeline/build scripts.
No mail will be sent out, as 'PDFBox » PDFBox-3.0.x » Apache PDFBox tools #306' does not have a result yet. Please make sure you set a proper result in case of pipeline/build scripts.
No mail will be sent out, as 'PDFBox » PDFBox-3.0.x » Apache PDFBox Debugger #306' does not have a result yet. Please make sure you set a proper result in case of pipeline/build scripts.
No mail will be sent out, as 'PDFBox » PDFBox-3.0.x » Apache Preflight application #306' does not have a result yet. Please make sure you set a proper result in case of pipeline/build scripts.
No mail will be sent out, as 'PDFBox » PDFBox-3.0.x » Apache PDFBox application #306' does not have a result yet. Please make sure you set a proper result in case of pipeline/build scripts.
No mail will be sent out, as 'PDFBox » PDFBox-3.0.x » Apache Preflight #306' does not have a result yet. Please make sure you set a proper result in case of pipeline/build scripts.
channel stopped
Archiving artifacts
---------------------------------------------------------------------
To unsubscribe, e-mail: dev-unsubscribe@pdfbox.apache.org
For additional commands, e-mail: dev-help@pdfbox.apache.org