You are viewing a plain text version of this content. The canonical link for it is here.
Posted to yarn-dev@hadoop.apache.org by Apache Jenkins Server <je...@builds.apache.org> on 2015/08/01 04:27:17 UTC
Failed: YARN-3984 PreCommit Build #8744
Jira: https://issues.apache.org/jira/browse/YARN-3984
Build: https://builds.apache.org/job/PreCommit-YARN-Build/8744/
###################################################################################
########################## LAST 60 LINES OF THE CONSOLE ###########################
[...truncated 296 lines...]
| | | | the total number of release audit
| | | | warnings.
| +1 | checkstyle | 0m 16s | There were no new checkstyle
| | | | issues.
| +1 | whitespace | 0m 0s | The patch has no lines that end in
| | | | whitespace.
| +1 | install | 1m 30s | mvn install still works.
| +1 | eclipse:eclipse | 0m 41s | The patch built with
| | | | eclipse:eclipse.
| +1 | findbugs | 0m 48s | The patch does not introduce any
| | | | new Findbugs (version 3.0.0)
| | | | warnings.
| +1 | yarn tests | 1m 22s | Tests passed in
| | | | hadoop-yarn-server-timelineservice.
| | | 38m 46s |
|| Subsystem || Report/Notes ||
============================================================================
| Patch URL | http://issues.apache.org/jira/secure/attachment/12748270/YARN-3984-YARN-2928.001.patch |
| Optional Tests | javadoc javac unit findbugs checkstyle |
| git revision | YARN-2928 / df0ec47 |
| hadoop-yarn-server-timelineservice test log | /home/jenkins/jenkins-slave/workspace/PreCommit-YARN-Build/patchprocess/testrun_hadoop-yarn-server-timelineservice.txt |
| Test Results | https://builds.apache.org/job/PreCommit-YARN-Build/8744/testReport/ |
| Java | 1.7.0_55 |
| uname | Linux asf905.gq1.ygridcore.net 3.13.0-36-lowlatency #63-Ubuntu SMP PREEMPT Wed Sep 3 21:56:12 UTC 2014 x86_64 x86_64 x86_64 GNU/Linux |
============================================================================
============================================================================
Adding comment to JIRA
============================================================================
============================================================================
Comment added.
1437c34eb9c4e3bfc3f76f60632e2144bbc37a22 logged out
============================================================================
============================================================================
Finished build.
============================================================================
============================================================================
Build step 'Execute shell' marked build as failure
Archiving artifacts
Sending artifact delta relative to PreCommit-YARN-Build #8718
Archived 27 artifacts
Archive block size is 32768
Received 156 blocks and 4944389 bytes
Compression is 50.8%
Took 1.7 sec
[description-setter] Could not determine description.
Recording test results
Publish JUnit test result report is waiting for a checkpoint on PreCommit-YARN-Build #8743
Email was triggered for: Failure
Sending email for trigger: Failure
###################################################################################
############################## FAILED TESTS (if any) ##############################
All tests passed
Failed: YARN-3983 PreCommit Build #8745
Posted by Apache Jenkins Server <je...@builds.apache.org>.
Jira: https://issues.apache.org/jira/browse/YARN-3983
Build: https://builds.apache.org/job/PreCommit-YARN-Build/8745/
###################################################################################
########################## LAST 60 LINES OF THE CONSOLE ###########################
[...truncated 337 lines...]
| | | | --whitespace=fix.
| +1 | install | 1m 25s | mvn install still works.
| +1 | eclipse:eclipse | 0m 34s | The patch built with
| | | | eclipse:eclipse.
| +1 | findbugs | 1m 27s | The patch does not introduce any
| | | | new Findbugs (version 3.0.0)
| | | | warnings.
| -1 | yarn tests | 52m 51s | Tests failed in
| | | | hadoop-yarn-server-resourcemanager.
| | | 90m 39s |
Reason | Tests
Failed unit tests | hadoop.yarn.server.resourcemanager.scheduler.fair.TestAllocationFileLoaderService
|| Subsystem || Report/Notes ||
============================================================================
| Patch URL | http://issues.apache.org/jira/secure/attachment/12748251/YARN-3983.3.patch |
| Optional Tests | javadoc javac unit findbugs checkstyle |
| git revision | trunk / d311a38 |
| Release Audit | /home/jenkins/jenkins-slave/workspace/PreCommit-YARN-Build@2/patchprocess/patchReleaseAuditProblems.txt |
| whitespace | /home/jenkins/jenkins-slave/workspace/PreCommit-YARN-Build@2/patchprocess/whitespace.txt |
| hadoop-yarn-server-resourcemanager test log | /home/jenkins/jenkins-slave/workspace/PreCommit-YARN-Build@2/patchprocess/testrun_hadoop-yarn-server-resourcemanager.txt |
| Test Results | https://builds.apache.org/job/PreCommit-YARN-Build/8745/testReport/ |
| Java | 1.7.0_55 |
| uname | Linux asf904.gq1.ygridcore.net 3.13.0-36-lowlatency #63-Ubuntu SMP PREEMPT Wed Sep 3 21:56:12 UTC 2014 x86_64 x86_64 x86_64 GNU/Linux |
============================================================================
============================================================================
Adding comment to JIRA
============================================================================
============================================================================
Comment added.
948c968d500e2ed4ea8971ce3386e5d352446570 logged out
============================================================================
============================================================================
Finished build.
============================================================================
============================================================================
Build step 'Execute shell' marked build as failure
Archiving artifacts
Sending artifact delta relative to PreCommit-YARN-Build #8718
Archived 28 artifacts
Archive block size is 32768
Received 3 blocks and 9171029 bytes
Compression is 1.1%
Took 1.9 sec
[description-setter] Could not determine description.
Recording test results
Email was triggered for: Failure
Sending email for trigger: Failure
###################################################################################
############################## FAILED TESTS (if any) ##############################
1 tests failed.
FAILED: org.apache.hadoop.yarn.server.resourcemanager.scheduler.fair.TestAllocationFileLoaderService.testGetAllocationFileFromClasspath
Error Message:
null
Stack Trace:
java.lang.AssertionError: null
at org.junit.Assert.fail(Assert.java:86)
at org.junit.Assert.assertTrue(Assert.java:41)
at org.junit.Assert.assertTrue(Assert.java:52)
at org.apache.hadoop.yarn.server.resourcemanager.scheduler.fair.TestAllocationFileLoaderService.testGetAllocationFileFromClasspath(TestAllocationFileLoaderService.java:54)