You are viewing a plain text version of this content. The canonical link for it is here.
Posted to builds@cassandra.apache.org by Apache Jenkins Server <je...@builds.apache.org> on 2023/09/01 01:53:48 UTC

Build complete: Cassandra-trunk #1693 [UNSTABLE] 1f1ec5f503f51ee136f6258d6690cac38f0879f1

-------------------------------------------------------------------------------
Build Cassandra-trunk #1693 Still Unstable
URL: https://ci-cassandra.apache.org/job/Cassandra-trunk/1693/
-------------------------------------------------------------------------------
Changes:
[Stefan Miklosovic] Refactor validation logic in StorageService.rebuild


-------------------------------------------------------------------------------
Failed Tests:
28 tests failed.
FAILED:  dtest-large-novnode.replace_address_test.TestReplaceAddress.test_restart_failed_replace_with_reset_resume_state
FAILED:  dtest-large.replace_address_test.TestReplaceAddress.test_replace_active_node
FAILED:  dtest-novnode.rebuild_test.TestRebuild.test_resumable_rebuild
FAILED:  dtest-novnode.secondary_indexes_test.TestPreJoinCallback.test_resume
FAILED:  dtest-novnode.transient_replication_test.TestTransientReplicationRepairStreamEntireSSTable.test_speculative_write_repair_cycle
FAILED:  dtest-novnode.cqlsh_tests.test_cqlsh.TestCqlshSmoke.test_create_table
FAILED:  dtest-novnode.cqlsh_tests.test_cqlsh_copy.TestCqlshCopy.test_wrong_number_of_columns
FAILED:  dtest-novnode.repair_tests.repair_test.TestRepair.test_simple_sequential_repair
FAILED:  dtest-novnode.replace_address_test.TestReplaceAddress.test_replace_with_insufficient_replicas
FAILED:  dtest-offheap.materialized_views_test.TestMaterializedViews.test_resume_stopped_build
FAILED:  dtest-offheap.secondary_indexes_test.TestPreJoinCallback.test_resume
FAILED:  dtest-upgrade.upgrade_tests.upgrade_through_versions_test.TestProtoV4Upgrade_AllVersions_EndsAt_Trunk_HEAD.test_parallel_upgrade_with_internode_ssl
FAILED:  dtest-upgrade.upgrade_tests.upgrade_through_versions_test.TestUpgrade_indev_4_0_x_To_indev_trunk.test_bootstrap_multidc
FAILED:  dtest.cqlsh_tests.test_cqlsh_copy.TestCqlshCopy.test_bulk_round_trip_blogposts
FAILED:  dtest.repair_tests.repair_test.TestRepair.test_dc_parallel_repair
FAILED:  dtest.rebuild_test.TestRebuild.test_resumable_rebuild
FAILED:  org.apache.cassandra.distributed.upgrade.MixedModeAvailabilityV30AllOneTest.testAvailabilityCoordinatorUpgraded-.jdk11
FAILED:  org.apache.cassandra.dht.tokenallocator.Murmur3ReplicationAwareTokenAllocatorTest.testExistingCluster-cassandra.testtag_IS_UNDEFINED
FAILED:  org.apache.cassandra.utils.LongBloomFilterTest.testConstrained-cassandra.testtag_IS_UNDEFINED
FAILED:  dtest-large.replace_address_test.TestReplaceAddress.test_restart_failed_replace
FAILED:  dtest-large.replace_address_test.TestReplaceAddress.test_restart_failed_replace
FAILED:  dtest-large-novnode.replace_address_test.TestReplaceAddress.test_resume_failed_replace
FAILED:  dtest-large-novnode.replace_address_test.TestReplaceAddress.test_resume_failed_replace
FAILED:  dtest-large-novnode.replace_address_test.TestReplaceAddress.test_restart_failed_replace
FAILED:  dtest-large.replace_address_test.TestReplaceAddress.test_resume_failed_replace
FAILED:  dtest-large.replace_address_test.TestReplaceAddress.test_restart_failed_replace_with_reset_resume_state
FAILED:  dtest-large.replace_address_test.TestReplaceAddress.test_resume_failed_replace
FAILED:  dtest-large.replace_address_test.TestReplaceAddress.test_restart_failed_replace_with_reset_resume_state

-------------------------------------------------------------------------------
For complete test report and logs see https://nightlies.apache.org/cassandra/Cassandra-trunk/1693/