You are viewing a plain text version of this content. The canonical link for it is here.
Posted to commits@phoenix.apache.org by Apache Jenkins Server <je...@builds.apache.org> on 2016/04/29 10:45:14 UTC

Build failed in Jenkins: Phoenix-4.x-HBase-1.1 #6

See <https://builds.apache.org/job/Phoenix-4.x-HBase-1.1/6/changes>

Changes:

[samarth] PHOENIX-2866 Fix UpsertValuesIT to get builds green again

------------------------------------------
[...truncated 2060 lines...]
Caused by: java.lang.RuntimeException: Master not initialized after 200000ms seconds

Running org.apache.phoenix.end2end.index.ImmutableIndexWithStatsIT
Tests run: 1, Failures: 0, Errors: 1, Skipped: 0, Time elapsed: 0.007 sec <<< FAILURE! - in org.apache.phoenix.end2end.index.ImmutableIndexWithStatsIT
org.apache.phoenix.end2end.index.ImmutableIndexWithStatsIT  Time elapsed: 0.006 sec  <<< ERROR!
java.lang.RuntimeException: java.io.IOException: Shutting down
	at org.apache.phoenix.end2end.index.ImmutableIndexWithStatsIT.doSetup(ImmutableIndexWithStatsIT.java:52)
Caused by: java.io.IOException: Shutting down
	at org.apache.phoenix.end2end.index.ImmutableIndexWithStatsIT.doSetup(ImmutableIndexWithStatsIT.java:52)
Caused by: java.lang.RuntimeException: Master not initialized after 200000ms seconds
	at org.apache.phoenix.end2end.index.ImmutableIndexWithStatsIT.doSetup(ImmutableIndexWithStatsIT.java:52)

Running org.apache.phoenix.end2end.index.MutableIndexFailureIT
Running org.apache.phoenix.end2end.index.MutableIndexReplicationIT
Tests run: 1, Failures: 0, Errors: 1, Skipped: 0, Time elapsed: 0.006 sec <<< FAILURE! - in org.apache.phoenix.end2end.index.MutableIndexFailureIT
org.apache.phoenix.end2end.index.MutableIndexFailureIT  Time elapsed: 0.005 sec  <<< ERROR!
java.lang.RuntimeException: java.io.IOException: Shutting down
	at org.apache.phoenix.end2end.index.MutableIndexFailureIT.doSetup(MutableIndexFailureIT.java:113)
Caused by: java.io.IOException: Shutting down
	at org.apache.phoenix.end2end.index.MutableIndexFailureIT.doSetup(MutableIndexFailureIT.java:113)
Caused by: java.lang.RuntimeException: Master not initialized after 200000ms seconds
	at org.apache.phoenix.end2end.index.MutableIndexFailureIT.doSetup(MutableIndexFailureIT.java:113)

Tests run: 1, Failures: 0, Errors: 1, Skipped: 0, Time elapsed: 0.006 sec <<< FAILURE! - in org.apache.phoenix.end2end.index.MutableIndexReplicationIT
org.apache.phoenix.end2end.index.MutableIndexReplicationIT  Time elapsed: 0.005 sec  <<< ERROR!
java.io.IOException: Shutting down
	at org.apache.phoenix.end2end.index.MutableIndexReplicationIT.setupConfigsAndStartCluster(MutableIndexReplicationIT.java:170)
	at org.apache.phoenix.end2end.index.MutableIndexReplicationIT.setUpBeforeClass(MutableIndexReplicationIT.java:108)
Caused by: java.lang.RuntimeException: Master not initialized after 200000ms seconds
	at org.apache.phoenix.end2end.index.MutableIndexReplicationIT.setupConfigsAndStartCluster(MutableIndexReplicationIT.java:170)
	at org.apache.phoenix.end2end.index.MutableIndexReplicationIT.setUpBeforeClass(MutableIndexReplicationIT.java:108)

Running org.apache.phoenix.hbase.index.FailForUnsupportedHBaseVersionsIT
Running org.apache.phoenix.end2end.index.ReadOnlyIndexFailureIT
Tests run: 1, Failures: 0, Errors: 1, Skipped: 0, Time elapsed: 0.006 sec <<< FAILURE! - in org.apache.phoenix.end2end.index.ReadOnlyIndexFailureIT
org.apache.phoenix.end2end.index.ReadOnlyIndexFailureIT  Time elapsed: 0.005 sec  <<< ERROR!
java.lang.RuntimeException: java.io.IOException: Shutting down
	at org.apache.phoenix.end2end.index.ReadOnlyIndexFailureIT.doSetup(ReadOnlyIndexFailureIT.java:116)
Caused by: java.io.IOException: Shutting down
	at org.apache.phoenix.end2end.index.ReadOnlyIndexFailureIT.doSetup(ReadOnlyIndexFailureIT.java:116)
Caused by: java.lang.RuntimeException: Master not initialized after 200000ms seconds
	at org.apache.phoenix.end2end.index.ReadOnlyIndexFailureIT.doSetup(ReadOnlyIndexFailureIT.java:116)

Running org.apache.phoenix.end2end.index.txn.TxWriteFailureIT
Tests run: 1, Failures: 0, Errors: 1, Skipped: 0, Time elapsed: 0.006 sec <<< FAILURE! - in org.apache.phoenix.end2end.index.txn.TxWriteFailureIT
org.apache.phoenix.end2end.index.txn.TxWriteFailureIT  Time elapsed: 0.006 sec  <<< ERROR!
java.lang.RuntimeException: java.io.IOException: Shutting down
	at org.apache.phoenix.end2end.index.txn.TxWriteFailureIT.doSetup(TxWriteFailureIT.java:86)
Caused by: java.io.IOException: Shutting down
	at org.apache.phoenix.end2end.index.txn.TxWriteFailureIT.doSetup(TxWriteFailureIT.java:86)
Caused by: java.lang.RuntimeException: Master not initialized after 200000ms seconds
	at org.apache.phoenix.end2end.index.txn.TxWriteFailureIT.doSetup(TxWriteFailureIT.java:86)

Running org.apache.phoenix.execute.PartialCommitIT
Tests run: 1, Failures: 0, Errors: 1, Skipped: 0, Time elapsed: 0.004 sec <<< FAILURE! - in org.apache.phoenix.execute.PartialCommitIT
org.apache.phoenix.execute.PartialCommitIT  Time elapsed: 0.003 sec  <<< ERROR!
java.lang.RuntimeException: java.io.IOException: Shutting down
	at org.apache.phoenix.execute.PartialCommitIT.doSetup(PartialCommitIT.java:94)
Caused by: java.io.IOException: Shutting down
	at org.apache.phoenix.execute.PartialCommitIT.doSetup(PartialCommitIT.java:94)
Caused by: java.lang.RuntimeException: Master not initialized after 200000ms seconds
	at org.apache.phoenix.execute.PartialCommitIT.doSetup(PartialCommitIT.java:94)

Tests run: 2, Failures: 0, Errors: 1, Skipped: 0, Time elapsed: 207.56 sec <<< FAILURE! - in org.apache.phoenix.hbase.index.FailForUnsupportedHBaseVersionsIT
testDoesNotStartRegionServerForUnsupportedCompressionAndVersion(org.apache.phoenix.hbase.index.FailForUnsupportedHBaseVersionsIT)  Time elapsed: 207.245 sec  <<< ERROR!
java.io.IOException: Shutting down
	at org.apache.phoenix.hbase.index.FailForUnsupportedHBaseVersionsIT.testDoesNotStartRegionServerForUnsupportedCompressionAndVersion(FailForUnsupportedHBaseVersionsIT.java:121)
Caused by: java.lang.RuntimeException: Master not initialized after 200000ms seconds
	at org.apache.phoenix.hbase.index.FailForUnsupportedHBaseVersionsIT.testDoesNotStartRegionServerForUnsupportedCompressionAndVersion(FailForUnsupportedHBaseVersionsIT.java:121)

Running org.apache.phoenix.hbase.index.balancer.IndexLoadBalancerIT
Tests run: 1, Failures: 0, Errors: 1, Skipped: 0, Time elapsed: 0.007 sec <<< FAILURE! - in org.apache.phoenix.hbase.index.balancer.IndexLoadBalancerIT
org.apache.phoenix.hbase.index.balancer.IndexLoadBalancerIT  Time elapsed: 0.005 sec  <<< ERROR!
java.io.IOException: Shutting down
	at org.apache.phoenix.hbase.index.balancer.IndexLoadBalancerIT.setupCluster(IndexLoadBalancerIT.java:87)
Caused by: java.lang.RuntimeException: Master not initialized after 200000ms seconds
	at org.apache.phoenix.hbase.index.balancer.IndexLoadBalancerIT.setupCluster(IndexLoadBalancerIT.java:87)

Running org.apache.phoenix.hbase.index.covered.EndToEndCoveredColumnsIndexBuilderIT
Tests run: 1, Failures: 0, Errors: 1, Skipped: 0, Time elapsed: 0.006 sec <<< FAILURE! - in org.apache.phoenix.hbase.index.covered.EndToEndCoveredColumnsIndexBuilderIT
org.apache.phoenix.hbase.index.covered.EndToEndCoveredColumnsIndexBuilderIT  Time elapsed: 0.005 sec  <<< ERROR!
java.io.IOException: Shutting down
	at org.apache.phoenix.hbase.index.covered.EndToEndCoveredColumnsIndexBuilderIT.setupCluster(EndToEndCoveredColumnsIndexBuilderIT.java:107)
Caused by: java.lang.RuntimeException: Master not initialized after 200000ms seconds
	at org.apache.phoenix.hbase.index.covered.EndToEndCoveredColumnsIndexBuilderIT.setupCluster(EndToEndCoveredColumnsIndexBuilderIT.java:107)

Running org.apache.phoenix.hbase.index.covered.example.EndToEndCoveredIndexingIT
Tests run: 1, Failures: 0, Errors: 1, Skipped: 0, Time elapsed: 0.006 sec <<< FAILURE! - in org.apache.phoenix.hbase.index.covered.example.EndToEndCoveredIndexingIT
org.apache.phoenix.hbase.index.covered.example.EndToEndCoveredIndexingIT  Time elapsed: 0.005 sec  <<< ERROR!
java.io.IOException: Shutting down
	at org.apache.phoenix.hbase.index.covered.example.EndToEndCoveredIndexingIT.setupCluster(EndToEndCoveredIndexingIT.java:131)
Caused by: java.lang.RuntimeException: Master not initialized after 200000ms seconds
	at org.apache.phoenix.hbase.index.covered.example.EndToEndCoveredIndexingIT.setupCluster(EndToEndCoveredIndexingIT.java:131)

Running org.apache.phoenix.hbase.index.covered.example.EndtoEndIndexingWithCompressionIT
Tests run: 1, Failures: 0, Errors: 1, Skipped: 0, Time elapsed: 0.004 sec <<< FAILURE! - in org.apache.phoenix.hbase.index.covered.example.EndtoEndIndexingWithCompressionIT
org.apache.phoenix.hbase.index.covered.example.EndtoEndIndexingWithCompressionIT  Time elapsed: 0.004 sec  <<< ERROR!
java.io.IOException: Shutting down
	at org.apache.phoenix.hbase.index.covered.example.EndtoEndIndexingWithCompressionIT.setupCluster(EndtoEndIndexingWithCompressionIT.java:42)
Caused by: java.lang.RuntimeException: Master not initialized after 200000ms seconds
	at org.apache.phoenix.hbase.index.covered.example.EndtoEndIndexingWithCompressionIT.setupCluster(EndtoEndIndexingWithCompressionIT.java:42)

Running org.apache.phoenix.hbase.index.covered.example.FailWithoutRetriesIT
Tests run: 1, Failures: 0, Errors: 1, Skipped: 0, Time elapsed: 0.004 sec <<< FAILURE! - in org.apache.phoenix.hbase.index.covered.example.FailWithoutRetriesIT
org.apache.phoenix.hbase.index.covered.example.FailWithoutRetriesIT  Time elapsed: 0.003 sec  <<< ERROR!
java.io.IOException: Shutting down
	at org.apache.phoenix.hbase.index.covered.example.FailWithoutRetriesIT.setupCluster(FailWithoutRetriesIT.java:84)
Caused by: java.lang.RuntimeException: Master not initialized after 200000ms seconds
	at org.apache.phoenix.hbase.index.covered.example.FailWithoutRetriesIT.setupCluster(FailWithoutRetriesIT.java:84)

Running org.apache.phoenix.iterate.RoundRobinResultIteratorWithStatsIT
Tests run: 1, Failures: 0, Errors: 1, Skipped: 0, Time elapsed: 0.007 sec <<< FAILURE! - in org.apache.phoenix.iterate.RoundRobinResultIteratorWithStatsIT
org.apache.phoenix.iterate.RoundRobinResultIteratorWithStatsIT  Time elapsed: 0.006 sec  <<< ERROR!
java.lang.RuntimeException: java.io.IOException: Shutting down
	at org.apache.phoenix.iterate.RoundRobinResultIteratorWithStatsIT.doSetup(RoundRobinResultIteratorWithStatsIT.java:58)
Caused by: java.io.IOException: Shutting down
	at org.apache.phoenix.iterate.RoundRobinResultIteratorWithStatsIT.doSetup(RoundRobinResultIteratorWithStatsIT.java:58)
Caused by: java.lang.RuntimeException: Master not initialized after 200000ms seconds
	at org.apache.phoenix.iterate.RoundRobinResultIteratorWithStatsIT.doSetup(RoundRobinResultIteratorWithStatsIT.java:58)

Running org.apache.phoenix.iterate.ScannerLeaseRenewalIT
Tests run: 1, Failures: 0, Errors: 1, Skipped: 0, Time elapsed: 0.003 sec <<< FAILURE! - in org.apache.phoenix.iterate.ScannerLeaseRenewalIT
org.apache.phoenix.iterate.ScannerLeaseRenewalIT  Time elapsed: 0.003 sec  <<< ERROR!
java.io.IOException: Shutting down
	at org.apache.phoenix.iterate.ScannerLeaseRenewalIT.setUp(ScannerLeaseRenewalIT.java:70)
Caused by: java.lang.RuntimeException: Master not initialized after 200000ms seconds
	at org.apache.phoenix.iterate.ScannerLeaseRenewalIT.setUp(ScannerLeaseRenewalIT.java:70)

Running org.apache.phoenix.monitoring.PhoenixMetricsIT
Tests run: 1, Failures: 0, Errors: 1, Skipped: 0, Time elapsed: 0.004 sec <<< FAILURE! - in org.apache.phoenix.monitoring.PhoenixMetricsIT
org.apache.phoenix.monitoring.PhoenixMetricsIT  Time elapsed: 0.003 sec  <<< ERROR!
java.lang.RuntimeException: java.io.IOException: Shutting down
	at org.apache.phoenix.monitoring.PhoenixMetricsIT.doSetup(PhoenixMetricsIT.java:78)
Caused by: java.io.IOException: Shutting down
	at org.apache.phoenix.monitoring.PhoenixMetricsIT.doSetup(PhoenixMetricsIT.java:78)
Caused by: java.lang.RuntimeException: Master not initialized after 200000ms seconds
	at org.apache.phoenix.monitoring.PhoenixMetricsIT.doSetup(PhoenixMetricsIT.java:78)

Running org.apache.phoenix.rpc.PhoenixClientRpcIT
Tests run: 1, Failures: 0, Errors: 1, Skipped: 0, Time elapsed: 0.004 sec <<< FAILURE! - in org.apache.phoenix.rpc.PhoenixClientRpcIT
org.apache.phoenix.rpc.PhoenixClientRpcIT  Time elapsed: 0.003 sec  <<< ERROR!
java.lang.RuntimeException: java.io.IOException: Shutting down
	at org.apache.phoenix.rpc.PhoenixClientRpcIT.doSetup(PhoenixClientRpcIT.java:47)
Caused by: java.io.IOException: Shutting down
	at org.apache.phoenix.rpc.PhoenixClientRpcIT.doSetup(PhoenixClientRpcIT.java:47)
Caused by: java.lang.RuntimeException: Master not initialized after 200000ms seconds
	at org.apache.phoenix.rpc.PhoenixClientRpcIT.doSetup(PhoenixClientRpcIT.java:47)

Running org.apache.phoenix.rpc.PhoenixServerRpcIT
Tests run: 1, Failures: 0, Errors: 1, Skipped: 0, Time elapsed: 0.004 sec <<< FAILURE! - in org.apache.phoenix.rpc.PhoenixServerRpcIT
org.apache.phoenix.rpc.PhoenixServerRpcIT  Time elapsed: 0.004 sec  <<< ERROR!
java.lang.RuntimeException: java.io.IOException: Shutting down
	at org.apache.phoenix.rpc.PhoenixServerRpcIT.doSetup(PhoenixServerRpcIT.java:72)
Caused by: java.io.IOException: Shutting down
	at org.apache.phoenix.rpc.PhoenixServerRpcIT.doSetup(PhoenixServerRpcIT.java:72)
Caused by: java.lang.RuntimeException: Master not initialized after 200000ms seconds
	at org.apache.phoenix.rpc.PhoenixServerRpcIT.doSetup(PhoenixServerRpcIT.java:72)


Results :

Tests in error: 
  WALReplayWithIndexWritesAndCompressedWALIT.setUp:98->setupCluster:109->startCluster:142 ? IO
  WALReplayWithIndexWritesAndUncompressedWALInHBase_094_9_IT>WALReplayWithIndexWritesAndCompressedWALIT.setUp:98->WALReplayWithIndexWritesAndCompressedWALIT.setupCluster:109->WALReplayWithIndexWritesAndCompressedWALIT.startCluster:142 ? IO
  StatisticsCollectionRunTrackerIT.doSetup:56->BaseTest.setUpTestDriver:630->BaseTest.setUpTestDriver:634->BaseTest.checkClusterInitialized:565->BaseTest.setUpTestCluster:578->BaseTest.initMiniCluster:687 ? Runtime
  AlterTableIT.doSetup:90->BaseTest.setUpTestDriver:630->BaseTest.setUpTestDriver:634->BaseTest.checkClusterInitialized:565->BaseTest.setUpTestCluster:578->BaseTest.initMiniCluster:687 ? Runtime
  ConnectionUtilIT.setUp:52 ? IO Shutting down
  ContextClassloaderIT.setUpBeforeClass:61 ? IO Shutting down
  CountDistinctCompressionIT.doSetup:48->BaseTest.setUpTestDriver:630->BaseTest.setUpTestDriver:634->BaseTest.checkClusterInitialized:565->BaseTest.setUpTestCluster:578->BaseTest.initMiniCluster:687 ? Runtime
  CsvBulkLoadToolIT.doSetup:60->BaseTest.setUpRealDriver:652 ? Runtime java.io.I...
  IndexToolIT.doSetup:93->BaseTest.setUpRealDriver:652 ? Runtime java.io.IOExcep...
  KeyOnlyIT.doSetup:57->BaseTest.setUpTestDriver:630->BaseTest.setUpTestDriver:634->BaseTest.checkClusterInitialized:565->BaseTest.setUpTestCluster:578->BaseTest.initMiniCluster:687 ? Runtime
  MultiCfQueryExecIT.doSetup:56->BaseTest.setUpTestDriver:630->BaseTest.setUpTestDriver:634->BaseTest.checkClusterInitialized:565->BaseTest.setUpTestCluster:578->BaseTest.initMiniCluster:687 ? Runtime
  MutableIndexToolIT.doSetup:50->BaseTest.setUpRealDriver:652 ? Runtime java.io....
  ParallelIteratorsIT.doSetup:76->BaseTest.setUpTestDriver:630->BaseTest.setUpTestDriver:634->BaseTest.checkClusterInitialized:565->BaseTest.setUpTestCluster:578->BaseTest.initMiniCluster:687 ? Runtime
  QueryTimeoutIT.doSetup:59->BaseTest.setUpTestDriver:630->BaseTest.setUpTestDriver:634->BaseTest.checkClusterInitialized:565->BaseTest.setUpTestCluster:578->BaseTest.initMiniCluster:687 ? Runtime
  QueryWithLimitIT.doSetup:58->BaseTest.setUpTestDriver:630->BaseTest.setUpTestDriver:634->BaseTest.checkClusterInitialized:565->BaseTest.setUpTestCluster:578->BaseTest.initMiniCluster:687 ? Runtime
  QueryWithOffsetIT.doSetup:70->BaseTest.setUpTestDriver:630->BaseTest.setUpTestDriver:634->BaseTest.checkClusterInitialized:565->BaseTest.setUpTestCluster:578->BaseTest.initMiniCluster:687 ? Runtime
  SaltedViewIT>BaseViewIT.doSetup:72->BaseTest.setUpTestDriver:630->BaseTest.setUpTestDriver:634->BaseTest.checkClusterInitialized:565->BaseTest.setUpTestCluster:578->BaseTest.initMiniCluster:687 ? Runtime
  SpillableGroupByIT.doSetup:72->BaseTest.setUpTestDriver:630->BaseTest.setUpTestDriver:634->BaseTest.checkClusterInitialized:565->BaseTest.setUpTestCluster:578->BaseTest.initMiniCluster:687 ? Runtime
  StatsCollectionDisabledIT.doSetup:54->BaseTest.setUpTestDriver:630->BaseTest.setUpTestDriver:634->BaseTest.checkClusterInitialized:565->BaseTest.setUpTestCluster:578->BaseTest.initMiniCluster:687 ? Runtime
  StatsCollectorIT.doSetup:77->BaseTest.setUpTestDriver:630->BaseTest.setUpTestDriver:634->BaseTest.checkClusterInitialized:565->BaseTest.setUpTestCluster:578->BaseTest.initMiniCluster:687 ? Runtime
  StatsCollectorWithSplitsAndMultiCFIT.doSetup:61->BaseTest.setUpTestDriver:630->BaseTest.setUpTestDriver:634->BaseTest.checkClusterInitialized:565->BaseTest.setUpTestCluster:578->BaseTest.initMiniCluster:687 ? Runtime
  TenantSpecificTablesDDLIT>BaseTenantSpecificTablesIT.doSetup:79->BaseTest.setUpTestDriver:630->BaseTest.setUpTestDriver:634->BaseTest.checkClusterInitialized:565->BaseTest.setUpTestCluster:578->BaseTest.initMiniCluster:687 ? Runtime
  TenantSpecificTablesDMLIT>BaseTenantSpecificTablesIT.doSetup:79->BaseTest.setUpTestDriver:630->BaseTest.setUpTestDriver:634->BaseTest.checkClusterInitialized:565->BaseTest.setUpTestCluster:578->BaseTest.initMiniCluster:687 ? Runtime
  TransactionalViewIT.doSetup:46->BaseTest.setUpTestDriver:630->BaseTest.setUpTestDriver:634->BaseTest.checkClusterInitialized:565->BaseTest.setUpTestCluster:578->BaseTest.initMiniCluster:687 ? Runtime
  UnionAllIT.doSetup:48->BaseTest.setUpTestDriver:630->BaseTest.setUpTestDriver:634->BaseTest.checkClusterInitialized:565->BaseTest.setUpTestCluster:578->BaseTest.initMiniCluster:687 ? Runtime
  UserDefinedFunctionsIT.doSetup:249 ? IO Shutting down
  ViewIT>BaseViewIT.doSetup:72->BaseTest.setUpTestDriver:630->BaseTest.setUpTestDriver:634->BaseTest.checkClusterInitialized:565->BaseTest.setUpTestCluster:578->BaseTest.initMiniCluster:687 ? Runtime
  ImmutableIndexWithStatsIT.doSetup:52->BaseTest.setUpTestDriver:630->BaseTest.setUpTestDriver:634->BaseTest.checkClusterInitialized:565->BaseTest.setUpTestCluster:578->BaseTest.initMiniCluster:687 ? Runtime
  MutableIndexFailureIT.doSetup:113->BaseTest.setUpTestDriver:634->BaseTest.checkClusterInitialized:565->BaseTest.setUpTestCluster:578->BaseTest.initMiniCluster:687 ? Runtime
  MutableIndexReplicationIT.setUpBeforeClass:108->setupConfigsAndStartCluster:170 ? IO
  ReadOnlyIndexFailureIT.doSetup:116->BaseTest.setUpTestDriver:634->BaseTest.checkClusterInitialized:565->BaseTest.setUpTestCluster:578->BaseTest.initMiniCluster:687 ? Runtime
  TxWriteFailureIT.doSetup:86->BaseTest.setUpTestDriver:634->BaseTest.checkClusterInitialized:565->BaseTest.setUpTestCluster:578->BaseTest.initMiniCluster:687 ? Runtime
  PartialCommitIT.doSetup:94->BaseTest.setUpTestDriver:634->BaseTest.checkClusterInitialized:565->BaseTest.setUpTestCluster:578->BaseTest.initMiniCluster:687 ? Runtime
  FailForUnsupportedHBaseVersionsIT.testDoesNotStartRegionServerForUnsupportedCompressionAndVersion:121 ? IO
  IndexLoadBalancerIT.setupCluster:87 ? IO Shutting down
  EndToEndCoveredColumnsIndexBuilderIT.setupCluster:107 ? IO Shutting down
  EndToEndCoveredIndexingIT.setupCluster:131 ? IO Shutting down
  EndtoEndIndexingWithCompressionIT.setupCluster:42 ? IO Shutting down
  FailWithoutRetriesIT.setupCluster:84 ? IO Shutting down
  RoundRobinResultIteratorWithStatsIT.doSetup:58->BaseTest.setUpTestDriver:630->BaseTest.setUpTestDriver:634->BaseTest.checkClusterInitialized:565->BaseTest.setUpTestCluster:578->BaseTest.initMiniCluster:687 ? Runtime
  ScannerLeaseRenewalIT.setUp:70 ? IO Shutting down
  PhoenixMetricsIT.doSetup:78->BaseTest.setUpTestDriver:630->BaseTest.setUpTestDriver:634->BaseTest.checkClusterInitialized:565->BaseTest.setUpTestCluster:578->BaseTest.initMiniCluster:687 ? Runtime
  PhoenixClientRpcIT.doSetup:47->BaseTest.setUpTestDriver:634->BaseTest.checkClusterInitialized:565->BaseTest.setUpTestCluster:578->BaseTest.initMiniCluster:687 ? Runtime
  PhoenixServerRpcIT.doSetup:72->BaseTest.setUpTestDriver:634->BaseTest.checkClusterInitialized:565->BaseTest.setUpTestCluster:578->BaseTest.initMiniCluster:687 ? Runtime

Tests run: 45, Failures: 0, Errors: 44, Skipped: 0

[INFO] 
[INFO] --- maven-failsafe-plugin:2.19.1:verify (ClientManagedTimeTests) @ phoenix-core ---
[INFO] ------------------------------------------------------------------------
[INFO] Reactor Summary:
[INFO] 
[INFO] Apache Phoenix .................................... SUCCESS [7.104s]
[INFO] Phoenix Core ...................................... FAILURE [2:19:40.791s]
[INFO] Phoenix - Flume ................................... SKIPPED
[INFO] Phoenix - Pig ..................................... SKIPPED
[INFO] Phoenix Query Server Client ....................... SKIPPED
[INFO] Phoenix Query Server .............................. SKIPPED
[INFO] Phoenix - Pherf ................................... SKIPPED
[INFO] Phoenix - Spark ................................... SKIPPED
[INFO] Phoenix - Hive .................................... SKIPPED
[INFO] Phoenix Assembly .................................. SKIPPED
[INFO] Phoenix - Tracing Web Application ................. SKIPPED
[INFO] ------------------------------------------------------------------------
[INFO] BUILD FAILURE
[INFO] ------------------------------------------------------------------------
[INFO] Total time: 2:19:48.489s
[INFO] Finished at: Fri Apr 29 08:44:51 UTC 2016
[INFO] Final Memory: 51M/906M
[INFO] ------------------------------------------------------------------------
[ERROR] Failed to execute goal org.apache.maven.plugins:maven-failsafe-plugin:2.19.1:verify (ClientManagedTimeTests) on project phoenix-core: There are test failures.
[ERROR] 
[ERROR] Please refer to /x1/jenkins/jenkins-slave/workspace/Phoenix-4.x-HBase-1.1/phoenix-core/target/failsafe-reports for the individual test results.
[ERROR] -> [Help 1]
[ERROR] 
[ERROR] To see the full stack trace of the errors, re-run Maven with the -e switch.
[ERROR] Re-run Maven using the -X switch to enable full debug logging.
[ERROR] 
[ERROR] For more information about the errors and possible solutions, please read the following articles:
[ERROR] [Help 1] http://cwiki.apache.org/confluence/display/MAVEN/MojoFailureException
[ERROR] 
[ERROR] After correcting the problems, you can resume the build with the command
[ERROR]   mvn <goals> -rf :phoenix-core
Build step 'Invoke top-level Maven targets' marked build as failure
Archiving artifacts
No prior successful build to compare, so performing full copy of artifacts
Recording test results

Build failed in Jenkins: Phoenix-4.x-HBase-1.1 #13

Posted by Apache Jenkins Server <je...@builds.apache.org>.
See <https://builds.apache.org/job/Phoenix-4.x-HBase-1.1/13/changes>

Changes:

[rajeshbabu] PHOENIX-2628 Ensure split when iterating through results handled

------------------------------------------
[...truncated 2057 lines...]
Caused by: java.lang.RuntimeException: Master not initialized after 200000ms seconds

Running org.apache.phoenix.end2end.index.ImmutableIndexWithStatsIT
Tests run: 1, Failures: 0, Errors: 1, Skipped: 0, Time elapsed: 0.004 sec <<< FAILURE! - in org.apache.phoenix.end2end.index.ImmutableIndexWithStatsIT
org.apache.phoenix.end2end.index.ImmutableIndexWithStatsIT  Time elapsed: 0.003 sec  <<< ERROR!
java.lang.RuntimeException: java.io.IOException: Shutting down
	at org.apache.phoenix.end2end.index.ImmutableIndexWithStatsIT.doSetup(ImmutableIndexWithStatsIT.java:52)
Caused by: java.io.IOException: Shutting down
	at org.apache.phoenix.end2end.index.ImmutableIndexWithStatsIT.doSetup(ImmutableIndexWithStatsIT.java:52)
Caused by: java.lang.RuntimeException: Master not initialized after 200000ms seconds
	at org.apache.phoenix.end2end.index.ImmutableIndexWithStatsIT.doSetup(ImmutableIndexWithStatsIT.java:52)

Running org.apache.phoenix.end2end.index.MutableIndexFailureIT
Tests run: 1, Failures: 0, Errors: 1, Skipped: 0, Time elapsed: 0.006 sec <<< FAILURE! - in org.apache.phoenix.end2end.index.MutableIndexFailureIT
org.apache.phoenix.end2end.index.MutableIndexFailureIT  Time elapsed: 0.006 sec  <<< ERROR!
java.lang.RuntimeException: java.io.IOException: Shutting down
	at org.apache.phoenix.end2end.index.MutableIndexFailureIT.doSetup(MutableIndexFailureIT.java:113)
Caused by: java.io.IOException: Shutting down
	at org.apache.phoenix.end2end.index.MutableIndexFailureIT.doSetup(MutableIndexFailureIT.java:113)
Caused by: java.lang.RuntimeException: Master not initialized after 200000ms seconds
	at org.apache.phoenix.end2end.index.MutableIndexFailureIT.doSetup(MutableIndexFailureIT.java:113)

Running org.apache.phoenix.end2end.index.MutableIndexReplicationIT
Running org.apache.phoenix.hbase.index.FailForUnsupportedHBaseVersionsIT
Tests run: 1, Failures: 0, Errors: 1, Skipped: 0, Time elapsed: 0.004 sec <<< FAILURE! - in org.apache.phoenix.end2end.index.MutableIndexReplicationIT
org.apache.phoenix.end2end.index.MutableIndexReplicationIT  Time elapsed: 0.003 sec  <<< ERROR!
java.io.IOException: Shutting down
	at org.apache.phoenix.end2end.index.MutableIndexReplicationIT.setupConfigsAndStartCluster(MutableIndexReplicationIT.java:170)
	at org.apache.phoenix.end2end.index.MutableIndexReplicationIT.setUpBeforeClass(MutableIndexReplicationIT.java:108)
Caused by: java.lang.RuntimeException: Master not initialized after 200000ms seconds
	at org.apache.phoenix.end2end.index.MutableIndexReplicationIT.setupConfigsAndStartCluster(MutableIndexReplicationIT.java:170)
	at org.apache.phoenix.end2end.index.MutableIndexReplicationIT.setUpBeforeClass(MutableIndexReplicationIT.java:108)

Running org.apache.phoenix.end2end.index.ReadOnlyIndexFailureIT
Tests run: 1, Failures: 0, Errors: 1, Skipped: 0, Time elapsed: 0.006 sec <<< FAILURE! - in org.apache.phoenix.end2end.index.ReadOnlyIndexFailureIT
org.apache.phoenix.end2end.index.ReadOnlyIndexFailureIT  Time elapsed: 0.005 sec  <<< ERROR!
java.lang.RuntimeException: java.io.IOException: Shutting down
	at org.apache.phoenix.end2end.index.ReadOnlyIndexFailureIT.doSetup(ReadOnlyIndexFailureIT.java:116)
Caused by: java.io.IOException: Shutting down
	at org.apache.phoenix.end2end.index.ReadOnlyIndexFailureIT.doSetup(ReadOnlyIndexFailureIT.java:116)
Caused by: java.lang.RuntimeException: Master not initialized after 200000ms seconds
	at org.apache.phoenix.end2end.index.ReadOnlyIndexFailureIT.doSetup(ReadOnlyIndexFailureIT.java:116)

Running org.apache.phoenix.end2end.index.txn.TxWriteFailureIT
Tests run: 1, Failures: 0, Errors: 1, Skipped: 0, Time elapsed: 0.003 sec <<< FAILURE! - in org.apache.phoenix.end2end.index.txn.TxWriteFailureIT
org.apache.phoenix.end2end.index.txn.TxWriteFailureIT  Time elapsed: 0.003 sec  <<< ERROR!
java.lang.RuntimeException: java.io.IOException: Shutting down
	at org.apache.phoenix.end2end.index.txn.TxWriteFailureIT.doSetup(TxWriteFailureIT.java:86)
Caused by: java.io.IOException: Shutting down
	at org.apache.phoenix.end2end.index.txn.TxWriteFailureIT.doSetup(TxWriteFailureIT.java:86)
Caused by: java.lang.RuntimeException: Master not initialized after 200000ms seconds
	at org.apache.phoenix.end2end.index.txn.TxWriteFailureIT.doSetup(TxWriteFailureIT.java:86)

Running org.apache.phoenix.execute.PartialCommitIT
Tests run: 1, Failures: 0, Errors: 1, Skipped: 0, Time elapsed: 0.016 sec <<< FAILURE! - in org.apache.phoenix.execute.PartialCommitIT
org.apache.phoenix.execute.PartialCommitIT  Time elapsed: 0.016 sec  <<< ERROR!
java.lang.RuntimeException: java.io.IOException: Shutting down
	at org.apache.phoenix.execute.PartialCommitIT.doSetup(PartialCommitIT.java:94)
Caused by: java.io.IOException: Shutting down
	at org.apache.phoenix.execute.PartialCommitIT.doSetup(PartialCommitIT.java:94)
Caused by: java.lang.RuntimeException: Master not initialized after 200000ms seconds
	at org.apache.phoenix.execute.PartialCommitIT.doSetup(PartialCommitIT.java:94)

Tests run: 2, Failures: 0, Errors: 1, Skipped: 0, Time elapsed: 206.792 sec <<< FAILURE! - in org.apache.phoenix.hbase.index.FailForUnsupportedHBaseVersionsIT
testDoesNotStartRegionServerForUnsupportedCompressionAndVersion(org.apache.phoenix.hbase.index.FailForUnsupportedHBaseVersionsIT)  Time elapsed: 206.478 sec  <<< ERROR!
java.io.IOException: Shutting down
	at org.apache.phoenix.hbase.index.FailForUnsupportedHBaseVersionsIT.testDoesNotStartRegionServerForUnsupportedCompressionAndVersion(FailForUnsupportedHBaseVersionsIT.java:121)
Caused by: java.lang.RuntimeException: Master not initialized after 200000ms seconds
	at org.apache.phoenix.hbase.index.FailForUnsupportedHBaseVersionsIT.testDoesNotStartRegionServerForUnsupportedCompressionAndVersion(FailForUnsupportedHBaseVersionsIT.java:121)

Running org.apache.phoenix.hbase.index.balancer.IndexLoadBalancerIT
Tests run: 1, Failures: 0, Errors: 1, Skipped: 0, Time elapsed: 0.004 sec <<< FAILURE! - in org.apache.phoenix.hbase.index.balancer.IndexLoadBalancerIT
org.apache.phoenix.hbase.index.balancer.IndexLoadBalancerIT  Time elapsed: 0.003 sec  <<< ERROR!
java.io.IOException: Shutting down
	at org.apache.phoenix.hbase.index.balancer.IndexLoadBalancerIT.setupCluster(IndexLoadBalancerIT.java:87)
Caused by: java.lang.RuntimeException: Master not initialized after 200000ms seconds
	at org.apache.phoenix.hbase.index.balancer.IndexLoadBalancerIT.setupCluster(IndexLoadBalancerIT.java:87)

Running org.apache.phoenix.hbase.index.covered.EndToEndCoveredColumnsIndexBuilderIT
Tests run: 1, Failures: 0, Errors: 1, Skipped: 0, Time elapsed: 0.006 sec <<< FAILURE! - in org.apache.phoenix.hbase.index.covered.EndToEndCoveredColumnsIndexBuilderIT
org.apache.phoenix.hbase.index.covered.EndToEndCoveredColumnsIndexBuilderIT  Time elapsed: 0.005 sec  <<< ERROR!
java.io.IOException: Shutting down
	at org.apache.phoenix.hbase.index.covered.EndToEndCoveredColumnsIndexBuilderIT.setupCluster(EndToEndCoveredColumnsIndexBuilderIT.java:107)
Caused by: java.lang.RuntimeException: Master not initialized after 200000ms seconds
	at org.apache.phoenix.hbase.index.covered.EndToEndCoveredColumnsIndexBuilderIT.setupCluster(EndToEndCoveredColumnsIndexBuilderIT.java:107)

Running org.apache.phoenix.hbase.index.covered.example.EndToEndCoveredIndexingIT
Tests run: 1, Failures: 0, Errors: 1, Skipped: 0, Time elapsed: 0.004 sec <<< FAILURE! - in org.apache.phoenix.hbase.index.covered.example.EndToEndCoveredIndexingIT
org.apache.phoenix.hbase.index.covered.example.EndToEndCoveredIndexingIT  Time elapsed: 0.003 sec  <<< ERROR!
java.io.IOException: Shutting down
	at org.apache.phoenix.hbase.index.covered.example.EndToEndCoveredIndexingIT.setupCluster(EndToEndCoveredIndexingIT.java:131)
Caused by: java.lang.RuntimeException: Master not initialized after 200000ms seconds
	at org.apache.phoenix.hbase.index.covered.example.EndToEndCoveredIndexingIT.setupCluster(EndToEndCoveredIndexingIT.java:131)

Running org.apache.phoenix.hbase.index.covered.example.EndtoEndIndexingWithCompressionIT
Tests run: 1, Failures: 0, Errors: 1, Skipped: 0, Time elapsed: 0.003 sec <<< FAILURE! - in org.apache.phoenix.hbase.index.covered.example.EndtoEndIndexingWithCompressionIT
org.apache.phoenix.hbase.index.covered.example.EndtoEndIndexingWithCompressionIT  Time elapsed: 0.003 sec  <<< ERROR!
java.io.IOException: Shutting down
	at org.apache.phoenix.hbase.index.covered.example.EndtoEndIndexingWithCompressionIT.setupCluster(EndtoEndIndexingWithCompressionIT.java:42)
Caused by: java.lang.RuntimeException: Master not initialized after 200000ms seconds
	at org.apache.phoenix.hbase.index.covered.example.EndtoEndIndexingWithCompressionIT.setupCluster(EndtoEndIndexingWithCompressionIT.java:42)

Running org.apache.phoenix.hbase.index.covered.example.FailWithoutRetriesIT
Tests run: 1, Failures: 0, Errors: 1, Skipped: 0, Time elapsed: 0.005 sec <<< FAILURE! - in org.apache.phoenix.hbase.index.covered.example.FailWithoutRetriesIT
org.apache.phoenix.hbase.index.covered.example.FailWithoutRetriesIT  Time elapsed: 0.004 sec  <<< ERROR!
java.io.IOException: Shutting down
	at org.apache.phoenix.hbase.index.covered.example.FailWithoutRetriesIT.setupCluster(FailWithoutRetriesIT.java:84)
Caused by: java.lang.RuntimeException: Master not initialized after 200000ms seconds
	at org.apache.phoenix.hbase.index.covered.example.FailWithoutRetriesIT.setupCluster(FailWithoutRetriesIT.java:84)

Running org.apache.phoenix.iterate.RoundRobinResultIteratorWithStatsIT
Tests run: 1, Failures: 0, Errors: 1, Skipped: 0, Time elapsed: 0.004 sec <<< FAILURE! - in org.apache.phoenix.iterate.RoundRobinResultIteratorWithStatsIT
org.apache.phoenix.iterate.RoundRobinResultIteratorWithStatsIT  Time elapsed: 0.004 sec  <<< ERROR!
java.lang.RuntimeException: java.io.IOException: Shutting down
	at org.apache.phoenix.iterate.RoundRobinResultIteratorWithStatsIT.doSetup(RoundRobinResultIteratorWithStatsIT.java:58)
Caused by: java.io.IOException: Shutting down
	at org.apache.phoenix.iterate.RoundRobinResultIteratorWithStatsIT.doSetup(RoundRobinResultIteratorWithStatsIT.java:58)
Caused by: java.lang.RuntimeException: Master not initialized after 200000ms seconds
	at org.apache.phoenix.iterate.RoundRobinResultIteratorWithStatsIT.doSetup(RoundRobinResultIteratorWithStatsIT.java:58)

Running org.apache.phoenix.iterate.ScannerLeaseRenewalIT
Tests run: 1, Failures: 0, Errors: 1, Skipped: 0, Time elapsed: 0.003 sec <<< FAILURE! - in org.apache.phoenix.iterate.ScannerLeaseRenewalIT
org.apache.phoenix.iterate.ScannerLeaseRenewalIT  Time elapsed: 0.003 sec  <<< ERROR!
java.io.IOException: Shutting down
	at org.apache.phoenix.iterate.ScannerLeaseRenewalIT.setUp(ScannerLeaseRenewalIT.java:70)
Caused by: java.lang.RuntimeException: Master not initialized after 200000ms seconds
	at org.apache.phoenix.iterate.ScannerLeaseRenewalIT.setUp(ScannerLeaseRenewalIT.java:70)

Running org.apache.phoenix.monitoring.PhoenixMetricsIT
Tests run: 1, Failures: 0, Errors: 1, Skipped: 0, Time elapsed: 0.006 sec <<< FAILURE! - in org.apache.phoenix.monitoring.PhoenixMetricsIT
org.apache.phoenix.monitoring.PhoenixMetricsIT  Time elapsed: 0.006 sec  <<< ERROR!
java.lang.RuntimeException: java.io.IOException: Shutting down
	at org.apache.phoenix.monitoring.PhoenixMetricsIT.doSetup(PhoenixMetricsIT.java:78)
Caused by: java.io.IOException: Shutting down
	at org.apache.phoenix.monitoring.PhoenixMetricsIT.doSetup(PhoenixMetricsIT.java:78)
Caused by: java.lang.RuntimeException: Master not initialized after 200000ms seconds
	at org.apache.phoenix.monitoring.PhoenixMetricsIT.doSetup(PhoenixMetricsIT.java:78)

Running org.apache.phoenix.rpc.PhoenixClientRpcIT
Tests run: 1, Failures: 0, Errors: 1, Skipped: 0, Time elapsed: 0.003 sec <<< FAILURE! - in org.apache.phoenix.rpc.PhoenixClientRpcIT
org.apache.phoenix.rpc.PhoenixClientRpcIT  Time elapsed: 0.003 sec  <<< ERROR!
java.lang.RuntimeException: java.io.IOException: Shutting down
	at org.apache.phoenix.rpc.PhoenixClientRpcIT.doSetup(PhoenixClientRpcIT.java:47)
Caused by: java.io.IOException: Shutting down
	at org.apache.phoenix.rpc.PhoenixClientRpcIT.doSetup(PhoenixClientRpcIT.java:47)
Caused by: java.lang.RuntimeException: Master not initialized after 200000ms seconds
	at org.apache.phoenix.rpc.PhoenixClientRpcIT.doSetup(PhoenixClientRpcIT.java:47)

Running org.apache.phoenix.rpc.PhoenixServerRpcIT
Tests run: 1, Failures: 0, Errors: 1, Skipped: 0, Time elapsed: 0.006 sec <<< FAILURE! - in org.apache.phoenix.rpc.PhoenixServerRpcIT
org.apache.phoenix.rpc.PhoenixServerRpcIT  Time elapsed: 0.006 sec  <<< ERROR!
java.lang.RuntimeException: java.io.IOException: Shutting down
	at org.apache.phoenix.rpc.PhoenixServerRpcIT.doSetup(PhoenixServerRpcIT.java:72)
Caused by: java.io.IOException: Shutting down
	at org.apache.phoenix.rpc.PhoenixServerRpcIT.doSetup(PhoenixServerRpcIT.java:72)
Caused by: java.lang.RuntimeException: Master not initialized after 200000ms seconds
	at org.apache.phoenix.rpc.PhoenixServerRpcIT.doSetup(PhoenixServerRpcIT.java:72)


Results :

Tests in error: 
  WALReplayWithIndexWritesAndCompressedWALIT.setUp:98->setupCluster:109->startCluster:142 ? IO
  WALReplayWithIndexWritesAndUncompressedWALInHBase_094_9_IT>WALReplayWithIndexWritesAndCompressedWALIT.setUp:98->WALReplayWithIndexWritesAndCompressedWALIT.setupCluster:109->WALReplayWithIndexWritesAndCompressedWALIT.startCluster:142 ? IO
  StatisticsCollectionRunTrackerIT.doSetup:56->BaseTest.setUpTestDriver:630->BaseTest.setUpTestDriver:634->BaseTest.checkClusterInitialized:565->BaseTest.setUpTestCluster:578->BaseTest.initMiniCluster:687 ? Runtime
  AlterTableIT.doSetup:90->BaseTest.setUpTestDriver:630->BaseTest.setUpTestDriver:634->BaseTest.checkClusterInitialized:565->BaseTest.setUpTestCluster:578->BaseTest.initMiniCluster:687 ? Runtime
  ConnectionUtilIT.setUp:52 ? IO Shutting down
  ContextClassloaderIT.setUpBeforeClass:61 ? IO Shutting down
  CountDistinctCompressionIT.doSetup:48->BaseTest.setUpTestDriver:630->BaseTest.setUpTestDriver:634->BaseTest.checkClusterInitialized:565->BaseTest.setUpTestCluster:578->BaseTest.initMiniCluster:687 ? Runtime
  CsvBulkLoadToolIT.doSetup:60->BaseTest.setUpRealDriver:652 ? Runtime java.io.I...
  IndexToolIT.doSetup:93->BaseTest.setUpRealDriver:652 ? Runtime java.io.IOExcep...
  KeyOnlyIT.doSetup:57->BaseTest.setUpTestDriver:630->BaseTest.setUpTestDriver:634->BaseTest.checkClusterInitialized:565->BaseTest.setUpTestCluster:578->BaseTest.initMiniCluster:687 ? Runtime
  MultiCfQueryExecIT.doSetup:56->BaseTest.setUpTestDriver:630->BaseTest.setUpTestDriver:634->BaseTest.checkClusterInitialized:565->BaseTest.setUpTestCluster:578->BaseTest.initMiniCluster:687 ? Runtime
  MutableIndexToolIT.doSetup:50->BaseTest.setUpRealDriver:652 ? Runtime java.io....
  ParallelIteratorsIT.doSetup:76->BaseTest.setUpTestDriver:630->BaseTest.setUpTestDriver:634->BaseTest.checkClusterInitialized:565->BaseTest.setUpTestCluster:578->BaseTest.initMiniCluster:687 ? Runtime
  QueryTimeoutIT.doSetup:59->BaseTest.setUpTestDriver:630->BaseTest.setUpTestDriver:634->BaseTest.checkClusterInitialized:565->BaseTest.setUpTestCluster:578->BaseTest.initMiniCluster:687 ? Runtime
  QueryWithLimitIT.doSetup:58->BaseTest.setUpTestDriver:630->BaseTest.setUpTestDriver:634->BaseTest.checkClusterInitialized:565->BaseTest.setUpTestCluster:578->BaseTest.initMiniCluster:687 ? Runtime
  QueryWithOffsetIT.doSetup:70->BaseTest.setUpTestDriver:630->BaseTest.setUpTestDriver:634->BaseTest.checkClusterInitialized:565->BaseTest.setUpTestCluster:578->BaseTest.initMiniCluster:687 ? Runtime
  SaltedViewIT>BaseViewIT.doSetup:74->BaseTest.setUpTestDriver:630->BaseTest.setUpTestDriver:634->BaseTest.checkClusterInitialized:565->BaseTest.setUpTestCluster:578->BaseTest.initMiniCluster:687 ? Runtime
  SpillableGroupByIT.doSetup:72->BaseTest.setUpTestDriver:630->BaseTest.setUpTestDriver:634->BaseTest.checkClusterInitialized:565->BaseTest.setUpTestCluster:578->BaseTest.initMiniCluster:687 ? Runtime
  StatsCollectionDisabledIT.doSetup:54->BaseTest.setUpTestDriver:630->BaseTest.setUpTestDriver:634->BaseTest.checkClusterInitialized:565->BaseTest.setUpTestCluster:578->BaseTest.initMiniCluster:687 ? Runtime
  StatsCollectorIT.doSetup:77->BaseTest.setUpTestDriver:630->BaseTest.setUpTestDriver:634->BaseTest.checkClusterInitialized:565->BaseTest.setUpTestCluster:578->BaseTest.initMiniCluster:687 ? Runtime
  StatsCollectorWithSplitsAndMultiCFIT.doSetup:61->BaseTest.setUpTestDriver:630->BaseTest.setUpTestDriver:634->BaseTest.checkClusterInitialized:565->BaseTest.setUpTestCluster:578->BaseTest.initMiniCluster:687 ? Runtime
  TenantSpecificTablesDDLIT>BaseTenantSpecificTablesIT.doSetup:79->BaseTest.setUpTestDriver:630->BaseTest.setUpTestDriver:634->BaseTest.checkClusterInitialized:565->BaseTest.setUpTestCluster:578->BaseTest.initMiniCluster:687 ? Runtime
  TenantSpecificTablesDMLIT>BaseTenantSpecificTablesIT.doSetup:79->BaseTest.setUpTestDriver:630->BaseTest.setUpTestDriver:634->BaseTest.checkClusterInitialized:565->BaseTest.setUpTestCluster:578->BaseTest.initMiniCluster:687 ? Runtime
  TransactionalViewIT.doSetup:46->BaseTest.setUpTestDriver:630->BaseTest.setUpTestDriver:634->BaseTest.checkClusterInitialized:565->BaseTest.setUpTestCluster:578->BaseTest.initMiniCluster:687 ? Runtime
  UnionAllIT.doSetup:48->BaseTest.setUpTestDriver:630->BaseTest.setUpTestDriver:634->BaseTest.checkClusterInitialized:565->BaseTest.setUpTestCluster:578->BaseTest.initMiniCluster:687 ? Runtime
  UserDefinedFunctionsIT.doSetup:249 ? IO Shutting down
  ViewIT>BaseViewIT.doSetup:74->BaseTest.setUpTestDriver:630->BaseTest.setUpTestDriver:634->BaseTest.checkClusterInitialized:565->BaseTest.setUpTestCluster:578->BaseTest.initMiniCluster:687 ? Runtime
  ImmutableIndexWithStatsIT.doSetup:52->BaseTest.setUpTestDriver:630->BaseTest.setUpTestDriver:634->BaseTest.checkClusterInitialized:565->BaseTest.setUpTestCluster:578->BaseTest.initMiniCluster:687 ? Runtime
  MutableIndexFailureIT.doSetup:113->BaseTest.setUpTestDriver:634->BaseTest.checkClusterInitialized:565->BaseTest.setUpTestCluster:578->BaseTest.initMiniCluster:687 ? Runtime
  MutableIndexReplicationIT.setUpBeforeClass:108->setupConfigsAndStartCluster:170 ? IO
  ReadOnlyIndexFailureIT.doSetup:116->BaseTest.setUpTestDriver:634->BaseTest.checkClusterInitialized:565->BaseTest.setUpTestCluster:578->BaseTest.initMiniCluster:687 ? Runtime
  TxWriteFailureIT.doSetup:86->BaseTest.setUpTestDriver:634->BaseTest.checkClusterInitialized:565->BaseTest.setUpTestCluster:578->BaseTest.initMiniCluster:687 ? Runtime
  PartialCommitIT.doSetup:94->BaseTest.setUpTestDriver:634->BaseTest.checkClusterInitialized:565->BaseTest.setUpTestCluster:578->BaseTest.initMiniCluster:687 ? Runtime
  FailForUnsupportedHBaseVersionsIT.testDoesNotStartRegionServerForUnsupportedCompressionAndVersion:121 ? IO
  IndexLoadBalancerIT.setupCluster:87 ? IO Shutting down
  EndToEndCoveredColumnsIndexBuilderIT.setupCluster:107 ? IO Shutting down
  EndToEndCoveredIndexingIT.setupCluster:131 ? IO Shutting down
  EndtoEndIndexingWithCompressionIT.setupCluster:42 ? IO Shutting down
  FailWithoutRetriesIT.setupCluster:84 ? IO Shutting down
  RoundRobinResultIteratorWithStatsIT.doSetup:58->BaseTest.setUpTestDriver:630->BaseTest.setUpTestDriver:634->BaseTest.checkClusterInitialized:565->BaseTest.setUpTestCluster:578->BaseTest.initMiniCluster:687 ? Runtime
  ScannerLeaseRenewalIT.setUp:70 ? IO Shutting down
  PhoenixMetricsIT.doSetup:78->BaseTest.setUpTestDriver:630->BaseTest.setUpTestDriver:634->BaseTest.checkClusterInitialized:565->BaseTest.setUpTestCluster:578->BaseTest.initMiniCluster:687 ? Runtime
  PhoenixClientRpcIT.doSetup:47->BaseTest.setUpTestDriver:634->BaseTest.checkClusterInitialized:565->BaseTest.setUpTestCluster:578->BaseTest.initMiniCluster:687 ? Runtime
  PhoenixServerRpcIT.doSetup:72->BaseTest.setUpTestDriver:634->BaseTest.checkClusterInitialized:565->BaseTest.setUpTestCluster:578->BaseTest.initMiniCluster:687 ? Runtime

Tests run: 45, Failures: 0, Errors: 44, Skipped: 0

[INFO] 
[INFO] --- maven-failsafe-plugin:2.19.1:verify (ClientManagedTimeTests) @ phoenix-core ---
[INFO] ------------------------------------------------------------------------
[INFO] Reactor Summary:
[INFO] 
[INFO] Apache Phoenix .................................... SUCCESS [4.033s]
[INFO] Phoenix Core ...................................... FAILURE [2:16:27.006s]
[INFO] Phoenix - Flume ................................... SKIPPED
[INFO] Phoenix - Pig ..................................... SKIPPED
[INFO] Phoenix Query Server Client ....................... SKIPPED
[INFO] Phoenix Query Server .............................. SKIPPED
[INFO] Phoenix - Pherf ................................... SKIPPED
[INFO] Phoenix - Spark ................................... SKIPPED
[INFO] Phoenix - Hive .................................... SKIPPED
[INFO] Phoenix Assembly .................................. SKIPPED
[INFO] Phoenix - Tracing Web Application ................. SKIPPED
[INFO] ------------------------------------------------------------------------
[INFO] BUILD FAILURE
[INFO] ------------------------------------------------------------------------
[INFO] Total time: 2:16:31.699s
[INFO] Finished at: Wed May 04 16:55:01 UTC 2016
[INFO] Final Memory: 53M/1047M
[INFO] ------------------------------------------------------------------------
[ERROR] Failed to execute goal org.apache.maven.plugins:maven-failsafe-plugin:2.19.1:verify (ClientManagedTimeTests) on project phoenix-core: There are test failures.
[ERROR] 
[ERROR] Please refer to /x1/jenkins/jenkins-slave/workspace/Phoenix-4.x-HBase-1.1/phoenix-core/target/failsafe-reports for the individual test results.
[ERROR] -> [Help 1]
[ERROR] 
[ERROR] To see the full stack trace of the errors, re-run Maven with the -e switch.
[ERROR] Re-run Maven using the -X switch to enable full debug logging.
[ERROR] 
[ERROR] For more information about the errors and possible solutions, please read the following articles:
[ERROR] [Help 1] http://cwiki.apache.org/confluence/display/MAVEN/MojoFailureException
[ERROR] 
[ERROR] After correcting the problems, you can resume the build with the command
[ERROR]   mvn <goals> -rf :phoenix-core
Build step 'Invoke top-level Maven targets' marked build as failure
Archiving artifacts
No prior successful build to compare, so performing full copy of artifacts
Recording test results

Build failed in Jenkins: Phoenix-4.x-HBase-1.1 #12

Posted by Apache Jenkins Server <je...@builds.apache.org>.
See <https://builds.apache.org/job/Phoenix-4.x-HBase-1.1/12/>

------------------------------------------
[...truncated 2057 lines...]
Caused by: java.lang.RuntimeException: Master not initialized after 200000ms seconds

Running org.apache.phoenix.end2end.index.ImmutableIndexWithStatsIT
Tests run: 1, Failures: 0, Errors: 1, Skipped: 0, Time elapsed: 0.007 sec <<< FAILURE! - in org.apache.phoenix.end2end.index.ImmutableIndexWithStatsIT
org.apache.phoenix.end2end.index.ImmutableIndexWithStatsIT  Time elapsed: 0.006 sec  <<< ERROR!
java.lang.RuntimeException: java.io.IOException: Shutting down
	at org.apache.phoenix.end2end.index.ImmutableIndexWithStatsIT.doSetup(ImmutableIndexWithStatsIT.java:52)
Caused by: java.io.IOException: Shutting down
	at org.apache.phoenix.end2end.index.ImmutableIndexWithStatsIT.doSetup(ImmutableIndexWithStatsIT.java:52)
Caused by: java.lang.RuntimeException: Master not initialized after 200000ms seconds
	at org.apache.phoenix.end2end.index.ImmutableIndexWithStatsIT.doSetup(ImmutableIndexWithStatsIT.java:52)

Running org.apache.phoenix.end2end.index.MutableIndexFailureIT
Tests run: 1, Failures: 0, Errors: 1, Skipped: 0, Time elapsed: 0.006 sec <<< FAILURE! - in org.apache.phoenix.end2end.index.MutableIndexFailureIT
org.apache.phoenix.end2end.index.MutableIndexFailureIT  Time elapsed: 0.005 sec  <<< ERROR!
java.lang.RuntimeException: java.io.IOException: Shutting down
	at org.apache.phoenix.end2end.index.MutableIndexFailureIT.doSetup(MutableIndexFailureIT.java:113)
Caused by: java.io.IOException: Shutting down
	at org.apache.phoenix.end2end.index.MutableIndexFailureIT.doSetup(MutableIndexFailureIT.java:113)
Caused by: java.lang.RuntimeException: Master not initialized after 200000ms seconds
	at org.apache.phoenix.end2end.index.MutableIndexFailureIT.doSetup(MutableIndexFailureIT.java:113)

Running org.apache.phoenix.end2end.index.MutableIndexReplicationIT
Running org.apache.phoenix.hbase.index.FailForUnsupportedHBaseVersionsIT
Tests run: 1, Failures: 0, Errors: 1, Skipped: 0, Time elapsed: 0.006 sec <<< FAILURE! - in org.apache.phoenix.end2end.index.MutableIndexReplicationIT
org.apache.phoenix.end2end.index.MutableIndexReplicationIT  Time elapsed: 0.006 sec  <<< ERROR!
java.io.IOException: Shutting down
	at org.apache.phoenix.end2end.index.MutableIndexReplicationIT.setupConfigsAndStartCluster(MutableIndexReplicationIT.java:170)
	at org.apache.phoenix.end2end.index.MutableIndexReplicationIT.setUpBeforeClass(MutableIndexReplicationIT.java:108)
Caused by: java.lang.RuntimeException: Master not initialized after 200000ms seconds
	at org.apache.phoenix.end2end.index.MutableIndexReplicationIT.setupConfigsAndStartCluster(MutableIndexReplicationIT.java:170)
	at org.apache.phoenix.end2end.index.MutableIndexReplicationIT.setUpBeforeClass(MutableIndexReplicationIT.java:108)

Running org.apache.phoenix.end2end.index.ReadOnlyIndexFailureIT
Tests run: 1, Failures: 0, Errors: 1, Skipped: 0, Time elapsed: 0.006 sec <<< FAILURE! - in org.apache.phoenix.end2end.index.ReadOnlyIndexFailureIT
org.apache.phoenix.end2end.index.ReadOnlyIndexFailureIT  Time elapsed: 0.005 sec  <<< ERROR!
java.lang.RuntimeException: java.io.IOException: Shutting down
	at org.apache.phoenix.end2end.index.ReadOnlyIndexFailureIT.doSetup(ReadOnlyIndexFailureIT.java:116)
Caused by: java.io.IOException: Shutting down
	at org.apache.phoenix.end2end.index.ReadOnlyIndexFailureIT.doSetup(ReadOnlyIndexFailureIT.java:116)
Caused by: java.lang.RuntimeException: Master not initialized after 200000ms seconds
	at org.apache.phoenix.end2end.index.ReadOnlyIndexFailureIT.doSetup(ReadOnlyIndexFailureIT.java:116)

Running org.apache.phoenix.end2end.index.txn.TxWriteFailureIT
Tests run: 1, Failures: 0, Errors: 1, Skipped: 0, Time elapsed: 0.006 sec <<< FAILURE! - in org.apache.phoenix.end2end.index.txn.TxWriteFailureIT
org.apache.phoenix.end2end.index.txn.TxWriteFailureIT  Time elapsed: 0.005 sec  <<< ERROR!
java.lang.RuntimeException: java.io.IOException: Shutting down
	at org.apache.phoenix.end2end.index.txn.TxWriteFailureIT.doSetup(TxWriteFailureIT.java:86)
Caused by: java.io.IOException: Shutting down
	at org.apache.phoenix.end2end.index.txn.TxWriteFailureIT.doSetup(TxWriteFailureIT.java:86)
Caused by: java.lang.RuntimeException: Master not initialized after 200000ms seconds
	at org.apache.phoenix.end2end.index.txn.TxWriteFailureIT.doSetup(TxWriteFailureIT.java:86)

Running org.apache.phoenix.execute.PartialCommitIT
Tests run: 1, Failures: 0, Errors: 1, Skipped: 0, Time elapsed: 0.006 sec <<< FAILURE! - in org.apache.phoenix.execute.PartialCommitIT
org.apache.phoenix.execute.PartialCommitIT  Time elapsed: 0.005 sec  <<< ERROR!
java.lang.RuntimeException: java.io.IOException: Shutting down
	at org.apache.phoenix.execute.PartialCommitIT.doSetup(PartialCommitIT.java:94)
Caused by: java.io.IOException: Shutting down
	at org.apache.phoenix.execute.PartialCommitIT.doSetup(PartialCommitIT.java:94)
Caused by: java.lang.RuntimeException: Master not initialized after 200000ms seconds
	at org.apache.phoenix.execute.PartialCommitIT.doSetup(PartialCommitIT.java:94)

Tests run: 2, Failures: 0, Errors: 1, Skipped: 0, Time elapsed: 206.67 sec <<< FAILURE! - in org.apache.phoenix.hbase.index.FailForUnsupportedHBaseVersionsIT
testDoesNotStartRegionServerForUnsupportedCompressionAndVersion(org.apache.phoenix.hbase.index.FailForUnsupportedHBaseVersionsIT)  Time elapsed: 206.339 sec  <<< ERROR!
java.io.IOException: Shutting down
	at org.apache.phoenix.hbase.index.FailForUnsupportedHBaseVersionsIT.testDoesNotStartRegionServerForUnsupportedCompressionAndVersion(FailForUnsupportedHBaseVersionsIT.java:121)
Caused by: java.lang.RuntimeException: Master not initialized after 200000ms seconds
	at org.apache.phoenix.hbase.index.FailForUnsupportedHBaseVersionsIT.testDoesNotStartRegionServerForUnsupportedCompressionAndVersion(FailForUnsupportedHBaseVersionsIT.java:121)

Running org.apache.phoenix.hbase.index.balancer.IndexLoadBalancerIT
Tests run: 1, Failures: 0, Errors: 1, Skipped: 0, Time elapsed: 0.006 sec <<< FAILURE! - in org.apache.phoenix.hbase.index.balancer.IndexLoadBalancerIT
org.apache.phoenix.hbase.index.balancer.IndexLoadBalancerIT  Time elapsed: 0.006 sec  <<< ERROR!
java.io.IOException: Shutting down
	at org.apache.phoenix.hbase.index.balancer.IndexLoadBalancerIT.setupCluster(IndexLoadBalancerIT.java:87)
Caused by: java.lang.RuntimeException: Master not initialized after 200000ms seconds
	at org.apache.phoenix.hbase.index.balancer.IndexLoadBalancerIT.setupCluster(IndexLoadBalancerIT.java:87)

Running org.apache.phoenix.hbase.index.covered.EndToEndCoveredColumnsIndexBuilderIT
Tests run: 1, Failures: 0, Errors: 1, Skipped: 0, Time elapsed: 0.006 sec <<< FAILURE! - in org.apache.phoenix.hbase.index.covered.EndToEndCoveredColumnsIndexBuilderIT
org.apache.phoenix.hbase.index.covered.EndToEndCoveredColumnsIndexBuilderIT  Time elapsed: 0.005 sec  <<< ERROR!
java.io.IOException: Shutting down
	at org.apache.phoenix.hbase.index.covered.EndToEndCoveredColumnsIndexBuilderIT.setupCluster(EndToEndCoveredColumnsIndexBuilderIT.java:107)
Caused by: java.lang.RuntimeException: Master not initialized after 200000ms seconds
	at org.apache.phoenix.hbase.index.covered.EndToEndCoveredColumnsIndexBuilderIT.setupCluster(EndToEndCoveredColumnsIndexBuilderIT.java:107)

Running org.apache.phoenix.hbase.index.covered.example.EndToEndCoveredIndexingIT
Tests run: 1, Failures: 0, Errors: 1, Skipped: 0, Time elapsed: 0.006 sec <<< FAILURE! - in org.apache.phoenix.hbase.index.covered.example.EndToEndCoveredIndexingIT
org.apache.phoenix.hbase.index.covered.example.EndToEndCoveredIndexingIT  Time elapsed: 0.005 sec  <<< ERROR!
java.io.IOException: Shutting down
	at org.apache.phoenix.hbase.index.covered.example.EndToEndCoveredIndexingIT.setupCluster(EndToEndCoveredIndexingIT.java:131)
Caused by: java.lang.RuntimeException: Master not initialized after 200000ms seconds
	at org.apache.phoenix.hbase.index.covered.example.EndToEndCoveredIndexingIT.setupCluster(EndToEndCoveredIndexingIT.java:131)

Running org.apache.phoenix.hbase.index.covered.example.EndtoEndIndexingWithCompressionIT
Tests run: 1, Failures: 0, Errors: 1, Skipped: 0, Time elapsed: 0.007 sec <<< FAILURE! - in org.apache.phoenix.hbase.index.covered.example.EndtoEndIndexingWithCompressionIT
org.apache.phoenix.hbase.index.covered.example.EndtoEndIndexingWithCompressionIT  Time elapsed: 0.006 sec  <<< ERROR!
java.io.IOException: Shutting down
	at org.apache.phoenix.hbase.index.covered.example.EndtoEndIndexingWithCompressionIT.setupCluster(EndtoEndIndexingWithCompressionIT.java:42)
Caused by: java.lang.RuntimeException: Master not initialized after 200000ms seconds
	at org.apache.phoenix.hbase.index.covered.example.EndtoEndIndexingWithCompressionIT.setupCluster(EndtoEndIndexingWithCompressionIT.java:42)

Running org.apache.phoenix.hbase.index.covered.example.FailWithoutRetriesIT
Tests run: 1, Failures: 0, Errors: 1, Skipped: 0, Time elapsed: 0.006 sec <<< FAILURE! - in org.apache.phoenix.hbase.index.covered.example.FailWithoutRetriesIT
org.apache.phoenix.hbase.index.covered.example.FailWithoutRetriesIT  Time elapsed: 0.005 sec  <<< ERROR!
java.io.IOException: Shutting down
	at org.apache.phoenix.hbase.index.covered.example.FailWithoutRetriesIT.setupCluster(FailWithoutRetriesIT.java:84)
Caused by: java.lang.RuntimeException: Master not initialized after 200000ms seconds
	at org.apache.phoenix.hbase.index.covered.example.FailWithoutRetriesIT.setupCluster(FailWithoutRetriesIT.java:84)

Running org.apache.phoenix.iterate.RoundRobinResultIteratorWithStatsIT
Tests run: 1, Failures: 0, Errors: 1, Skipped: 0, Time elapsed: 0.006 sec <<< FAILURE! - in org.apache.phoenix.iterate.RoundRobinResultIteratorWithStatsIT
org.apache.phoenix.iterate.RoundRobinResultIteratorWithStatsIT  Time elapsed: 0.006 sec  <<< ERROR!
java.lang.RuntimeException: java.io.IOException: Shutting down
	at org.apache.phoenix.iterate.RoundRobinResultIteratorWithStatsIT.doSetup(RoundRobinResultIteratorWithStatsIT.java:58)
Caused by: java.io.IOException: Shutting down
	at org.apache.phoenix.iterate.RoundRobinResultIteratorWithStatsIT.doSetup(RoundRobinResultIteratorWithStatsIT.java:58)
Caused by: java.lang.RuntimeException: Master not initialized after 200000ms seconds
	at org.apache.phoenix.iterate.RoundRobinResultIteratorWithStatsIT.doSetup(RoundRobinResultIteratorWithStatsIT.java:58)

Running org.apache.phoenix.iterate.ScannerLeaseRenewalIT
Tests run: 1, Failures: 0, Errors: 1, Skipped: 0, Time elapsed: 0.006 sec <<< FAILURE! - in org.apache.phoenix.iterate.ScannerLeaseRenewalIT
org.apache.phoenix.iterate.ScannerLeaseRenewalIT  Time elapsed: 0.005 sec  <<< ERROR!
java.io.IOException: Shutting down
	at org.apache.phoenix.iterate.ScannerLeaseRenewalIT.setUp(ScannerLeaseRenewalIT.java:70)
Caused by: java.lang.RuntimeException: Master not initialized after 200000ms seconds
	at org.apache.phoenix.iterate.ScannerLeaseRenewalIT.setUp(ScannerLeaseRenewalIT.java:70)

Running org.apache.phoenix.monitoring.PhoenixMetricsIT
Tests run: 1, Failures: 0, Errors: 1, Skipped: 0, Time elapsed: 0.006 sec <<< FAILURE! - in org.apache.phoenix.monitoring.PhoenixMetricsIT
org.apache.phoenix.monitoring.PhoenixMetricsIT  Time elapsed: 0.005 sec  <<< ERROR!
java.lang.RuntimeException: java.io.IOException: Shutting down
	at org.apache.phoenix.monitoring.PhoenixMetricsIT.doSetup(PhoenixMetricsIT.java:78)
Caused by: java.io.IOException: Shutting down
	at org.apache.phoenix.monitoring.PhoenixMetricsIT.doSetup(PhoenixMetricsIT.java:78)
Caused by: java.lang.RuntimeException: Master not initialized after 200000ms seconds
	at org.apache.phoenix.monitoring.PhoenixMetricsIT.doSetup(PhoenixMetricsIT.java:78)

Running org.apache.phoenix.rpc.PhoenixClientRpcIT
Tests run: 1, Failures: 0, Errors: 1, Skipped: 0, Time elapsed: 0.006 sec <<< FAILURE! - in org.apache.phoenix.rpc.PhoenixClientRpcIT
org.apache.phoenix.rpc.PhoenixClientRpcIT  Time elapsed: 0.006 sec  <<< ERROR!
java.lang.RuntimeException: java.io.IOException: Shutting down
	at org.apache.phoenix.rpc.PhoenixClientRpcIT.doSetup(PhoenixClientRpcIT.java:47)
Caused by: java.io.IOException: Shutting down
	at org.apache.phoenix.rpc.PhoenixClientRpcIT.doSetup(PhoenixClientRpcIT.java:47)
Caused by: java.lang.RuntimeException: Master not initialized after 200000ms seconds
	at org.apache.phoenix.rpc.PhoenixClientRpcIT.doSetup(PhoenixClientRpcIT.java:47)

Running org.apache.phoenix.rpc.PhoenixServerRpcIT
Tests run: 1, Failures: 0, Errors: 1, Skipped: 0, Time elapsed: 0.006 sec <<< FAILURE! - in org.apache.phoenix.rpc.PhoenixServerRpcIT
org.apache.phoenix.rpc.PhoenixServerRpcIT  Time elapsed: 0.005 sec  <<< ERROR!
java.lang.RuntimeException: java.io.IOException: Shutting down
	at org.apache.phoenix.rpc.PhoenixServerRpcIT.doSetup(PhoenixServerRpcIT.java:72)
Caused by: java.io.IOException: Shutting down
	at org.apache.phoenix.rpc.PhoenixServerRpcIT.doSetup(PhoenixServerRpcIT.java:72)
Caused by: java.lang.RuntimeException: Master not initialized after 200000ms seconds
	at org.apache.phoenix.rpc.PhoenixServerRpcIT.doSetup(PhoenixServerRpcIT.java:72)


Results :

Tests in error: 
  WALReplayWithIndexWritesAndCompressedWALIT.setUp:98->setupCluster:109->startCluster:142 ? IO
  WALReplayWithIndexWritesAndUncompressedWALInHBase_094_9_IT>WALReplayWithIndexWritesAndCompressedWALIT.setUp:98->WALReplayWithIndexWritesAndCompressedWALIT.setupCluster:109->WALReplayWithIndexWritesAndCompressedWALIT.startCluster:142 ? IO
  StatisticsCollectionRunTrackerIT.doSetup:56->BaseTest.setUpTestDriver:630->BaseTest.setUpTestDriver:634->BaseTest.checkClusterInitialized:565->BaseTest.setUpTestCluster:578->BaseTest.initMiniCluster:687 ? Runtime
  AlterTableIT.doSetup:90->BaseTest.setUpTestDriver:630->BaseTest.setUpTestDriver:634->BaseTest.checkClusterInitialized:565->BaseTest.setUpTestCluster:578->BaseTest.initMiniCluster:687 ? Runtime
  ConnectionUtilIT.setUp:52 ? IO Shutting down
  ContextClassloaderIT.setUpBeforeClass:61 ? IO Shutting down
  CountDistinctCompressionIT.doSetup:48->BaseTest.setUpTestDriver:630->BaseTest.setUpTestDriver:634->BaseTest.checkClusterInitialized:565->BaseTest.setUpTestCluster:578->BaseTest.initMiniCluster:687 ? Runtime
  CsvBulkLoadToolIT.doSetup:60->BaseTest.setUpRealDriver:652 ? Runtime java.io.I...
  IndexToolIT.doSetup:93->BaseTest.setUpRealDriver:652 ? Runtime java.io.IOExcep...
  KeyOnlyIT.doSetup:57->BaseTest.setUpTestDriver:630->BaseTest.setUpTestDriver:634->BaseTest.checkClusterInitialized:565->BaseTest.setUpTestCluster:578->BaseTest.initMiniCluster:687 ? Runtime
  MultiCfQueryExecIT.doSetup:56->BaseTest.setUpTestDriver:630->BaseTest.setUpTestDriver:634->BaseTest.checkClusterInitialized:565->BaseTest.setUpTestCluster:578->BaseTest.initMiniCluster:687 ? Runtime
  MutableIndexToolIT.doSetup:50->BaseTest.setUpRealDriver:652 ? Runtime java.io....
  ParallelIteratorsIT.doSetup:76->BaseTest.setUpTestDriver:630->BaseTest.setUpTestDriver:634->BaseTest.checkClusterInitialized:565->BaseTest.setUpTestCluster:578->BaseTest.initMiniCluster:687 ? Runtime
  QueryTimeoutIT.doSetup:59->BaseTest.setUpTestDriver:630->BaseTest.setUpTestDriver:634->BaseTest.checkClusterInitialized:565->BaseTest.setUpTestCluster:578->BaseTest.initMiniCluster:687 ? Runtime
  QueryWithLimitIT.doSetup:58->BaseTest.setUpTestDriver:630->BaseTest.setUpTestDriver:634->BaseTest.checkClusterInitialized:565->BaseTest.setUpTestCluster:578->BaseTest.initMiniCluster:687 ? Runtime
  QueryWithOffsetIT.doSetup:70->BaseTest.setUpTestDriver:630->BaseTest.setUpTestDriver:634->BaseTest.checkClusterInitialized:565->BaseTest.setUpTestCluster:578->BaseTest.initMiniCluster:687 ? Runtime
  SaltedViewIT>BaseViewIT.doSetup:72->BaseTest.setUpTestDriver:630->BaseTest.setUpTestDriver:634->BaseTest.checkClusterInitialized:565->BaseTest.setUpTestCluster:578->BaseTest.initMiniCluster:687 ? Runtime
  SpillableGroupByIT.doSetup:72->BaseTest.setUpTestDriver:630->BaseTest.setUpTestDriver:634->BaseTest.checkClusterInitialized:565->BaseTest.setUpTestCluster:578->BaseTest.initMiniCluster:687 ? Runtime
  StatsCollectionDisabledIT.doSetup:54->BaseTest.setUpTestDriver:630->BaseTest.setUpTestDriver:634->BaseTest.checkClusterInitialized:565->BaseTest.setUpTestCluster:578->BaseTest.initMiniCluster:687 ? Runtime
  StatsCollectorIT.doSetup:77->BaseTest.setUpTestDriver:630->BaseTest.setUpTestDriver:634->BaseTest.checkClusterInitialized:565->BaseTest.setUpTestCluster:578->BaseTest.initMiniCluster:687 ? Runtime
  StatsCollectorWithSplitsAndMultiCFIT.doSetup:61->BaseTest.setUpTestDriver:630->BaseTest.setUpTestDriver:634->BaseTest.checkClusterInitialized:565->BaseTest.setUpTestCluster:578->BaseTest.initMiniCluster:687 ? Runtime
  TenantSpecificTablesDDLIT>BaseTenantSpecificTablesIT.doSetup:79->BaseTest.setUpTestDriver:630->BaseTest.setUpTestDriver:634->BaseTest.checkClusterInitialized:565->BaseTest.setUpTestCluster:578->BaseTest.initMiniCluster:687 ? Runtime
  TenantSpecificTablesDMLIT>BaseTenantSpecificTablesIT.doSetup:79->BaseTest.setUpTestDriver:630->BaseTest.setUpTestDriver:634->BaseTest.checkClusterInitialized:565->BaseTest.setUpTestCluster:578->BaseTest.initMiniCluster:687 ? Runtime
  TransactionalViewIT.doSetup:46->BaseTest.setUpTestDriver:630->BaseTest.setUpTestDriver:634->BaseTest.checkClusterInitialized:565->BaseTest.setUpTestCluster:578->BaseTest.initMiniCluster:687 ? Runtime
  UnionAllIT.doSetup:48->BaseTest.setUpTestDriver:630->BaseTest.setUpTestDriver:634->BaseTest.checkClusterInitialized:565->BaseTest.setUpTestCluster:578->BaseTest.initMiniCluster:687 ? Runtime
  UserDefinedFunctionsIT.doSetup:249 ? IO Shutting down
  ViewIT>BaseViewIT.doSetup:72->BaseTest.setUpTestDriver:630->BaseTest.setUpTestDriver:634->BaseTest.checkClusterInitialized:565->BaseTest.setUpTestCluster:578->BaseTest.initMiniCluster:687 ? Runtime
  ImmutableIndexWithStatsIT.doSetup:52->BaseTest.setUpTestDriver:630->BaseTest.setUpTestDriver:634->BaseTest.checkClusterInitialized:565->BaseTest.setUpTestCluster:578->BaseTest.initMiniCluster:687 ? Runtime
  MutableIndexFailureIT.doSetup:113->BaseTest.setUpTestDriver:634->BaseTest.checkClusterInitialized:565->BaseTest.setUpTestCluster:578->BaseTest.initMiniCluster:687 ? Runtime
  MutableIndexReplicationIT.setUpBeforeClass:108->setupConfigsAndStartCluster:170 ? IO
  ReadOnlyIndexFailureIT.doSetup:116->BaseTest.setUpTestDriver:634->BaseTest.checkClusterInitialized:565->BaseTest.setUpTestCluster:578->BaseTest.initMiniCluster:687 ? Runtime
  TxWriteFailureIT.doSetup:86->BaseTest.setUpTestDriver:634->BaseTest.checkClusterInitialized:565->BaseTest.setUpTestCluster:578->BaseTest.initMiniCluster:687 ? Runtime
  PartialCommitIT.doSetup:94->BaseTest.setUpTestDriver:634->BaseTest.checkClusterInitialized:565->BaseTest.setUpTestCluster:578->BaseTest.initMiniCluster:687 ? Runtime
  FailForUnsupportedHBaseVersionsIT.testDoesNotStartRegionServerForUnsupportedCompressionAndVersion:121 ? IO
  IndexLoadBalancerIT.setupCluster:87 ? IO Shutting down
  EndToEndCoveredColumnsIndexBuilderIT.setupCluster:107 ? IO Shutting down
  EndToEndCoveredIndexingIT.setupCluster:131 ? IO Shutting down
  EndtoEndIndexingWithCompressionIT.setupCluster:42 ? IO Shutting down
  FailWithoutRetriesIT.setupCluster:84 ? IO Shutting down
  RoundRobinResultIteratorWithStatsIT.doSetup:58->BaseTest.setUpTestDriver:630->BaseTest.setUpTestDriver:634->BaseTest.checkClusterInitialized:565->BaseTest.setUpTestCluster:578->BaseTest.initMiniCluster:687 ? Runtime
  ScannerLeaseRenewalIT.setUp:70 ? IO Shutting down
  PhoenixMetricsIT.doSetup:78->BaseTest.setUpTestDriver:630->BaseTest.setUpTestDriver:634->BaseTest.checkClusterInitialized:565->BaseTest.setUpTestCluster:578->BaseTest.initMiniCluster:687 ? Runtime
  PhoenixClientRpcIT.doSetup:47->BaseTest.setUpTestDriver:634->BaseTest.checkClusterInitialized:565->BaseTest.setUpTestCluster:578->BaseTest.initMiniCluster:687 ? Runtime
  PhoenixServerRpcIT.doSetup:72->BaseTest.setUpTestDriver:634->BaseTest.checkClusterInitialized:565->BaseTest.setUpTestCluster:578->BaseTest.initMiniCluster:687 ? Runtime

Tests run: 45, Failures: 0, Errors: 44, Skipped: 0

[INFO] 
[INFO] --- maven-failsafe-plugin:2.19.1:verify (ClientManagedTimeTests) @ phoenix-core ---
[INFO] ------------------------------------------------------------------------
[INFO] Reactor Summary:
[INFO] 
[INFO] Apache Phoenix .................................... SUCCESS [2.407s]
[INFO] Phoenix Core ...................................... FAILURE [2:15:32.102s]
[INFO] Phoenix - Flume ................................... SKIPPED
[INFO] Phoenix - Pig ..................................... SKIPPED
[INFO] Phoenix Query Server Client ....................... SKIPPED
[INFO] Phoenix Query Server .............................. SKIPPED
[INFO] Phoenix - Pherf ................................... SKIPPED
[INFO] Phoenix - Spark ................................... SKIPPED
[INFO] Phoenix - Hive .................................... SKIPPED
[INFO] Phoenix Assembly .................................. SKIPPED
[INFO] Phoenix - Tracing Web Application ................. SKIPPED
[INFO] ------------------------------------------------------------------------
[INFO] BUILD FAILURE
[INFO] ------------------------------------------------------------------------
[INFO] Total time: 2:15:35.187s
[INFO] Finished at: Sun May 01 17:56:23 UTC 2016
[INFO] Final Memory: 53M/1050M
[INFO] ------------------------------------------------------------------------
[ERROR] Failed to execute goal org.apache.maven.plugins:maven-failsafe-plugin:2.19.1:verify (ClientManagedTimeTests) on project phoenix-core: There are test failures.
[ERROR] 
[ERROR] Please refer to /x1/jenkins/jenkins-slave/workspace/Phoenix-4.x-HBase-1.1/phoenix-core/target/failsafe-reports for the individual test results.
[ERROR] -> [Help 1]
[ERROR] 
[ERROR] To see the full stack trace of the errors, re-run Maven with the -e switch.
[ERROR] Re-run Maven using the -X switch to enable full debug logging.
[ERROR] 
[ERROR] For more information about the errors and possible solutions, please read the following articles:
[ERROR] [Help 1] http://cwiki.apache.org/confluence/display/MAVEN/MojoFailureException
[ERROR] 
[ERROR] After correcting the problems, you can resume the build with the command
[ERROR]   mvn <goals> -rf :phoenix-core
Build step 'Invoke top-level Maven targets' marked build as failure
Archiving artifacts
No prior successful build to compare, so performing full copy of artifacts
Recording test results

Build failed in Jenkins: Phoenix-4.x-HBase-1.1 #11

Posted by Apache Jenkins Server <je...@builds.apache.org>.
See <https://builds.apache.org/job/Phoenix-4.x-HBase-1.1/11/changes>

Changes:

[jamestaylor] PHOENIX-2872 Find usages of server time in BaseClientManagedTimeIT

[jamestaylor] PHOENIX-2868 QueryServerBasicsIT.testSchemas is failing (Ankit Singhal)

------------------------------------------
[...truncated 2057 lines...]
Caused by: java.lang.RuntimeException: Master not initialized after 200000ms seconds

Running org.apache.phoenix.end2end.index.ImmutableIndexWithStatsIT
Tests run: 1, Failures: 0, Errors: 1, Skipped: 0, Time elapsed: 0.006 sec <<< FAILURE! - in org.apache.phoenix.end2end.index.ImmutableIndexWithStatsIT
org.apache.phoenix.end2end.index.ImmutableIndexWithStatsIT  Time elapsed: 0.005 sec  <<< ERROR!
java.lang.RuntimeException: java.io.IOException: Shutting down
	at org.apache.phoenix.end2end.index.ImmutableIndexWithStatsIT.doSetup(ImmutableIndexWithStatsIT.java:52)
Caused by: java.io.IOException: Shutting down
	at org.apache.phoenix.end2end.index.ImmutableIndexWithStatsIT.doSetup(ImmutableIndexWithStatsIT.java:52)
Caused by: java.lang.RuntimeException: Master not initialized after 200000ms seconds
	at org.apache.phoenix.end2end.index.ImmutableIndexWithStatsIT.doSetup(ImmutableIndexWithStatsIT.java:52)

Running org.apache.phoenix.end2end.index.MutableIndexFailureIT
Running org.apache.phoenix.end2end.index.MutableIndexReplicationIT
Tests run: 1, Failures: 0, Errors: 1, Skipped: 0, Time elapsed: 0.006 sec <<< FAILURE! - in org.apache.phoenix.end2end.index.MutableIndexFailureIT
org.apache.phoenix.end2end.index.MutableIndexFailureIT  Time elapsed: 0.005 sec  <<< ERROR!
java.lang.RuntimeException: java.io.IOException: Shutting down
	at org.apache.phoenix.end2end.index.MutableIndexFailureIT.doSetup(MutableIndexFailureIT.java:113)
Caused by: java.io.IOException: Shutting down
	at org.apache.phoenix.end2end.index.MutableIndexFailureIT.doSetup(MutableIndexFailureIT.java:113)
Caused by: java.lang.RuntimeException: Master not initialized after 200000ms seconds
	at org.apache.phoenix.end2end.index.MutableIndexFailureIT.doSetup(MutableIndexFailureIT.java:113)

Running org.apache.phoenix.hbase.index.FailForUnsupportedHBaseVersionsIT
Tests run: 1, Failures: 0, Errors: 1, Skipped: 0, Time elapsed: 0.006 sec <<< FAILURE! - in org.apache.phoenix.end2end.index.MutableIndexReplicationIT
org.apache.phoenix.end2end.index.MutableIndexReplicationIT  Time elapsed: 0.005 sec  <<< ERROR!
java.io.IOException: Shutting down
	at org.apache.phoenix.end2end.index.MutableIndexReplicationIT.setupConfigsAndStartCluster(MutableIndexReplicationIT.java:170)
	at org.apache.phoenix.end2end.index.MutableIndexReplicationIT.setUpBeforeClass(MutableIndexReplicationIT.java:108)
Caused by: java.lang.RuntimeException: Master not initialized after 200000ms seconds
	at org.apache.phoenix.end2end.index.MutableIndexReplicationIT.setupConfigsAndStartCluster(MutableIndexReplicationIT.java:170)
	at org.apache.phoenix.end2end.index.MutableIndexReplicationIT.setUpBeforeClass(MutableIndexReplicationIT.java:108)

Running org.apache.phoenix.end2end.index.ReadOnlyIndexFailureIT
Tests run: 1, Failures: 0, Errors: 1, Skipped: 0, Time elapsed: 0.006 sec <<< FAILURE! - in org.apache.phoenix.end2end.index.ReadOnlyIndexFailureIT
org.apache.phoenix.end2end.index.ReadOnlyIndexFailureIT  Time elapsed: 0.005 sec  <<< ERROR!
java.lang.RuntimeException: java.io.IOException: Shutting down
	at org.apache.phoenix.end2end.index.ReadOnlyIndexFailureIT.doSetup(ReadOnlyIndexFailureIT.java:116)
Caused by: java.io.IOException: Shutting down
	at org.apache.phoenix.end2end.index.ReadOnlyIndexFailureIT.doSetup(ReadOnlyIndexFailureIT.java:116)
Caused by: java.lang.RuntimeException: Master not initialized after 200000ms seconds
	at org.apache.phoenix.end2end.index.ReadOnlyIndexFailureIT.doSetup(ReadOnlyIndexFailureIT.java:116)

Running org.apache.phoenix.end2end.index.txn.TxWriteFailureIT
Tests run: 1, Failures: 0, Errors: 1, Skipped: 0, Time elapsed: 0.007 sec <<< FAILURE! - in org.apache.phoenix.end2end.index.txn.TxWriteFailureIT
org.apache.phoenix.end2end.index.txn.TxWriteFailureIT  Time elapsed: 0.006 sec  <<< ERROR!
java.lang.RuntimeException: java.io.IOException: Shutting down
	at org.apache.phoenix.end2end.index.txn.TxWriteFailureIT.doSetup(TxWriteFailureIT.java:86)
Caused by: java.io.IOException: Shutting down
	at org.apache.phoenix.end2end.index.txn.TxWriteFailureIT.doSetup(TxWriteFailureIT.java:86)
Caused by: java.lang.RuntimeException: Master not initialized after 200000ms seconds
	at org.apache.phoenix.end2end.index.txn.TxWriteFailureIT.doSetup(TxWriteFailureIT.java:86)

Running org.apache.phoenix.execute.PartialCommitIT
Tests run: 1, Failures: 0, Errors: 1, Skipped: 0, Time elapsed: 0.039 sec <<< FAILURE! - in org.apache.phoenix.execute.PartialCommitIT
org.apache.phoenix.execute.PartialCommitIT  Time elapsed: 0.039 sec  <<< ERROR!
java.lang.RuntimeException: java.io.IOException: Shutting down
	at org.apache.phoenix.execute.PartialCommitIT.doSetup(PartialCommitIT.java:94)
Caused by: java.io.IOException: Shutting down
	at org.apache.phoenix.execute.PartialCommitIT.doSetup(PartialCommitIT.java:94)
Caused by: java.lang.RuntimeException: Master not initialized after 200000ms seconds
	at org.apache.phoenix.execute.PartialCommitIT.doSetup(PartialCommitIT.java:94)

Tests run: 2, Failures: 0, Errors: 1, Skipped: 0, Time elapsed: 206.967 sec <<< FAILURE! - in org.apache.phoenix.hbase.index.FailForUnsupportedHBaseVersionsIT
testDoesNotStartRegionServerForUnsupportedCompressionAndVersion(org.apache.phoenix.hbase.index.FailForUnsupportedHBaseVersionsIT)  Time elapsed: 206.646 sec  <<< ERROR!
java.io.IOException: Shutting down
	at org.apache.phoenix.hbase.index.FailForUnsupportedHBaseVersionsIT.testDoesNotStartRegionServerForUnsupportedCompressionAndVersion(FailForUnsupportedHBaseVersionsIT.java:121)
Caused by: java.lang.RuntimeException: Master not initialized after 200000ms seconds
	at org.apache.phoenix.hbase.index.FailForUnsupportedHBaseVersionsIT.testDoesNotStartRegionServerForUnsupportedCompressionAndVersion(FailForUnsupportedHBaseVersionsIT.java:121)

Running org.apache.phoenix.hbase.index.balancer.IndexLoadBalancerIT
Tests run: 1, Failures: 0, Errors: 1, Skipped: 0, Time elapsed: 0.005 sec <<< FAILURE! - in org.apache.phoenix.hbase.index.balancer.IndexLoadBalancerIT
org.apache.phoenix.hbase.index.balancer.IndexLoadBalancerIT  Time elapsed: 0.004 sec  <<< ERROR!
java.io.IOException: Shutting down
	at org.apache.phoenix.hbase.index.balancer.IndexLoadBalancerIT.setupCluster(IndexLoadBalancerIT.java:87)
Caused by: java.lang.RuntimeException: Master not initialized after 200000ms seconds
	at org.apache.phoenix.hbase.index.balancer.IndexLoadBalancerIT.setupCluster(IndexLoadBalancerIT.java:87)

Running org.apache.phoenix.hbase.index.covered.EndToEndCoveredColumnsIndexBuilderIT
Tests run: 1, Failures: 0, Errors: 1, Skipped: 0, Time elapsed: 0.006 sec <<< FAILURE! - in org.apache.phoenix.hbase.index.covered.EndToEndCoveredColumnsIndexBuilderIT
org.apache.phoenix.hbase.index.covered.EndToEndCoveredColumnsIndexBuilderIT  Time elapsed: 0.005 sec  <<< ERROR!
java.io.IOException: Shutting down
	at org.apache.phoenix.hbase.index.covered.EndToEndCoveredColumnsIndexBuilderIT.setupCluster(EndToEndCoveredColumnsIndexBuilderIT.java:107)
Caused by: java.lang.RuntimeException: Master not initialized after 200000ms seconds
	at org.apache.phoenix.hbase.index.covered.EndToEndCoveredColumnsIndexBuilderIT.setupCluster(EndToEndCoveredColumnsIndexBuilderIT.java:107)

Running org.apache.phoenix.hbase.index.covered.example.EndToEndCoveredIndexingIT
Tests run: 1, Failures: 0, Errors: 1, Skipped: 0, Time elapsed: 0.007 sec <<< FAILURE! - in org.apache.phoenix.hbase.index.covered.example.EndToEndCoveredIndexingIT
org.apache.phoenix.hbase.index.covered.example.EndToEndCoveredIndexingIT  Time elapsed: 0.006 sec  <<< ERROR!
java.io.IOException: Shutting down
	at org.apache.phoenix.hbase.index.covered.example.EndToEndCoveredIndexingIT.setupCluster(EndToEndCoveredIndexingIT.java:131)
Caused by: java.lang.RuntimeException: Master not initialized after 200000ms seconds
	at org.apache.phoenix.hbase.index.covered.example.EndToEndCoveredIndexingIT.setupCluster(EndToEndCoveredIndexingIT.java:131)

Running org.apache.phoenix.hbase.index.covered.example.EndtoEndIndexingWithCompressionIT
Tests run: 1, Failures: 0, Errors: 1, Skipped: 0, Time elapsed: 0.004 sec <<< FAILURE! - in org.apache.phoenix.hbase.index.covered.example.EndtoEndIndexingWithCompressionIT
org.apache.phoenix.hbase.index.covered.example.EndtoEndIndexingWithCompressionIT  Time elapsed: 0.003 sec  <<< ERROR!
java.io.IOException: Shutting down
	at org.apache.phoenix.hbase.index.covered.example.EndtoEndIndexingWithCompressionIT.setupCluster(EndtoEndIndexingWithCompressionIT.java:42)
Caused by: java.lang.RuntimeException: Master not initialized after 200000ms seconds
	at org.apache.phoenix.hbase.index.covered.example.EndtoEndIndexingWithCompressionIT.setupCluster(EndtoEndIndexingWithCompressionIT.java:42)

Running org.apache.phoenix.hbase.index.covered.example.FailWithoutRetriesIT
Tests run: 1, Failures: 0, Errors: 1, Skipped: 0, Time elapsed: 0.004 sec <<< FAILURE! - in org.apache.phoenix.hbase.index.covered.example.FailWithoutRetriesIT
org.apache.phoenix.hbase.index.covered.example.FailWithoutRetriesIT  Time elapsed: 0.003 sec  <<< ERROR!
java.io.IOException: Shutting down
	at org.apache.phoenix.hbase.index.covered.example.FailWithoutRetriesIT.setupCluster(FailWithoutRetriesIT.java:84)
Caused by: java.lang.RuntimeException: Master not initialized after 200000ms seconds
	at org.apache.phoenix.hbase.index.covered.example.FailWithoutRetriesIT.setupCluster(FailWithoutRetriesIT.java:84)

Running org.apache.phoenix.iterate.RoundRobinResultIteratorWithStatsIT
Tests run: 1, Failures: 0, Errors: 1, Skipped: 0, Time elapsed: 0.007 sec <<< FAILURE! - in org.apache.phoenix.iterate.RoundRobinResultIteratorWithStatsIT
org.apache.phoenix.iterate.RoundRobinResultIteratorWithStatsIT  Time elapsed: 0.006 sec  <<< ERROR!
java.lang.RuntimeException: java.io.IOException: Shutting down
	at org.apache.phoenix.iterate.RoundRobinResultIteratorWithStatsIT.doSetup(RoundRobinResultIteratorWithStatsIT.java:58)
Caused by: java.io.IOException: Shutting down
	at org.apache.phoenix.iterate.RoundRobinResultIteratorWithStatsIT.doSetup(RoundRobinResultIteratorWithStatsIT.java:58)
Caused by: java.lang.RuntimeException: Master not initialized after 200000ms seconds
	at org.apache.phoenix.iterate.RoundRobinResultIteratorWithStatsIT.doSetup(RoundRobinResultIteratorWithStatsIT.java:58)

Running org.apache.phoenix.iterate.ScannerLeaseRenewalIT
Tests run: 1, Failures: 0, Errors: 1, Skipped: 0, Time elapsed: 0.006 sec <<< FAILURE! - in org.apache.phoenix.iterate.ScannerLeaseRenewalIT
org.apache.phoenix.iterate.ScannerLeaseRenewalIT  Time elapsed: 0.005 sec  <<< ERROR!
java.io.IOException: Shutting down
	at org.apache.phoenix.iterate.ScannerLeaseRenewalIT.setUp(ScannerLeaseRenewalIT.java:70)
Caused by: java.lang.RuntimeException: Master not initialized after 200000ms seconds
	at org.apache.phoenix.iterate.ScannerLeaseRenewalIT.setUp(ScannerLeaseRenewalIT.java:70)

Running org.apache.phoenix.monitoring.PhoenixMetricsIT
Tests run: 1, Failures: 0, Errors: 1, Skipped: 0, Time elapsed: 0.007 sec <<< FAILURE! - in org.apache.phoenix.monitoring.PhoenixMetricsIT
org.apache.phoenix.monitoring.PhoenixMetricsIT  Time elapsed: 0.006 sec  <<< ERROR!
java.lang.RuntimeException: java.io.IOException: Shutting down
	at org.apache.phoenix.monitoring.PhoenixMetricsIT.doSetup(PhoenixMetricsIT.java:78)
Caused by: java.io.IOException: Shutting down
	at org.apache.phoenix.monitoring.PhoenixMetricsIT.doSetup(PhoenixMetricsIT.java:78)
Caused by: java.lang.RuntimeException: Master not initialized after 200000ms seconds
	at org.apache.phoenix.monitoring.PhoenixMetricsIT.doSetup(PhoenixMetricsIT.java:78)

Running org.apache.phoenix.rpc.PhoenixClientRpcIT
Tests run: 1, Failures: 0, Errors: 1, Skipped: 0, Time elapsed: 0.003 sec <<< FAILURE! - in org.apache.phoenix.rpc.PhoenixClientRpcIT
org.apache.phoenix.rpc.PhoenixClientRpcIT  Time elapsed: 0.003 sec  <<< ERROR!
java.lang.RuntimeException: java.io.IOException: Shutting down
	at org.apache.phoenix.rpc.PhoenixClientRpcIT.doSetup(PhoenixClientRpcIT.java:47)
Caused by: java.io.IOException: Shutting down
	at org.apache.phoenix.rpc.PhoenixClientRpcIT.doSetup(PhoenixClientRpcIT.java:47)
Caused by: java.lang.RuntimeException: Master not initialized after 200000ms seconds
	at org.apache.phoenix.rpc.PhoenixClientRpcIT.doSetup(PhoenixClientRpcIT.java:47)

Running org.apache.phoenix.rpc.PhoenixServerRpcIT
Tests run: 1, Failures: 0, Errors: 1, Skipped: 0, Time elapsed: 0.006 sec <<< FAILURE! - in org.apache.phoenix.rpc.PhoenixServerRpcIT
org.apache.phoenix.rpc.PhoenixServerRpcIT  Time elapsed: 0.005 sec  <<< ERROR!
java.lang.RuntimeException: java.io.IOException: Shutting down
	at org.apache.phoenix.rpc.PhoenixServerRpcIT.doSetup(PhoenixServerRpcIT.java:72)
Caused by: java.io.IOException: Shutting down
	at org.apache.phoenix.rpc.PhoenixServerRpcIT.doSetup(PhoenixServerRpcIT.java:72)
Caused by: java.lang.RuntimeException: Master not initialized after 200000ms seconds
	at org.apache.phoenix.rpc.PhoenixServerRpcIT.doSetup(PhoenixServerRpcIT.java:72)


Results :

Tests in error: 
  WALReplayWithIndexWritesAndCompressedWALIT.setUp:98->setupCluster:109->startCluster:142 ? IO
  WALReplayWithIndexWritesAndUncompressedWALInHBase_094_9_IT>WALReplayWithIndexWritesAndCompressedWALIT.setUp:98->WALReplayWithIndexWritesAndCompressedWALIT.setupCluster:109->WALReplayWithIndexWritesAndCompressedWALIT.startCluster:142 ? IO
  StatisticsCollectionRunTrackerIT.doSetup:56->BaseTest.setUpTestDriver:630->BaseTest.setUpTestDriver:634->BaseTest.checkClusterInitialized:565->BaseTest.setUpTestCluster:578->BaseTest.initMiniCluster:687 ? Runtime
  AlterTableIT.doSetup:90->BaseTest.setUpTestDriver:630->BaseTest.setUpTestDriver:634->BaseTest.checkClusterInitialized:565->BaseTest.setUpTestCluster:578->BaseTest.initMiniCluster:687 ? Runtime
  ConnectionUtilIT.setUp:52 ? IO Shutting down
  ContextClassloaderIT.setUpBeforeClass:61 ? IO Shutting down
  CountDistinctCompressionIT.doSetup:48->BaseTest.setUpTestDriver:630->BaseTest.setUpTestDriver:634->BaseTest.checkClusterInitialized:565->BaseTest.setUpTestCluster:578->BaseTest.initMiniCluster:687 ? Runtime
  CsvBulkLoadToolIT.doSetup:60->BaseTest.setUpRealDriver:652 ? Runtime java.io.I...
  IndexToolIT.doSetup:93->BaseTest.setUpRealDriver:652 ? Runtime java.io.IOExcep...
  KeyOnlyIT.doSetup:57->BaseTest.setUpTestDriver:630->BaseTest.setUpTestDriver:634->BaseTest.checkClusterInitialized:565->BaseTest.setUpTestCluster:578->BaseTest.initMiniCluster:687 ? Runtime
  MultiCfQueryExecIT.doSetup:56->BaseTest.setUpTestDriver:630->BaseTest.setUpTestDriver:634->BaseTest.checkClusterInitialized:565->BaseTest.setUpTestCluster:578->BaseTest.initMiniCluster:687 ? Runtime
  MutableIndexToolIT.doSetup:50->BaseTest.setUpRealDriver:652 ? Runtime java.io....
  ParallelIteratorsIT.doSetup:76->BaseTest.setUpTestDriver:630->BaseTest.setUpTestDriver:634->BaseTest.checkClusterInitialized:565->BaseTest.setUpTestCluster:578->BaseTest.initMiniCluster:687 ? Runtime
  QueryTimeoutIT.doSetup:59->BaseTest.setUpTestDriver:630->BaseTest.setUpTestDriver:634->BaseTest.checkClusterInitialized:565->BaseTest.setUpTestCluster:578->BaseTest.initMiniCluster:687 ? Runtime
  QueryWithLimitIT.doSetup:58->BaseTest.setUpTestDriver:630->BaseTest.setUpTestDriver:634->BaseTest.checkClusterInitialized:565->BaseTest.setUpTestCluster:578->BaseTest.initMiniCluster:687 ? Runtime
  QueryWithOffsetIT.doSetup:70->BaseTest.setUpTestDriver:630->BaseTest.setUpTestDriver:634->BaseTest.checkClusterInitialized:565->BaseTest.setUpTestCluster:578->BaseTest.initMiniCluster:687 ? Runtime
  SaltedViewIT>BaseViewIT.doSetup:72->BaseTest.setUpTestDriver:630->BaseTest.setUpTestDriver:634->BaseTest.checkClusterInitialized:565->BaseTest.setUpTestCluster:578->BaseTest.initMiniCluster:687 ? Runtime
  SpillableGroupByIT.doSetup:72->BaseTest.setUpTestDriver:630->BaseTest.setUpTestDriver:634->BaseTest.checkClusterInitialized:565->BaseTest.setUpTestCluster:578->BaseTest.initMiniCluster:687 ? Runtime
  StatsCollectionDisabledIT.doSetup:54->BaseTest.setUpTestDriver:630->BaseTest.setUpTestDriver:634->BaseTest.checkClusterInitialized:565->BaseTest.setUpTestCluster:578->BaseTest.initMiniCluster:687 ? Runtime
  StatsCollectorIT.doSetup:77->BaseTest.setUpTestDriver:630->BaseTest.setUpTestDriver:634->BaseTest.checkClusterInitialized:565->BaseTest.setUpTestCluster:578->BaseTest.initMiniCluster:687 ? Runtime
  StatsCollectorWithSplitsAndMultiCFIT.doSetup:61->BaseTest.setUpTestDriver:630->BaseTest.setUpTestDriver:634->BaseTest.checkClusterInitialized:565->BaseTest.setUpTestCluster:578->BaseTest.initMiniCluster:687 ? Runtime
  TenantSpecificTablesDDLIT>BaseTenantSpecificTablesIT.doSetup:79->BaseTest.setUpTestDriver:630->BaseTest.setUpTestDriver:634->BaseTest.checkClusterInitialized:565->BaseTest.setUpTestCluster:578->BaseTest.initMiniCluster:687 ? Runtime
  TenantSpecificTablesDMLIT>BaseTenantSpecificTablesIT.doSetup:79->BaseTest.setUpTestDriver:630->BaseTest.setUpTestDriver:634->BaseTest.checkClusterInitialized:565->BaseTest.setUpTestCluster:578->BaseTest.initMiniCluster:687 ? Runtime
  TransactionalViewIT.doSetup:46->BaseTest.setUpTestDriver:630->BaseTest.setUpTestDriver:634->BaseTest.checkClusterInitialized:565->BaseTest.setUpTestCluster:578->BaseTest.initMiniCluster:687 ? Runtime
  UnionAllIT.doSetup:48->BaseTest.setUpTestDriver:630->BaseTest.setUpTestDriver:634->BaseTest.checkClusterInitialized:565->BaseTest.setUpTestCluster:578->BaseTest.initMiniCluster:687 ? Runtime
  UserDefinedFunctionsIT.doSetup:249 ? IO Shutting down
  ViewIT>BaseViewIT.doSetup:72->BaseTest.setUpTestDriver:630->BaseTest.setUpTestDriver:634->BaseTest.checkClusterInitialized:565->BaseTest.setUpTestCluster:578->BaseTest.initMiniCluster:687 ? Runtime
  ImmutableIndexWithStatsIT.doSetup:52->BaseTest.setUpTestDriver:630->BaseTest.setUpTestDriver:634->BaseTest.checkClusterInitialized:565->BaseTest.setUpTestCluster:578->BaseTest.initMiniCluster:687 ? Runtime
  MutableIndexFailureIT.doSetup:113->BaseTest.setUpTestDriver:634->BaseTest.checkClusterInitialized:565->BaseTest.setUpTestCluster:578->BaseTest.initMiniCluster:687 ? Runtime
  MutableIndexReplicationIT.setUpBeforeClass:108->setupConfigsAndStartCluster:170 ? IO
  ReadOnlyIndexFailureIT.doSetup:116->BaseTest.setUpTestDriver:634->BaseTest.checkClusterInitialized:565->BaseTest.setUpTestCluster:578->BaseTest.initMiniCluster:687 ? Runtime
  TxWriteFailureIT.doSetup:86->BaseTest.setUpTestDriver:634->BaseTest.checkClusterInitialized:565->BaseTest.setUpTestCluster:578->BaseTest.initMiniCluster:687 ? Runtime
  PartialCommitIT.doSetup:94->BaseTest.setUpTestDriver:634->BaseTest.checkClusterInitialized:565->BaseTest.setUpTestCluster:578->BaseTest.initMiniCluster:687 ? Runtime
  FailForUnsupportedHBaseVersionsIT.testDoesNotStartRegionServerForUnsupportedCompressionAndVersion:121 ? IO
  IndexLoadBalancerIT.setupCluster:87 ? IO Shutting down
  EndToEndCoveredColumnsIndexBuilderIT.setupCluster:107 ? IO Shutting down
  EndToEndCoveredIndexingIT.setupCluster:131 ? IO Shutting down
  EndtoEndIndexingWithCompressionIT.setupCluster:42 ? IO Shutting down
  FailWithoutRetriesIT.setupCluster:84 ? IO Shutting down
  RoundRobinResultIteratorWithStatsIT.doSetup:58->BaseTest.setUpTestDriver:630->BaseTest.setUpTestDriver:634->BaseTest.checkClusterInitialized:565->BaseTest.setUpTestCluster:578->BaseTest.initMiniCluster:687 ? Runtime
  ScannerLeaseRenewalIT.setUp:70 ? IO Shutting down
  PhoenixMetricsIT.doSetup:78->BaseTest.setUpTestDriver:630->BaseTest.setUpTestDriver:634->BaseTest.checkClusterInitialized:565->BaseTest.setUpTestCluster:578->BaseTest.initMiniCluster:687 ? Runtime
  PhoenixClientRpcIT.doSetup:47->BaseTest.setUpTestDriver:634->BaseTest.checkClusterInitialized:565->BaseTest.setUpTestCluster:578->BaseTest.initMiniCluster:687 ? Runtime
  PhoenixServerRpcIT.doSetup:72->BaseTest.setUpTestDriver:634->BaseTest.checkClusterInitialized:565->BaseTest.setUpTestCluster:578->BaseTest.initMiniCluster:687 ? Runtime

Tests run: 45, Failures: 0, Errors: 44, Skipped: 0

[INFO] 
[INFO] --- maven-failsafe-plugin:2.19.1:verify (ClientManagedTimeTests) @ phoenix-core ---
[INFO] ------------------------------------------------------------------------
[INFO] Reactor Summary:
[INFO] 
[INFO] Apache Phoenix .................................... SUCCESS [6.763s]
[INFO] Phoenix Core ...................................... FAILURE [2:16:13.985s]
[INFO] Phoenix - Flume ................................... SKIPPED
[INFO] Phoenix - Pig ..................................... SKIPPED
[INFO] Phoenix Query Server Client ....................... SKIPPED
[INFO] Phoenix Query Server .............................. SKIPPED
[INFO] Phoenix - Pherf ................................... SKIPPED
[INFO] Phoenix - Spark ................................... SKIPPED
[INFO] Phoenix - Hive .................................... SKIPPED
[INFO] Phoenix Assembly .................................. SKIPPED
[INFO] Phoenix - Tracing Web Application ................. SKIPPED
[INFO] ------------------------------------------------------------------------
[INFO] BUILD FAILURE
[INFO] ------------------------------------------------------------------------
[INFO] Total time: 2:16:21.460s
[INFO] Finished at: Sun May 01 08:10:19 UTC 2016
[INFO] Final Memory: 52M/977M
[INFO] ------------------------------------------------------------------------
[ERROR] Failed to execute goal org.apache.maven.plugins:maven-failsafe-plugin:2.19.1:verify (ClientManagedTimeTests) on project phoenix-core: There are test failures.
[ERROR] 
[ERROR] Please refer to /x1/jenkins/jenkins-slave/workspace/Phoenix-4.x-HBase-1.1/phoenix-core/target/failsafe-reports for the individual test results.
[ERROR] -> [Help 1]
[ERROR] 
[ERROR] To see the full stack trace of the errors, re-run Maven with the -e switch.
[ERROR] Re-run Maven using the -X switch to enable full debug logging.
[ERROR] 
[ERROR] For more information about the errors and possible solutions, please read the following articles:
[ERROR] [Help 1] http://cwiki.apache.org/confluence/display/MAVEN/MojoFailureException
[ERROR] 
[ERROR] After correcting the problems, you can resume the build with the command
[ERROR]   mvn <goals> -rf :phoenix-core
Build step 'Invoke top-level Maven targets' marked build as failure
Archiving artifacts
No prior successful build to compare, so performing full copy of artifacts
Recording test results

Build failed in Jenkins: Phoenix-4.x-HBase-1.1 #10

Posted by Apache Jenkins Server <je...@builds.apache.org>.
See <https://builds.apache.org/job/Phoenix-4.x-HBase-1.1/10/changes>

Changes:

[jamestaylor] PHOENIX-2871 Workaround sqlline issue

------------------------------------------
[...truncated 2057 lines...]
Caused by: java.lang.RuntimeException: Master not initialized after 200000ms seconds

Running org.apache.phoenix.end2end.index.ImmutableIndexWithStatsIT
Tests run: 1, Failures: 0, Errors: 1, Skipped: 0, Time elapsed: 0.004 sec <<< FAILURE! - in org.apache.phoenix.end2end.index.ImmutableIndexWithStatsIT
org.apache.phoenix.end2end.index.ImmutableIndexWithStatsIT  Time elapsed: 0.004 sec  <<< ERROR!
java.lang.RuntimeException: java.io.IOException: Shutting down
	at org.apache.phoenix.end2end.index.ImmutableIndexWithStatsIT.doSetup(ImmutableIndexWithStatsIT.java:52)
Caused by: java.io.IOException: Shutting down
	at org.apache.phoenix.end2end.index.ImmutableIndexWithStatsIT.doSetup(ImmutableIndexWithStatsIT.java:52)
Caused by: java.lang.RuntimeException: Master not initialized after 200000ms seconds
	at org.apache.phoenix.end2end.index.ImmutableIndexWithStatsIT.doSetup(ImmutableIndexWithStatsIT.java:52)

Running org.apache.phoenix.end2end.index.MutableIndexFailureIT
Running org.apache.phoenix.end2end.index.MutableIndexReplicationIT
Tests run: 1, Failures: 0, Errors: 1, Skipped: 0, Time elapsed: 0.006 sec <<< FAILURE! - in org.apache.phoenix.end2end.index.MutableIndexFailureIT
org.apache.phoenix.end2end.index.MutableIndexFailureIT  Time elapsed: 0.005 sec  <<< ERROR!
java.lang.RuntimeException: java.io.IOException: Shutting down
	at org.apache.phoenix.end2end.index.MutableIndexFailureIT.doSetup(MutableIndexFailureIT.java:113)
Caused by: java.io.IOException: Shutting down
	at org.apache.phoenix.end2end.index.MutableIndexFailureIT.doSetup(MutableIndexFailureIT.java:113)
Caused by: java.lang.RuntimeException: Master not initialized after 200000ms seconds
	at org.apache.phoenix.end2end.index.MutableIndexFailureIT.doSetup(MutableIndexFailureIT.java:113)

Running org.apache.phoenix.hbase.index.FailForUnsupportedHBaseVersionsIT
Tests run: 1, Failures: 0, Errors: 1, Skipped: 0, Time elapsed: 0.007 sec <<< FAILURE! - in org.apache.phoenix.end2end.index.MutableIndexReplicationIT
org.apache.phoenix.end2end.index.MutableIndexReplicationIT  Time elapsed: 0.006 sec  <<< ERROR!
java.io.IOException: Shutting down
	at org.apache.phoenix.end2end.index.MutableIndexReplicationIT.setupConfigsAndStartCluster(MutableIndexReplicationIT.java:170)
	at org.apache.phoenix.end2end.index.MutableIndexReplicationIT.setUpBeforeClass(MutableIndexReplicationIT.java:108)
Caused by: java.lang.RuntimeException: Master not initialized after 200000ms seconds
	at org.apache.phoenix.end2end.index.MutableIndexReplicationIT.setupConfigsAndStartCluster(MutableIndexReplicationIT.java:170)
	at org.apache.phoenix.end2end.index.MutableIndexReplicationIT.setUpBeforeClass(MutableIndexReplicationIT.java:108)

Running org.apache.phoenix.end2end.index.ReadOnlyIndexFailureIT
Tests run: 1, Failures: 0, Errors: 1, Skipped: 0, Time elapsed: 0.007 sec <<< FAILURE! - in org.apache.phoenix.end2end.index.ReadOnlyIndexFailureIT
org.apache.phoenix.end2end.index.ReadOnlyIndexFailureIT  Time elapsed: 0.006 sec  <<< ERROR!
java.lang.RuntimeException: java.io.IOException: Shutting down
	at org.apache.phoenix.end2end.index.ReadOnlyIndexFailureIT.doSetup(ReadOnlyIndexFailureIT.java:116)
Caused by: java.io.IOException: Shutting down
	at org.apache.phoenix.end2end.index.ReadOnlyIndexFailureIT.doSetup(ReadOnlyIndexFailureIT.java:116)
Caused by: java.lang.RuntimeException: Master not initialized after 200000ms seconds
	at org.apache.phoenix.end2end.index.ReadOnlyIndexFailureIT.doSetup(ReadOnlyIndexFailureIT.java:116)

Running org.apache.phoenix.end2end.index.txn.TxWriteFailureIT
Tests run: 1, Failures: 0, Errors: 1, Skipped: 0, Time elapsed: 0.021 sec <<< FAILURE! - in org.apache.phoenix.end2end.index.txn.TxWriteFailureIT
org.apache.phoenix.end2end.index.txn.TxWriteFailureIT  Time elapsed: 0.021 sec  <<< ERROR!
java.lang.RuntimeException: java.io.IOException: Shutting down
	at org.apache.phoenix.end2end.index.txn.TxWriteFailureIT.doSetup(TxWriteFailureIT.java:86)
Caused by: java.io.IOException: Shutting down
	at org.apache.phoenix.end2end.index.txn.TxWriteFailureIT.doSetup(TxWriteFailureIT.java:86)
Caused by: java.lang.RuntimeException: Master not initialized after 200000ms seconds
	at org.apache.phoenix.end2end.index.txn.TxWriteFailureIT.doSetup(TxWriteFailureIT.java:86)

Running org.apache.phoenix.execute.PartialCommitIT
Tests run: 1, Failures: 0, Errors: 1, Skipped: 0, Time elapsed: 0.003 sec <<< FAILURE! - in org.apache.phoenix.execute.PartialCommitIT
org.apache.phoenix.execute.PartialCommitIT  Time elapsed: 0.003 sec  <<< ERROR!
java.lang.RuntimeException: java.io.IOException: Shutting down
	at org.apache.phoenix.execute.PartialCommitIT.doSetup(PartialCommitIT.java:94)
Caused by: java.io.IOException: Shutting down
	at org.apache.phoenix.execute.PartialCommitIT.doSetup(PartialCommitIT.java:94)
Caused by: java.lang.RuntimeException: Master not initialized after 200000ms seconds
	at org.apache.phoenix.execute.PartialCommitIT.doSetup(PartialCommitIT.java:94)

Tests run: 2, Failures: 0, Errors: 1, Skipped: 0, Time elapsed: 207.16 sec <<< FAILURE! - in org.apache.phoenix.hbase.index.FailForUnsupportedHBaseVersionsIT
testDoesNotStartRegionServerForUnsupportedCompressionAndVersion(org.apache.phoenix.hbase.index.FailForUnsupportedHBaseVersionsIT)  Time elapsed: 206.844 sec  <<< ERROR!
java.io.IOException: Shutting down
	at org.apache.phoenix.hbase.index.FailForUnsupportedHBaseVersionsIT.testDoesNotStartRegionServerForUnsupportedCompressionAndVersion(FailForUnsupportedHBaseVersionsIT.java:121)
Caused by: java.lang.RuntimeException: Master not initialized after 200000ms seconds
	at org.apache.phoenix.hbase.index.FailForUnsupportedHBaseVersionsIT.testDoesNotStartRegionServerForUnsupportedCompressionAndVersion(FailForUnsupportedHBaseVersionsIT.java:121)

Running org.apache.phoenix.hbase.index.balancer.IndexLoadBalancerIT
Tests run: 1, Failures: 0, Errors: 1, Skipped: 0, Time elapsed: 0.007 sec <<< FAILURE! - in org.apache.phoenix.hbase.index.balancer.IndexLoadBalancerIT
org.apache.phoenix.hbase.index.balancer.IndexLoadBalancerIT  Time elapsed: 0.005 sec  <<< ERROR!
java.io.IOException: Shutting down
	at org.apache.phoenix.hbase.index.balancer.IndexLoadBalancerIT.setupCluster(IndexLoadBalancerIT.java:87)
Caused by: java.lang.RuntimeException: Master not initialized after 200000ms seconds
	at org.apache.phoenix.hbase.index.balancer.IndexLoadBalancerIT.setupCluster(IndexLoadBalancerIT.java:87)

Running org.apache.phoenix.hbase.index.covered.EndToEndCoveredColumnsIndexBuilderIT
Tests run: 1, Failures: 0, Errors: 1, Skipped: 0, Time elapsed: 0.006 sec <<< FAILURE! - in org.apache.phoenix.hbase.index.covered.EndToEndCoveredColumnsIndexBuilderIT
org.apache.phoenix.hbase.index.covered.EndToEndCoveredColumnsIndexBuilderIT  Time elapsed: 0.005 sec  <<< ERROR!
java.io.IOException: Shutting down
	at org.apache.phoenix.hbase.index.covered.EndToEndCoveredColumnsIndexBuilderIT.setupCluster(EndToEndCoveredColumnsIndexBuilderIT.java:107)
Caused by: java.lang.RuntimeException: Master not initialized after 200000ms seconds
	at org.apache.phoenix.hbase.index.covered.EndToEndCoveredColumnsIndexBuilderIT.setupCluster(EndToEndCoveredColumnsIndexBuilderIT.java:107)

Running org.apache.phoenix.hbase.index.covered.example.EndToEndCoveredIndexingIT
Tests run: 1, Failures: 0, Errors: 1, Skipped: 0, Time elapsed: 0.006 sec <<< FAILURE! - in org.apache.phoenix.hbase.index.covered.example.EndToEndCoveredIndexingIT
org.apache.phoenix.hbase.index.covered.example.EndToEndCoveredIndexingIT  Time elapsed: 0.005 sec  <<< ERROR!
java.io.IOException: Shutting down
	at org.apache.phoenix.hbase.index.covered.example.EndToEndCoveredIndexingIT.setupCluster(EndToEndCoveredIndexingIT.java:131)
Caused by: java.lang.RuntimeException: Master not initialized after 200000ms seconds
	at org.apache.phoenix.hbase.index.covered.example.EndToEndCoveredIndexingIT.setupCluster(EndToEndCoveredIndexingIT.java:131)

Running org.apache.phoenix.hbase.index.covered.example.EndtoEndIndexingWithCompressionIT
Tests run: 1, Failures: 0, Errors: 1, Skipped: 0, Time elapsed: 0.006 sec <<< FAILURE! - in org.apache.phoenix.hbase.index.covered.example.EndtoEndIndexingWithCompressionIT
org.apache.phoenix.hbase.index.covered.example.EndtoEndIndexingWithCompressionIT  Time elapsed: 0.005 sec  <<< ERROR!
java.io.IOException: Shutting down
	at org.apache.phoenix.hbase.index.covered.example.EndtoEndIndexingWithCompressionIT.setupCluster(EndtoEndIndexingWithCompressionIT.java:42)
Caused by: java.lang.RuntimeException: Master not initialized after 200000ms seconds
	at org.apache.phoenix.hbase.index.covered.example.EndtoEndIndexingWithCompressionIT.setupCluster(EndtoEndIndexingWithCompressionIT.java:42)

Running org.apache.phoenix.hbase.index.covered.example.FailWithoutRetriesIT
Tests run: 1, Failures: 0, Errors: 1, Skipped: 0, Time elapsed: 0.006 sec <<< FAILURE! - in org.apache.phoenix.hbase.index.covered.example.FailWithoutRetriesIT
org.apache.phoenix.hbase.index.covered.example.FailWithoutRetriesIT  Time elapsed: 0.005 sec  <<< ERROR!
java.io.IOException: Shutting down
	at org.apache.phoenix.hbase.index.covered.example.FailWithoutRetriesIT.setupCluster(FailWithoutRetriesIT.java:84)
Caused by: java.lang.RuntimeException: Master not initialized after 200000ms seconds
	at org.apache.phoenix.hbase.index.covered.example.FailWithoutRetriesIT.setupCluster(FailWithoutRetriesIT.java:84)

Running org.apache.phoenix.iterate.RoundRobinResultIteratorWithStatsIT
Tests run: 1, Failures: 0, Errors: 1, Skipped: 0, Time elapsed: 0.004 sec <<< FAILURE! - in org.apache.phoenix.iterate.RoundRobinResultIteratorWithStatsIT
org.apache.phoenix.iterate.RoundRobinResultIteratorWithStatsIT  Time elapsed: 0.004 sec  <<< ERROR!
java.lang.RuntimeException: java.io.IOException: Shutting down
	at org.apache.phoenix.iterate.RoundRobinResultIteratorWithStatsIT.doSetup(RoundRobinResultIteratorWithStatsIT.java:58)
Caused by: java.io.IOException: Shutting down
	at org.apache.phoenix.iterate.RoundRobinResultIteratorWithStatsIT.doSetup(RoundRobinResultIteratorWithStatsIT.java:58)
Caused by: java.lang.RuntimeException: Master not initialized after 200000ms seconds
	at org.apache.phoenix.iterate.RoundRobinResultIteratorWithStatsIT.doSetup(RoundRobinResultIteratorWithStatsIT.java:58)

Running org.apache.phoenix.iterate.ScannerLeaseRenewalIT
Tests run: 1, Failures: 0, Errors: 1, Skipped: 0, Time elapsed: 0.006 sec <<< FAILURE! - in org.apache.phoenix.iterate.ScannerLeaseRenewalIT
org.apache.phoenix.iterate.ScannerLeaseRenewalIT  Time elapsed: 0.005 sec  <<< ERROR!
java.io.IOException: Shutting down
	at org.apache.phoenix.iterate.ScannerLeaseRenewalIT.setUp(ScannerLeaseRenewalIT.java:70)
Caused by: java.lang.RuntimeException: Master not initialized after 200000ms seconds
	at org.apache.phoenix.iterate.ScannerLeaseRenewalIT.setUp(ScannerLeaseRenewalIT.java:70)

Running org.apache.phoenix.monitoring.PhoenixMetricsIT
Tests run: 1, Failures: 0, Errors: 1, Skipped: 0, Time elapsed: 0.006 sec <<< FAILURE! - in org.apache.phoenix.monitoring.PhoenixMetricsIT
org.apache.phoenix.monitoring.PhoenixMetricsIT  Time elapsed: 0.006 sec  <<< ERROR!
java.lang.RuntimeException: java.io.IOException: Shutting down
	at org.apache.phoenix.monitoring.PhoenixMetricsIT.doSetup(PhoenixMetricsIT.java:78)
Caused by: java.io.IOException: Shutting down
	at org.apache.phoenix.monitoring.PhoenixMetricsIT.doSetup(PhoenixMetricsIT.java:78)
Caused by: java.lang.RuntimeException: Master not initialized after 200000ms seconds
	at org.apache.phoenix.monitoring.PhoenixMetricsIT.doSetup(PhoenixMetricsIT.java:78)

Running org.apache.phoenix.rpc.PhoenixClientRpcIT
Tests run: 1, Failures: 0, Errors: 1, Skipped: 0, Time elapsed: 0.006 sec <<< FAILURE! - in org.apache.phoenix.rpc.PhoenixClientRpcIT
org.apache.phoenix.rpc.PhoenixClientRpcIT  Time elapsed: 0.005 sec  <<< ERROR!
java.lang.RuntimeException: java.io.IOException: Shutting down
	at org.apache.phoenix.rpc.PhoenixClientRpcIT.doSetup(PhoenixClientRpcIT.java:47)
Caused by: java.io.IOException: Shutting down
	at org.apache.phoenix.rpc.PhoenixClientRpcIT.doSetup(PhoenixClientRpcIT.java:47)
Caused by: java.lang.RuntimeException: Master not initialized after 200000ms seconds
	at org.apache.phoenix.rpc.PhoenixClientRpcIT.doSetup(PhoenixClientRpcIT.java:47)

Running org.apache.phoenix.rpc.PhoenixServerRpcIT
Tests run: 1, Failures: 0, Errors: 1, Skipped: 0, Time elapsed: 0.006 sec <<< FAILURE! - in org.apache.phoenix.rpc.PhoenixServerRpcIT
org.apache.phoenix.rpc.PhoenixServerRpcIT  Time elapsed: 0.005 sec  <<< ERROR!
java.lang.RuntimeException: java.io.IOException: Shutting down
	at org.apache.phoenix.rpc.PhoenixServerRpcIT.doSetup(PhoenixServerRpcIT.java:72)
Caused by: java.io.IOException: Shutting down
	at org.apache.phoenix.rpc.PhoenixServerRpcIT.doSetup(PhoenixServerRpcIT.java:72)
Caused by: java.lang.RuntimeException: Master not initialized after 200000ms seconds
	at org.apache.phoenix.rpc.PhoenixServerRpcIT.doSetup(PhoenixServerRpcIT.java:72)


Results :

Tests in error: 
  WALReplayWithIndexWritesAndCompressedWALIT.setUp:98->setupCluster:109->startCluster:142 ? IO
  WALReplayWithIndexWritesAndUncompressedWALInHBase_094_9_IT>WALReplayWithIndexWritesAndCompressedWALIT.setUp:98->WALReplayWithIndexWritesAndCompressedWALIT.setupCluster:109->WALReplayWithIndexWritesAndCompressedWALIT.startCluster:142 ? IO
  StatisticsCollectionRunTrackerIT.doSetup:56->BaseTest.setUpTestDriver:630->BaseTest.setUpTestDriver:634->BaseTest.checkClusterInitialized:565->BaseTest.setUpTestCluster:578->BaseTest.initMiniCluster:687 ? Runtime
  AlterTableIT.doSetup:90->BaseTest.setUpTestDriver:630->BaseTest.setUpTestDriver:634->BaseTest.checkClusterInitialized:565->BaseTest.setUpTestCluster:578->BaseTest.initMiniCluster:687 ? Runtime
  ConnectionUtilIT.setUp:52 ? IO Shutting down
  ContextClassloaderIT.setUpBeforeClass:61 ? IO Shutting down
  CountDistinctCompressionIT.doSetup:48->BaseTest.setUpTestDriver:630->BaseTest.setUpTestDriver:634->BaseTest.checkClusterInitialized:565->BaseTest.setUpTestCluster:578->BaseTest.initMiniCluster:687 ? Runtime
  CsvBulkLoadToolIT.doSetup:60->BaseTest.setUpRealDriver:652 ? Runtime java.io.I...
  IndexToolIT.doSetup:93->BaseTest.setUpRealDriver:652 ? Runtime java.io.IOExcep...
  KeyOnlyIT.doSetup:57->BaseTest.setUpTestDriver:630->BaseTest.setUpTestDriver:634->BaseTest.checkClusterInitialized:565->BaseTest.setUpTestCluster:578->BaseTest.initMiniCluster:687 ? Runtime
  MultiCfQueryExecIT.doSetup:56->BaseTest.setUpTestDriver:630->BaseTest.setUpTestDriver:634->BaseTest.checkClusterInitialized:565->BaseTest.setUpTestCluster:578->BaseTest.initMiniCluster:687 ? Runtime
  MutableIndexToolIT.doSetup:50->BaseTest.setUpRealDriver:652 ? Runtime java.io....
  ParallelIteratorsIT.doSetup:76->BaseTest.setUpTestDriver:630->BaseTest.setUpTestDriver:634->BaseTest.checkClusterInitialized:565->BaseTest.setUpTestCluster:578->BaseTest.initMiniCluster:687 ? Runtime
  QueryTimeoutIT.doSetup:59->BaseTest.setUpTestDriver:630->BaseTest.setUpTestDriver:634->BaseTest.checkClusterInitialized:565->BaseTest.setUpTestCluster:578->BaseTest.initMiniCluster:687 ? Runtime
  QueryWithLimitIT.doSetup:58->BaseTest.setUpTestDriver:630->BaseTest.setUpTestDriver:634->BaseTest.checkClusterInitialized:565->BaseTest.setUpTestCluster:578->BaseTest.initMiniCluster:687 ? Runtime
  QueryWithOffsetIT.doSetup:70->BaseTest.setUpTestDriver:630->BaseTest.setUpTestDriver:634->BaseTest.checkClusterInitialized:565->BaseTest.setUpTestCluster:578->BaseTest.initMiniCluster:687 ? Runtime
  SaltedViewIT>BaseViewIT.doSetup:72->BaseTest.setUpTestDriver:630->BaseTest.setUpTestDriver:634->BaseTest.checkClusterInitialized:565->BaseTest.setUpTestCluster:578->BaseTest.initMiniCluster:687 ? Runtime
  SpillableGroupByIT.doSetup:72->BaseTest.setUpTestDriver:630->BaseTest.setUpTestDriver:634->BaseTest.checkClusterInitialized:565->BaseTest.setUpTestCluster:578->BaseTest.initMiniCluster:687 ? Runtime
  StatsCollectionDisabledIT.doSetup:54->BaseTest.setUpTestDriver:630->BaseTest.setUpTestDriver:634->BaseTest.checkClusterInitialized:565->BaseTest.setUpTestCluster:578->BaseTest.initMiniCluster:687 ? Runtime
  StatsCollectorIT.doSetup:77->BaseTest.setUpTestDriver:630->BaseTest.setUpTestDriver:634->BaseTest.checkClusterInitialized:565->BaseTest.setUpTestCluster:578->BaseTest.initMiniCluster:687 ? Runtime
  StatsCollectorWithSplitsAndMultiCFIT.doSetup:61->BaseTest.setUpTestDriver:630->BaseTest.setUpTestDriver:634->BaseTest.checkClusterInitialized:565->BaseTest.setUpTestCluster:578->BaseTest.initMiniCluster:687 ? Runtime
  TenantSpecificTablesDDLIT>BaseTenantSpecificTablesIT.doSetup:79->BaseTest.setUpTestDriver:630->BaseTest.setUpTestDriver:634->BaseTest.checkClusterInitialized:565->BaseTest.setUpTestCluster:578->BaseTest.initMiniCluster:687 ? Runtime
  TenantSpecificTablesDMLIT>BaseTenantSpecificTablesIT.doSetup:79->BaseTest.setUpTestDriver:630->BaseTest.setUpTestDriver:634->BaseTest.checkClusterInitialized:565->BaseTest.setUpTestCluster:578->BaseTest.initMiniCluster:687 ? Runtime
  TransactionalViewIT.doSetup:46->BaseTest.setUpTestDriver:630->BaseTest.setUpTestDriver:634->BaseTest.checkClusterInitialized:565->BaseTest.setUpTestCluster:578->BaseTest.initMiniCluster:687 ? Runtime
  UnionAllIT.doSetup:48->BaseTest.setUpTestDriver:630->BaseTest.setUpTestDriver:634->BaseTest.checkClusterInitialized:565->BaseTest.setUpTestCluster:578->BaseTest.initMiniCluster:687 ? Runtime
  UserDefinedFunctionsIT.doSetup:249 ? IO Shutting down
  ViewIT>BaseViewIT.doSetup:72->BaseTest.setUpTestDriver:630->BaseTest.setUpTestDriver:634->BaseTest.checkClusterInitialized:565->BaseTest.setUpTestCluster:578->BaseTest.initMiniCluster:687 ? Runtime
  ImmutableIndexWithStatsIT.doSetup:52->BaseTest.setUpTestDriver:630->BaseTest.setUpTestDriver:634->BaseTest.checkClusterInitialized:565->BaseTest.setUpTestCluster:578->BaseTest.initMiniCluster:687 ? Runtime
  MutableIndexFailureIT.doSetup:113->BaseTest.setUpTestDriver:634->BaseTest.checkClusterInitialized:565->BaseTest.setUpTestCluster:578->BaseTest.initMiniCluster:687 ? Runtime
  MutableIndexReplicationIT.setUpBeforeClass:108->setupConfigsAndStartCluster:170 ? IO
  ReadOnlyIndexFailureIT.doSetup:116->BaseTest.setUpTestDriver:634->BaseTest.checkClusterInitialized:565->BaseTest.setUpTestCluster:578->BaseTest.initMiniCluster:687 ? Runtime
  TxWriteFailureIT.doSetup:86->BaseTest.setUpTestDriver:634->BaseTest.checkClusterInitialized:565->BaseTest.setUpTestCluster:578->BaseTest.initMiniCluster:687 ? Runtime
  PartialCommitIT.doSetup:94->BaseTest.setUpTestDriver:634->BaseTest.checkClusterInitialized:565->BaseTest.setUpTestCluster:578->BaseTest.initMiniCluster:687 ? Runtime
  FailForUnsupportedHBaseVersionsIT.testDoesNotStartRegionServerForUnsupportedCompressionAndVersion:121 ? IO
  IndexLoadBalancerIT.setupCluster:87 ? IO Shutting down
  EndToEndCoveredColumnsIndexBuilderIT.setupCluster:107 ? IO Shutting down
  EndToEndCoveredIndexingIT.setupCluster:131 ? IO Shutting down
  EndtoEndIndexingWithCompressionIT.setupCluster:42 ? IO Shutting down
  FailWithoutRetriesIT.setupCluster:84 ? IO Shutting down
  RoundRobinResultIteratorWithStatsIT.doSetup:58->BaseTest.setUpTestDriver:630->BaseTest.setUpTestDriver:634->BaseTest.checkClusterInitialized:565->BaseTest.setUpTestCluster:578->BaseTest.initMiniCluster:687 ? Runtime
  ScannerLeaseRenewalIT.setUp:70 ? IO Shutting down
  PhoenixMetricsIT.doSetup:78->BaseTest.setUpTestDriver:630->BaseTest.setUpTestDriver:634->BaseTest.checkClusterInitialized:565->BaseTest.setUpTestCluster:578->BaseTest.initMiniCluster:687 ? Runtime
  PhoenixClientRpcIT.doSetup:47->BaseTest.setUpTestDriver:634->BaseTest.checkClusterInitialized:565->BaseTest.setUpTestCluster:578->BaseTest.initMiniCluster:687 ? Runtime
  PhoenixServerRpcIT.doSetup:72->BaseTest.setUpTestDriver:634->BaseTest.checkClusterInitialized:565->BaseTest.setUpTestCluster:578->BaseTest.initMiniCluster:687 ? Runtime

Tests run: 45, Failures: 0, Errors: 44, Skipped: 0

[INFO] 
[INFO] --- maven-failsafe-plugin:2.19.1:verify (ClientManagedTimeTests) @ phoenix-core ---
[INFO] ------------------------------------------------------------------------
[INFO] Reactor Summary:
[INFO] 
[INFO] Apache Phoenix .................................... SUCCESS [7.355s]
[INFO] Phoenix Core ...................................... FAILURE [2:19:37.125s]
[INFO] Phoenix - Flume ................................... SKIPPED
[INFO] Phoenix - Pig ..................................... SKIPPED
[INFO] Phoenix Query Server Client ....................... SKIPPED
[INFO] Phoenix Query Server .............................. SKIPPED
[INFO] Phoenix - Pherf ................................... SKIPPED
[INFO] Phoenix - Spark ................................... SKIPPED
[INFO] Phoenix - Hive .................................... SKIPPED
[INFO] Phoenix Assembly .................................. SKIPPED
[INFO] Phoenix - Tracing Web Application ................. SKIPPED
[INFO] ------------------------------------------------------------------------
[INFO] BUILD FAILURE
[INFO] ------------------------------------------------------------------------
[INFO] Total time: 2:19:45.084s
[INFO] Finished at: Sun May 01 00:34:47 UTC 2016
[INFO] Final Memory: 52M/983M
[INFO] ------------------------------------------------------------------------
[ERROR] Failed to execute goal org.apache.maven.plugins:maven-failsafe-plugin:2.19.1:verify (ClientManagedTimeTests) on project phoenix-core: There are test failures.
[ERROR] 
[ERROR] Please refer to /x1/jenkins/jenkins-slave/workspace/Phoenix-4.x-HBase-1.1/phoenix-core/target/failsafe-reports for the individual test results.
[ERROR] -> [Help 1]
[ERROR] 
[ERROR] To see the full stack trace of the errors, re-run Maven with the -e switch.
[ERROR] Re-run Maven using the -X switch to enable full debug logging.
[ERROR] 
[ERROR] For more information about the errors and possible solutions, please read the following articles:
[ERROR] [Help 1] http://cwiki.apache.org/confluence/display/MAVEN/MojoFailureException
[ERROR] 
[ERROR] After correcting the problems, you can resume the build with the command
[ERROR]   mvn <goals> -rf :phoenix-core
Build step 'Invoke top-level Maven targets' marked build as failure
Archiving artifacts
No prior successful build to compare, so performing full copy of artifacts
Recording test results

Build failed in Jenkins: Phoenix-4.x-HBase-1.1 #9

Posted by Apache Jenkins Server <je...@builds.apache.org>.
See <https://builds.apache.org/job/Phoenix-4.x-HBase-1.1/9/changes>

Changes:

[jamestaylor] PHOENIX-2840 Fix flapping MemoryManagerTest.testWaitForMemoryAvailable

------------------------------------------
[...truncated 2057 lines...]
Caused by: java.lang.RuntimeException: Master not initialized after 200000ms seconds

Running org.apache.phoenix.end2end.index.ImmutableIndexWithStatsIT
Tests run: 1, Failures: 0, Errors: 1, Skipped: 0, Time elapsed: 0.009 sec <<< FAILURE! - in org.apache.phoenix.end2end.index.ImmutableIndexWithStatsIT
org.apache.phoenix.end2end.index.ImmutableIndexWithStatsIT  Time elapsed: 0.008 sec  <<< ERROR!
java.lang.RuntimeException: java.io.IOException: Shutting down
	at org.apache.phoenix.end2end.index.ImmutableIndexWithStatsIT.doSetup(ImmutableIndexWithStatsIT.java:52)
Caused by: java.io.IOException: Shutting down
	at org.apache.phoenix.end2end.index.ImmutableIndexWithStatsIT.doSetup(ImmutableIndexWithStatsIT.java:52)
Caused by: java.lang.RuntimeException: Master not initialized after 200000ms seconds
	at org.apache.phoenix.end2end.index.ImmutableIndexWithStatsIT.doSetup(ImmutableIndexWithStatsIT.java:52)

Running org.apache.phoenix.end2end.index.MutableIndexFailureIT
Running org.apache.phoenix.end2end.index.MutableIndexReplicationIT
Tests run: 1, Failures: 0, Errors: 1, Skipped: 0, Time elapsed: 0.007 sec <<< FAILURE! - in org.apache.phoenix.end2end.index.MutableIndexFailureIT
org.apache.phoenix.end2end.index.MutableIndexFailureIT  Time elapsed: 0.006 sec  <<< ERROR!
java.lang.RuntimeException: java.io.IOException: Shutting down
	at org.apache.phoenix.end2end.index.MutableIndexFailureIT.doSetup(MutableIndexFailureIT.java:113)
Caused by: java.io.IOException: Shutting down
	at org.apache.phoenix.end2end.index.MutableIndexFailureIT.doSetup(MutableIndexFailureIT.java:113)
Caused by: java.lang.RuntimeException: Master not initialized after 200000ms seconds
	at org.apache.phoenix.end2end.index.MutableIndexFailureIT.doSetup(MutableIndexFailureIT.java:113)

Tests run: 1, Failures: 0, Errors: 1, Skipped: 0, Time elapsed: 0.033 sec <<< FAILURE! - in org.apache.phoenix.end2end.index.MutableIndexReplicationIT
org.apache.phoenix.end2end.index.MutableIndexReplicationIT  Time elapsed: 0.03 sec  <<< ERROR!
java.io.IOException: Shutting down
	at org.apache.phoenix.end2end.index.MutableIndexReplicationIT.setupConfigsAndStartCluster(MutableIndexReplicationIT.java:170)
	at org.apache.phoenix.end2end.index.MutableIndexReplicationIT.setUpBeforeClass(MutableIndexReplicationIT.java:108)
Caused by: java.lang.RuntimeException: Master not initialized after 200000ms seconds
	at org.apache.phoenix.end2end.index.MutableIndexReplicationIT.setupConfigsAndStartCluster(MutableIndexReplicationIT.java:170)
	at org.apache.phoenix.end2end.index.MutableIndexReplicationIT.setUpBeforeClass(MutableIndexReplicationIT.java:108)

Running org.apache.phoenix.hbase.index.FailForUnsupportedHBaseVersionsIT
Running org.apache.phoenix.end2end.index.ReadOnlyIndexFailureIT
Tests run: 1, Failures: 0, Errors: 1, Skipped: 0, Time elapsed: 0.005 sec <<< FAILURE! - in org.apache.phoenix.end2end.index.ReadOnlyIndexFailureIT
org.apache.phoenix.end2end.index.ReadOnlyIndexFailureIT  Time elapsed: 0.004 sec  <<< ERROR!
java.lang.RuntimeException: java.io.IOException: Shutting down
	at org.apache.phoenix.end2end.index.ReadOnlyIndexFailureIT.doSetup(ReadOnlyIndexFailureIT.java:116)
Caused by: java.io.IOException: Shutting down
	at org.apache.phoenix.end2end.index.ReadOnlyIndexFailureIT.doSetup(ReadOnlyIndexFailureIT.java:116)
Caused by: java.lang.RuntimeException: Master not initialized after 200000ms seconds
	at org.apache.phoenix.end2end.index.ReadOnlyIndexFailureIT.doSetup(ReadOnlyIndexFailureIT.java:116)

Running org.apache.phoenix.end2end.index.txn.TxWriteFailureIT
Tests run: 1, Failures: 0, Errors: 1, Skipped: 0, Time elapsed: 0.039 sec <<< FAILURE! - in org.apache.phoenix.end2end.index.txn.TxWriteFailureIT
org.apache.phoenix.end2end.index.txn.TxWriteFailureIT  Time elapsed: 0.036 sec  <<< ERROR!
java.lang.RuntimeException: java.io.IOException: Shutting down
	at org.apache.phoenix.end2end.index.txn.TxWriteFailureIT.doSetup(TxWriteFailureIT.java:86)
Caused by: java.io.IOException: Shutting down
	at org.apache.phoenix.end2end.index.txn.TxWriteFailureIT.doSetup(TxWriteFailureIT.java:86)
Caused by: java.lang.RuntimeException: Master not initialized after 200000ms seconds
	at org.apache.phoenix.end2end.index.txn.TxWriteFailureIT.doSetup(TxWriteFailureIT.java:86)

Running org.apache.phoenix.execute.PartialCommitIT
Tests run: 1, Failures: 0, Errors: 1, Skipped: 0, Time elapsed: 0.008 sec <<< FAILURE! - in org.apache.phoenix.execute.PartialCommitIT
org.apache.phoenix.execute.PartialCommitIT  Time elapsed: 0.007 sec  <<< ERROR!
java.lang.RuntimeException: java.io.IOException: Shutting down
	at org.apache.phoenix.execute.PartialCommitIT.doSetup(PartialCommitIT.java:94)
Caused by: java.io.IOException: Shutting down
	at org.apache.phoenix.execute.PartialCommitIT.doSetup(PartialCommitIT.java:94)
Caused by: java.lang.RuntimeException: Master not initialized after 200000ms seconds
	at org.apache.phoenix.execute.PartialCommitIT.doSetup(PartialCommitIT.java:94)

Tests run: 2, Failures: 0, Errors: 1, Skipped: 0, Time elapsed: 211.768 sec <<< FAILURE! - in org.apache.phoenix.hbase.index.FailForUnsupportedHBaseVersionsIT
testDoesNotStartRegionServerForUnsupportedCompressionAndVersion(org.apache.phoenix.hbase.index.FailForUnsupportedHBaseVersionsIT)  Time elapsed: 211.005 sec  <<< ERROR!
java.io.IOException: Shutting down
	at org.apache.phoenix.hbase.index.FailForUnsupportedHBaseVersionsIT.testDoesNotStartRegionServerForUnsupportedCompressionAndVersion(FailForUnsupportedHBaseVersionsIT.java:121)
Caused by: java.lang.RuntimeException: Master not initialized after 200000ms seconds
	at org.apache.phoenix.hbase.index.FailForUnsupportedHBaseVersionsIT.testDoesNotStartRegionServerForUnsupportedCompressionAndVersion(FailForUnsupportedHBaseVersionsIT.java:121)

Running org.apache.phoenix.hbase.index.balancer.IndexLoadBalancerIT
Tests run: 1, Failures: 0, Errors: 1, Skipped: 0, Time elapsed: 0.028 sec <<< FAILURE! - in org.apache.phoenix.hbase.index.balancer.IndexLoadBalancerIT
org.apache.phoenix.hbase.index.balancer.IndexLoadBalancerIT  Time elapsed: 0.024 sec  <<< ERROR!
java.io.IOException: Shutting down
	at org.apache.phoenix.hbase.index.balancer.IndexLoadBalancerIT.setupCluster(IndexLoadBalancerIT.java:87)
Caused by: java.lang.RuntimeException: Master not initialized after 200000ms seconds
	at org.apache.phoenix.hbase.index.balancer.IndexLoadBalancerIT.setupCluster(IndexLoadBalancerIT.java:87)

Running org.apache.phoenix.hbase.index.covered.EndToEndCoveredColumnsIndexBuilderIT
Tests run: 1, Failures: 0, Errors: 1, Skipped: 0, Time elapsed: 0.005 sec <<< FAILURE! - in org.apache.phoenix.hbase.index.covered.EndToEndCoveredColumnsIndexBuilderIT
org.apache.phoenix.hbase.index.covered.EndToEndCoveredColumnsIndexBuilderIT  Time elapsed: 0.004 sec  <<< ERROR!
java.io.IOException: Shutting down
	at org.apache.phoenix.hbase.index.covered.EndToEndCoveredColumnsIndexBuilderIT.setupCluster(EndToEndCoveredColumnsIndexBuilderIT.java:107)
Caused by: java.lang.RuntimeException: Master not initialized after 200000ms seconds
	at org.apache.phoenix.hbase.index.covered.EndToEndCoveredColumnsIndexBuilderIT.setupCluster(EndToEndCoveredColumnsIndexBuilderIT.java:107)

Running org.apache.phoenix.hbase.index.covered.example.EndToEndCoveredIndexingIT
Tests run: 1, Failures: 0, Errors: 1, Skipped: 0, Time elapsed: 0.011 sec <<< FAILURE! - in org.apache.phoenix.hbase.index.covered.example.EndToEndCoveredIndexingIT
org.apache.phoenix.hbase.index.covered.example.EndToEndCoveredIndexingIT  Time elapsed: 0.01 sec  <<< ERROR!
java.io.IOException: Shutting down
	at org.apache.phoenix.hbase.index.covered.example.EndToEndCoveredIndexingIT.setupCluster(EndToEndCoveredIndexingIT.java:131)
Caused by: java.lang.RuntimeException: Master not initialized after 200000ms seconds
	at org.apache.phoenix.hbase.index.covered.example.EndToEndCoveredIndexingIT.setupCluster(EndToEndCoveredIndexingIT.java:131)

Running org.apache.phoenix.hbase.index.covered.example.EndtoEndIndexingWithCompressionIT
Tests run: 1, Failures: 0, Errors: 1, Skipped: 0, Time elapsed: 0.014 sec <<< FAILURE! - in org.apache.phoenix.hbase.index.covered.example.EndtoEndIndexingWithCompressionIT
org.apache.phoenix.hbase.index.covered.example.EndtoEndIndexingWithCompressionIT  Time elapsed: 0.013 sec  <<< ERROR!
java.io.IOException: Shutting down
	at org.apache.phoenix.hbase.index.covered.example.EndtoEndIndexingWithCompressionIT.setupCluster(EndtoEndIndexingWithCompressionIT.java:42)
Caused by: java.lang.RuntimeException: Master not initialized after 200000ms seconds
	at org.apache.phoenix.hbase.index.covered.example.EndtoEndIndexingWithCompressionIT.setupCluster(EndtoEndIndexingWithCompressionIT.java:42)

Running org.apache.phoenix.hbase.index.covered.example.FailWithoutRetriesIT
Tests run: 1, Failures: 0, Errors: 1, Skipped: 0, Time elapsed: 0.008 sec <<< FAILURE! - in org.apache.phoenix.hbase.index.covered.example.FailWithoutRetriesIT
org.apache.phoenix.hbase.index.covered.example.FailWithoutRetriesIT  Time elapsed: 0.007 sec  <<< ERROR!
java.io.IOException: Shutting down
	at org.apache.phoenix.hbase.index.covered.example.FailWithoutRetriesIT.setupCluster(FailWithoutRetriesIT.java:84)
Caused by: java.lang.RuntimeException: Master not initialized after 200000ms seconds
	at org.apache.phoenix.hbase.index.covered.example.FailWithoutRetriesIT.setupCluster(FailWithoutRetriesIT.java:84)

Running org.apache.phoenix.iterate.RoundRobinResultIteratorWithStatsIT
Tests run: 1, Failures: 0, Errors: 1, Skipped: 0, Time elapsed: 0.008 sec <<< FAILURE! - in org.apache.phoenix.iterate.RoundRobinResultIteratorWithStatsIT
org.apache.phoenix.iterate.RoundRobinResultIteratorWithStatsIT  Time elapsed: 0.007 sec  <<< ERROR!
java.lang.RuntimeException: java.io.IOException: Shutting down
	at org.apache.phoenix.iterate.RoundRobinResultIteratorWithStatsIT.doSetup(RoundRobinResultIteratorWithStatsIT.java:58)
Caused by: java.io.IOException: Shutting down
	at org.apache.phoenix.iterate.RoundRobinResultIteratorWithStatsIT.doSetup(RoundRobinResultIteratorWithStatsIT.java:58)
Caused by: java.lang.RuntimeException: Master not initialized after 200000ms seconds
	at org.apache.phoenix.iterate.RoundRobinResultIteratorWithStatsIT.doSetup(RoundRobinResultIteratorWithStatsIT.java:58)

Running org.apache.phoenix.iterate.ScannerLeaseRenewalIT
Tests run: 1, Failures: 0, Errors: 1, Skipped: 0, Time elapsed: 0.006 sec <<< FAILURE! - in org.apache.phoenix.iterate.ScannerLeaseRenewalIT
org.apache.phoenix.iterate.ScannerLeaseRenewalIT  Time elapsed: 0.005 sec  <<< ERROR!
java.io.IOException: Shutting down
	at org.apache.phoenix.iterate.ScannerLeaseRenewalIT.setUp(ScannerLeaseRenewalIT.java:70)
Caused by: java.lang.RuntimeException: Master not initialized after 200000ms seconds
	at org.apache.phoenix.iterate.ScannerLeaseRenewalIT.setUp(ScannerLeaseRenewalIT.java:70)

Running org.apache.phoenix.monitoring.PhoenixMetricsIT
Tests run: 1, Failures: 0, Errors: 1, Skipped: 0, Time elapsed: 0.009 sec <<< FAILURE! - in org.apache.phoenix.monitoring.PhoenixMetricsIT
org.apache.phoenix.monitoring.PhoenixMetricsIT  Time elapsed: 0.007 sec  <<< ERROR!
java.lang.RuntimeException: java.io.IOException: Shutting down
	at org.apache.phoenix.monitoring.PhoenixMetricsIT.doSetup(PhoenixMetricsIT.java:78)
Caused by: java.io.IOException: Shutting down
	at org.apache.phoenix.monitoring.PhoenixMetricsIT.doSetup(PhoenixMetricsIT.java:78)
Caused by: java.lang.RuntimeException: Master not initialized after 200000ms seconds
	at org.apache.phoenix.monitoring.PhoenixMetricsIT.doSetup(PhoenixMetricsIT.java:78)

Running org.apache.phoenix.rpc.PhoenixClientRpcIT
Tests run: 1, Failures: 0, Errors: 1, Skipped: 0, Time elapsed: 0.005 sec <<< FAILURE! - in org.apache.phoenix.rpc.PhoenixClientRpcIT
org.apache.phoenix.rpc.PhoenixClientRpcIT  Time elapsed: 0.004 sec  <<< ERROR!
java.lang.RuntimeException: java.io.IOException: Shutting down
	at org.apache.phoenix.rpc.PhoenixClientRpcIT.doSetup(PhoenixClientRpcIT.java:47)
Caused by: java.io.IOException: Shutting down
	at org.apache.phoenix.rpc.PhoenixClientRpcIT.doSetup(PhoenixClientRpcIT.java:47)
Caused by: java.lang.RuntimeException: Master not initialized after 200000ms seconds
	at org.apache.phoenix.rpc.PhoenixClientRpcIT.doSetup(PhoenixClientRpcIT.java:47)

Running org.apache.phoenix.rpc.PhoenixServerRpcIT
Tests run: 1, Failures: 0, Errors: 1, Skipped: 0, Time elapsed: 0.005 sec <<< FAILURE! - in org.apache.phoenix.rpc.PhoenixServerRpcIT
org.apache.phoenix.rpc.PhoenixServerRpcIT  Time elapsed: 0.005 sec  <<< ERROR!
java.lang.RuntimeException: java.io.IOException: Shutting down
	at org.apache.phoenix.rpc.PhoenixServerRpcIT.doSetup(PhoenixServerRpcIT.java:72)
Caused by: java.io.IOException: Shutting down
	at org.apache.phoenix.rpc.PhoenixServerRpcIT.doSetup(PhoenixServerRpcIT.java:72)
Caused by: java.lang.RuntimeException: Master not initialized after 200000ms seconds
	at org.apache.phoenix.rpc.PhoenixServerRpcIT.doSetup(PhoenixServerRpcIT.java:72)


Results :

Tests in error: 
  WALReplayWithIndexWritesAndCompressedWALIT.setUp:98->setupCluster:109->startCluster:142 » IO
  WALReplayWithIndexWritesAndUncompressedWALInHBase_094_9_IT>WALReplayWithIndexWritesAndCompressedWALIT.setUp:98->WALReplayWithIndexWritesAndCompressedWALIT.setupCluster:109->WALReplayWithIndexWritesAndCompressedWALIT.startCluster:142 » IO
  StatisticsCollectionRunTrackerIT.doSetup:56->BaseTest.setUpTestDriver:630->BaseTest.setUpTestDriver:634->BaseTest.checkClusterInitialized:565->BaseTest.setUpTestCluster:578->BaseTest.initMiniCluster:687 » Runtime
  AlterTableIT.doSetup:90->BaseTest.setUpTestDriver:630->BaseTest.setUpTestDriver:634->BaseTest.checkClusterInitialized:565->BaseTest.setUpTestCluster:578->BaseTest.initMiniCluster:687 » Runtime
  ConnectionUtilIT.setUp:52 » IO Shutting down
  ContextClassloaderIT.setUpBeforeClass:61 » IO Shutting down
  CountDistinctCompressionIT.doSetup:48->BaseTest.setUpTestDriver:630->BaseTest.setUpTestDriver:634->BaseTest.checkClusterInitialized:565->BaseTest.setUpTestCluster:578->BaseTest.initMiniCluster:687 » Runtime
  CsvBulkLoadToolIT.doSetup:60->BaseTest.setUpRealDriver:652 » Runtime java.io.I...
  IndexToolIT.doSetup:93->BaseTest.setUpRealDriver:652 » Runtime java.io.IOExcep...
  KeyOnlyIT.doSetup:57->BaseTest.setUpTestDriver:630->BaseTest.setUpTestDriver:634->BaseTest.checkClusterInitialized:565->BaseTest.setUpTestCluster:578->BaseTest.initMiniCluster:687 » Runtime
  MultiCfQueryExecIT.doSetup:56->BaseTest.setUpTestDriver:630->BaseTest.setUpTestDriver:634->BaseTest.checkClusterInitialized:565->BaseTest.setUpTestCluster:578->BaseTest.initMiniCluster:687 » Runtime
  MutableIndexToolIT.doSetup:50->BaseTest.setUpRealDriver:652 » Runtime java.io....
  ParallelIteratorsIT.doSetup:76->BaseTest.setUpTestDriver:630->BaseTest.setUpTestDriver:634->BaseTest.checkClusterInitialized:565->BaseTest.setUpTestCluster:578->BaseTest.initMiniCluster:687 » Runtime
  QueryTimeoutIT.doSetup:59->BaseTest.setUpTestDriver:630->BaseTest.setUpTestDriver:634->BaseTest.checkClusterInitialized:565->BaseTest.setUpTestCluster:578->BaseTest.initMiniCluster:687 » Runtime
  QueryWithLimitIT.doSetup:58->BaseTest.setUpTestDriver:630->BaseTest.setUpTestDriver:634->BaseTest.checkClusterInitialized:565->BaseTest.setUpTestCluster:578->BaseTest.initMiniCluster:687 » Runtime
  QueryWithOffsetIT.doSetup:70->BaseTest.setUpTestDriver:630->BaseTest.setUpTestDriver:634->BaseTest.checkClusterInitialized:565->BaseTest.setUpTestCluster:578->BaseTest.initMiniCluster:687 » Runtime
  SaltedViewIT>BaseViewIT.doSetup:72->BaseTest.setUpTestDriver:630->BaseTest.setUpTestDriver:634->BaseTest.checkClusterInitialized:565->BaseTest.setUpTestCluster:578->BaseTest.initMiniCluster:687 » Runtime
  SpillableGroupByIT.doSetup:72->BaseTest.setUpTestDriver:630->BaseTest.setUpTestDriver:634->BaseTest.checkClusterInitialized:565->BaseTest.setUpTestCluster:578->BaseTest.initMiniCluster:687 » Runtime
  StatsCollectionDisabledIT.doSetup:54->BaseTest.setUpTestDriver:630->BaseTest.setUpTestDriver:634->BaseTest.checkClusterInitialized:565->BaseTest.setUpTestCluster:578->BaseTest.initMiniCluster:687 » Runtime
  StatsCollectorIT.doSetup:77->BaseTest.setUpTestDriver:630->BaseTest.setUpTestDriver:634->BaseTest.checkClusterInitialized:565->BaseTest.setUpTestCluster:578->BaseTest.initMiniCluster:687 » Runtime
  StatsCollectorWithSplitsAndMultiCFIT.doSetup:61->BaseTest.setUpTestDriver:630->BaseTest.setUpTestDriver:634->BaseTest.checkClusterInitialized:565->BaseTest.setUpTestCluster:578->BaseTest.initMiniCluster:687 » Runtime
  TenantSpecificTablesDDLIT>BaseTenantSpecificTablesIT.doSetup:79->BaseTest.setUpTestDriver:630->BaseTest.setUpTestDriver:634->BaseTest.checkClusterInitialized:565->BaseTest.setUpTestCluster:578->BaseTest.initMiniCluster:687 » Runtime
  TenantSpecificTablesDMLIT>BaseTenantSpecificTablesIT.doSetup:79->BaseTest.setUpTestDriver:630->BaseTest.setUpTestDriver:634->BaseTest.checkClusterInitialized:565->BaseTest.setUpTestCluster:578->BaseTest.initMiniCluster:687 » Runtime
  TransactionalViewIT.doSetup:46->BaseTest.setUpTestDriver:630->BaseTest.setUpTestDriver:634->BaseTest.checkClusterInitialized:565->BaseTest.setUpTestCluster:578->BaseTest.initMiniCluster:687 » Runtime
  UnionAllIT.doSetup:48->BaseTest.setUpTestDriver:630->BaseTest.setUpTestDriver:634->BaseTest.checkClusterInitialized:565->BaseTest.setUpTestCluster:578->BaseTest.initMiniCluster:687 » Runtime
  UserDefinedFunctionsIT.doSetup:249 » IO Shutting down
  ViewIT>BaseViewIT.doSetup:72->BaseTest.setUpTestDriver:630->BaseTest.setUpTestDriver:634->BaseTest.checkClusterInitialized:565->BaseTest.setUpTestCluster:578->BaseTest.initMiniCluster:687 » Runtime
  ImmutableIndexWithStatsIT.doSetup:52->BaseTest.setUpTestDriver:630->BaseTest.setUpTestDriver:634->BaseTest.checkClusterInitialized:565->BaseTest.setUpTestCluster:578->BaseTest.initMiniCluster:687 » Runtime
  MutableIndexFailureIT.doSetup:113->BaseTest.setUpTestDriver:634->BaseTest.checkClusterInitialized:565->BaseTest.setUpTestCluster:578->BaseTest.initMiniCluster:687 » Runtime
  MutableIndexReplicationIT.setUpBeforeClass:108->setupConfigsAndStartCluster:170 » IO
  ReadOnlyIndexFailureIT.doSetup:116->BaseTest.setUpTestDriver:634->BaseTest.checkClusterInitialized:565->BaseTest.setUpTestCluster:578->BaseTest.initMiniCluster:687 » Runtime
  TxWriteFailureIT.doSetup:86->BaseTest.setUpTestDriver:634->BaseTest.checkClusterInitialized:565->BaseTest.setUpTestCluster:578->BaseTest.initMiniCluster:687 » Runtime
  PartialCommitIT.doSetup:94->BaseTest.setUpTestDriver:634->BaseTest.checkClusterInitialized:565->BaseTest.setUpTestCluster:578->BaseTest.initMiniCluster:687 » Runtime
  FailForUnsupportedHBaseVersionsIT.testDoesNotStartRegionServerForUnsupportedCompressionAndVersion:121 » IO
  IndexLoadBalancerIT.setupCluster:87 » IO Shutting down
  EndToEndCoveredColumnsIndexBuilderIT.setupCluster:107 » IO Shutting down
  EndToEndCoveredIndexingIT.setupCluster:131 » IO Shutting down
  EndtoEndIndexingWithCompressionIT.setupCluster:42 » IO Shutting down
  FailWithoutRetriesIT.setupCluster:84 » IO Shutting down
  RoundRobinResultIteratorWithStatsIT.doSetup:58->BaseTest.setUpTestDriver:630->BaseTest.setUpTestDriver:634->BaseTest.checkClusterInitialized:565->BaseTest.setUpTestCluster:578->BaseTest.initMiniCluster:687 » Runtime
  ScannerLeaseRenewalIT.setUp:70 » IO Shutting down
  PhoenixMetricsIT.doSetup:78->BaseTest.setUpTestDriver:630->BaseTest.setUpTestDriver:634->BaseTest.checkClusterInitialized:565->BaseTest.setUpTestCluster:578->BaseTest.initMiniCluster:687 » Runtime
  PhoenixClientRpcIT.doSetup:47->BaseTest.setUpTestDriver:634->BaseTest.checkClusterInitialized:565->BaseTest.setUpTestCluster:578->BaseTest.initMiniCluster:687 » Runtime
  PhoenixServerRpcIT.doSetup:72->BaseTest.setUpTestDriver:634->BaseTest.checkClusterInitialized:565->BaseTest.setUpTestCluster:578->BaseTest.initMiniCluster:687 » Runtime

Tests run: 45, Failures: 0, Errors: 44, Skipped: 0

[INFO] 
[INFO] --- maven-failsafe-plugin:2.19.1:verify (ClientManagedTimeTests) @ phoenix-core ---
[INFO] ------------------------------------------------------------------------
[INFO] Reactor Summary:
[INFO] 
[INFO] Apache Phoenix .................................... SUCCESS [4.773s]
[INFO] Phoenix Core ...................................... FAILURE [2:21:22.300s]
[INFO] Phoenix - Flume ................................... SKIPPED
[INFO] Phoenix - Pig ..................................... SKIPPED
[INFO] Phoenix Query Server Client ....................... SKIPPED
[INFO] Phoenix Query Server .............................. SKIPPED
[INFO] Phoenix - Pherf ................................... SKIPPED
[INFO] Phoenix - Spark ................................... SKIPPED
[INFO] Phoenix - Hive .................................... SKIPPED
[INFO] Phoenix Assembly .................................. SKIPPED
[INFO] Phoenix - Tracing Web Application ................. SKIPPED
[INFO] ------------------------------------------------------------------------
[INFO] BUILD FAILURE
[INFO] ------------------------------------------------------------------------
[INFO] Total time: 2:21:28.105s
[INFO] Finished at: Sat Apr 30 04:30:27 UTC 2016
[INFO] Final Memory: 54M/1080M
[INFO] ------------------------------------------------------------------------
[ERROR] Failed to execute goal org.apache.maven.plugins:maven-failsafe-plugin:2.19.1:verify (ClientManagedTimeTests) on project phoenix-core: There are test failures.
[ERROR] 
[ERROR] Please refer to <https://builds.apache.org/job/Phoenix-4.x-HBase-1.1/ws/phoenix-core/target/failsafe-reports> for the individual test results.
[ERROR] -> [Help 1]
[ERROR] 
[ERROR] To see the full stack trace of the errors, re-run Maven with the -e switch.
[ERROR] Re-run Maven using the -X switch to enable full debug logging.
[ERROR] 
[ERROR] For more information about the errors and possible solutions, please read the following articles:
[ERROR] [Help 1] http://cwiki.apache.org/confluence/display/MAVEN/MojoFailureException
[ERROR] 
[ERROR] After correcting the problems, you can resume the build with the command
[ERROR]   mvn <goals> -rf :phoenix-core
Build step 'Invoke top-level Maven targets' marked build as failure
Archiving artifacts
No prior successful build to compare, so performing full copy of artifacts
Recording test results

Build failed in Jenkins: Phoenix-4.x-HBase-1.1 #8

Posted by Apache Jenkins Server <je...@builds.apache.org>.
See <https://builds.apache.org/job/Phoenix-4.x-HBase-1.1/8/changes>

Changes:

[tdsilva] PHOENIX-2852 Dropping columns could trigger upgrade code on server side

[tdsilva] PHOENIX-2795 Support auto partition for views

------------------------------------------
[...truncated 237 lines...]
Tests run: 2, Failures: 0, Errors: 0, Skipped: 0, Time elapsed: 0.055 sec - in org.apache.phoenix.mapreduce.CsvToKeyValueMapperTest
Running org.apache.phoenix.mapreduce.bulkload.TestTableRowkeyPair
Tests run: 1, Failures: 0, Errors: 0, Skipped: 0, Time elapsed: 0.011 sec - in org.apache.phoenix.mapreduce.bulkload.TestTableRowkeyPair
Running org.apache.phoenix.mapreduce.FormatToBytesWritableMapperTest
Tests run: 5, Failures: 0, Errors: 0, Skipped: 0, Time elapsed: 0.433 sec - in org.apache.phoenix.mapreduce.CsvBulkImportUtilTest
Running org.apache.phoenix.mapreduce.util.ColumnInfoToStringEncoderDecoderTest
Tests run: 5, Failures: 0, Errors: 0, Skipped: 0, Time elapsed: 0.215 sec - in org.apache.phoenix.mapreduce.FormatToBytesWritableMapperTest
Running org.apache.phoenix.mapreduce.util.PhoenixConfigurationUtilTest
Tests run: 2, Failures: 0, Errors: 0, Skipped: 0, Time elapsed: 0.285 sec - in org.apache.phoenix.mapreduce.util.ColumnInfoToStringEncoderDecoderTest
Running org.apache.phoenix.compile.QueryMetaDataTest
Tests run: 33, Failures: 0, Errors: 0, Skipped: 0, Time elapsed: 0.483 sec - in org.apache.phoenix.compile.QueryMetaDataTest
Running org.apache.phoenix.compile.JoinQueryCompilerTest
Tests run: 9, Failures: 0, Errors: 0, Skipped: 0, Time elapsed: 0.845 sec - in org.apache.phoenix.mapreduce.util.PhoenixConfigurationUtilTest
Running org.apache.phoenix.compile.WhereOptimizerTest
Tests run: 2, Failures: 0, Errors: 0, Skipped: 0, Time elapsed: 8.587 sec - in org.apache.phoenix.query.ScannerLeaseRenewalTest
Running org.apache.phoenix.compile.ScanRangesTest
Tests run: 34, Failures: 0, Errors: 0, Skipped: 0, Time elapsed: 0.177 sec - in org.apache.phoenix.compile.ScanRangesTest
Running org.apache.phoenix.compile.ViewCompilerTest
Tests run: 2, Failures: 0, Errors: 0, Skipped: 0, Time elapsed: 0.441 sec - in org.apache.phoenix.compile.JoinQueryCompilerTest
Running org.apache.phoenix.compile.LimitCompilerTest
Tests run: 6, Failures: 0, Errors: 0, Skipped: 0, Time elapsed: 0.468 sec - in org.apache.phoenix.compile.LimitCompilerTest
Running org.apache.phoenix.compile.WhereCompilerTest
Tests run: 103, Failures: 0, Errors: 0, Skipped: 0, Time elapsed: 1.406 sec - in org.apache.phoenix.compile.WhereOptimizerTest
Running org.apache.phoenix.compile.QueryOptimizerTest
Tests run: 3, Failures: 0, Errors: 0, Skipped: 0, Time elapsed: 1.283 sec - in org.apache.phoenix.compile.ViewCompilerTest
Running org.apache.phoenix.compile.StatementHintsCompilationTest
Tests run: 45, Failures: 0, Errors: 0, Skipped: 1, Time elapsed: 0.748 sec - in org.apache.phoenix.compile.WhereCompilerTest
Running org.apache.phoenix.compile.QueryCompilerTest
Tests run: 4, Failures: 0, Errors: 0, Skipped: 0, Time elapsed: 0.882 sec - in org.apache.phoenix.compile.StatementHintsCompilationTest
Running org.apache.phoenix.compile.TenantSpecificViewIndexCompileTest
Tests run: 119, Failures: 0, Errors: 0, Skipped: 0, Time elapsed: 1.519 sec - in org.apache.phoenix.compile.QueryCompilerTest
Running org.apache.phoenix.compile.ScanRangesIntersectTest
Tests run: 1, Failures: 0, Errors: 0, Skipped: 0, Time elapsed: 0.002 sec - in org.apache.phoenix.compile.ScanRangesIntersectTest
Running org.apache.phoenix.compile.HavingCompilerTest
Tests run: 40, Failures: 0, Errors: 0, Skipped: 0, Time elapsed: 1.92 sec - in org.apache.phoenix.compile.QueryOptimizerTest
Running org.apache.phoenix.compile.SelectStatementRewriterTest
Tests run: 11, Failures: 0, Errors: 0, Skipped: 0, Time elapsed: 0.358 sec - in org.apache.phoenix.compile.HavingCompilerTest
Running org.apache.phoenix.execute.CorrelatePlanTest
Tests run: 6, Failures: 0, Errors: 0, Skipped: 0, Time elapsed: 0.046 sec - in org.apache.phoenix.execute.CorrelatePlanTest
Running org.apache.phoenix.execute.MutationStateTest
Tests run: 1, Failures: 0, Errors: 0, Skipped: 0, Time elapsed: 0.001 sec - in org.apache.phoenix.execute.MutationStateTest
Running org.apache.phoenix.execute.LiteralResultIteratorPlanTest
Tests run: 3, Failures: 0, Errors: 0, Skipped: 0, Time elapsed: 0.008 sec - in org.apache.phoenix.execute.LiteralResultIteratorPlanTest
Running org.apache.phoenix.execute.DescVarLengthFastByteComparisonsTest
Tests run: 2, Failures: 0, Errors: 0, Skipped: 0, Time elapsed: 0.006 sec - in org.apache.phoenix.execute.DescVarLengthFastByteComparisonsTest
Running org.apache.phoenix.execute.UnnestArrayPlanTest
Tests run: 6, Failures: 0, Errors: 0, Skipped: 0, Time elapsed: 0.014 sec - in org.apache.phoenix.execute.UnnestArrayPlanTest
Running org.apache.phoenix.schema.types.PDateArrayToStringTest
Tests run: 6, Failures: 0, Errors: 0, Skipped: 0, Time elapsed: 0.009 sec - in org.apache.phoenix.schema.types.PDateArrayToStringTest
Running org.apache.phoenix.schema.types.PrimitiveDoublePhoenixArrayToStringTest
Tests run: 6, Failures: 0, Errors: 0, Skipped: 0, Time elapsed: 0.005 sec - in org.apache.phoenix.schema.types.PrimitiveDoublePhoenixArrayToStringTest
Running org.apache.phoenix.schema.types.PDataTypeForArraysTest
Tests run: 5, Failures: 0, Errors: 0, Skipped: 0, Time elapsed: 0.26 sec - in org.apache.phoenix.compile.SelectStatementRewriterTest
Running org.apache.phoenix.schema.types.PrimitiveFloatPhoenixArrayToStringTest
Tests run: 68, Failures: 0, Errors: 0, Skipped: 0, Time elapsed: 0.078 sec - in org.apache.phoenix.schema.types.PDataTypeForArraysTest
Running org.apache.phoenix.schema.types.PrimitiveBytePhoenixArrayToStringTest
Tests run: 6, Failures: 0, Errors: 0, Skipped: 0, Time elapsed: 0.005 sec - in org.apache.phoenix.schema.types.PrimitiveBytePhoenixArrayToStringTest
Running org.apache.phoenix.schema.types.PrimitiveIntPhoenixArrayToStringTest
Tests run: 6, Failures: 0, Errors: 0, Skipped: 0, Time elapsed: 0.005 sec - in org.apache.phoenix.schema.types.PrimitiveIntPhoenixArrayToStringTest
Running org.apache.phoenix.schema.types.PrimitiveLongPhoenixArrayToStringTest
Tests run: 6, Failures: 0, Errors: 0, Skipped: 0, Time elapsed: 0.027 sec - in org.apache.phoenix.schema.types.PrimitiveFloatPhoenixArrayToStringTest
Running org.apache.phoenix.schema.types.PrimitiveShortPhoenixArrayToStringTest
Tests run: 6, Failures: 0, Errors: 0, Skipped: 0, Time elapsed: 0.005 sec - in org.apache.phoenix.schema.types.PrimitiveLongPhoenixArrayToStringTest
Running org.apache.phoenix.schema.types.PDataTypeTest
Tests run: 6, Failures: 0, Errors: 0, Skipped: 0, Time elapsed: 0.012 sec - in org.apache.phoenix.schema.types.PrimitiveShortPhoenixArrayToStringTest
Running org.apache.phoenix.schema.types.PVarcharArrayToStringTest
Tests run: 8, Failures: 0, Errors: 0, Skipped: 0, Time elapsed: 0.009 sec - in org.apache.phoenix.schema.types.PVarcharArrayToStringTest
Running org.apache.phoenix.schema.types.PrimitiveBooleanPhoenixArrayToStringTest
Tests run: 6, Failures: 0, Errors: 0, Skipped: 0, Time elapsed: 0.008 sec - in org.apache.phoenix.schema.types.PrimitiveBooleanPhoenixArrayToStringTest
Running org.apache.phoenix.schema.SaltingUtilTest
Tests run: 2, Failures: 0, Errors: 0, Skipped: 0, Time elapsed: 0.004 sec - in org.apache.phoenix.schema.SaltingUtilTest
Running org.apache.phoenix.schema.RowKeySchemaTest
Tests run: 6, Failures: 0, Errors: 0, Skipped: 0, Time elapsed: 1.347 sec - in org.apache.phoenix.compile.TenantSpecificViewIndexCompileTest
Running org.apache.phoenix.schema.SortOrderTest
Tests run: 8, Failures: 0, Errors: 0, Skipped: 0, Time elapsed: 0.018 sec - in org.apache.phoenix.schema.SortOrderTest
Running org.apache.phoenix.schema.RowKeyValueAccessorTest
Tests run: 34, Failures: 0, Errors: 0, Skipped: 0, Time elapsed: 0.113 sec - in org.apache.phoenix.schema.types.PDataTypeTest
Running org.apache.phoenix.schema.PCharPadTest
Tests run: 9, Failures: 0, Errors: 0, Skipped: 0, Time elapsed: 0.006 sec - in org.apache.phoenix.schema.PCharPadTest
Running org.apache.phoenix.schema.MutationTest
Tests run: 6, Failures: 0, Errors: 0, Skipped: 0, Time elapsed: 0.33 sec - in org.apache.phoenix.schema.RowKeySchemaTest
Running org.apache.phoenix.schema.SchemaUtilTest
Tests run: 6, Failures: 0, Errors: 0, Skipped: 0, Time elapsed: 0.003 sec - in org.apache.phoenix.schema.SchemaUtilTest
Running org.apache.phoenix.schema.ValueBitSetTest
Tests run: 4, Failures: 0, Errors: 0, Skipped: 0, Time elapsed: 0.008 sec - in org.apache.phoenix.schema.ValueBitSetTest
Running org.apache.phoenix.schema.PMetaDataImplTest
Tests run: 5, Failures: 0, Errors: 0, Skipped: 0, Time elapsed: 0.009 sec - in org.apache.phoenix.schema.PMetaDataImplTest
Running org.apache.phoenix.schema.SequenceAllocationTest
Tests run: 1, Failures: 0, Errors: 0, Skipped: 0, Time elapsed: 0.272 sec - in org.apache.phoenix.schema.MutationTest
Running org.apache.phoenix.memory.MemoryManagerTest
Tests run: 2, Failures: 0, Errors: 0, Skipped: 0, Time elapsed: 0.003 sec - in org.apache.phoenix.schema.SequenceAllocationTest
Running org.apache.phoenix.expression.OctetLengthFunctionTest
Tests run: 1, Failures: 0, Errors: 0, Skipped: 0, Time elapsed: 0.041 sec - in org.apache.phoenix.expression.OctetLengthFunctionTest
Running org.apache.phoenix.expression.ArrayAppendFunctionTest
Tests run: 1, Failures: 0, Errors: 0, Skipped: 0, Time elapsed: 0.381 sec - in org.apache.phoenix.schema.RowKeyValueAccessorTest
Running org.apache.phoenix.expression.PowerFunctionTest
Tests run: 1, Failures: 0, Errors: 0, Skipped: 0, Time elapsed: 0.046 sec - in org.apache.phoenix.expression.PowerFunctionTest
Running org.apache.phoenix.expression.RoundFloorCeilExpressionsTest
Tests run: 25, Failures: 0, Errors: 0, Skipped: 0, Time elapsed: 0.977 sec - in org.apache.phoenix.expression.ArrayAppendFunctionTest
Running org.apache.phoenix.expression.StringToArrayFunctionTest
Tests run: 20, Failures: 0, Errors: 0, Skipped: 0, Time elapsed: 0.02 sec - in org.apache.phoenix.expression.StringToArrayFunctionTest
Running org.apache.phoenix.expression.LnLogFunctionTest
Tests run: 1, Failures: 0, Errors: 0, Skipped: 0, Time elapsed: 0.044 sec - in org.apache.phoenix.expression.LnLogFunctionTest
Running org.apache.phoenix.expression.RegexpSplitFunctionTest
Tests run: 22, Failures: 0, Errors: 0, Skipped: 0, Time elapsed: 1.051 sec - in org.apache.phoenix.expression.RoundFloorCeilExpressionsTest
Running org.apache.phoenix.expression.RegexpSubstrFunctionTest
Tests run: 6, Failures: 0, Errors: 1, Skipped: 2, Time elapsed: 1.2 sec <<< FAILURE! - in org.apache.phoenix.memory.MemoryManagerTest
testWaitUntilResize(org.apache.phoenix.memory.MemoryManagerTest)  Time elapsed: 1.122 sec  <<< ERROR!
org.apache.phoenix.memory.InsufficientMemoryException: Requested memory of 100 bytes could not be allocated. Using memory of 60 bytes from global pool of 100 bytes after waiting for 80ms.
	at org.apache.phoenix.memory.MemoryManagerTest.testWaitUntilResize(MemoryManagerTest.java:209)

Running org.apache.phoenix.expression.DeterminismTest
Tests run: 1, Failures: 0, Errors: 0, Skipped: 0, Time elapsed: 0.001 sec - in org.apache.phoenix.expression.DeterminismTest
Running org.apache.phoenix.expression.CbrtFunctionTest
Tests run: 1, Failures: 0, Errors: 0, Skipped: 0, Time elapsed: 0.006 sec - in org.apache.phoenix.expression.CbrtFunctionTest
Running org.apache.phoenix.expression.ArrayConcatFunctionTest
Tests run: 1, Failures: 0, Errors: 0, Skipped: 0, Time elapsed: 0.159 sec - in org.apache.phoenix.expression.RegexpSubstrFunctionTest
Running org.apache.phoenix.expression.ArrayFillFunctionTest
Tests run: 1, Failures: 0, Errors: 0, Skipped: 0, Time elapsed: 0.242 sec - in org.apache.phoenix.expression.RegexpSplitFunctionTest
Running org.apache.phoenix.expression.LikeExpressionTest
Tests run: 4, Failures: 0, Errors: 0, Skipped: 0, Time elapsed: 0.012 sec - in org.apache.phoenix.expression.LikeExpressionTest
Running org.apache.phoenix.expression.ArrayToStringFunctionTest
Tests run: 14, Failures: 0, Errors: 0, Skipped: 0, Time elapsed: 0.027 sec - in org.apache.phoenix.expression.ArrayFillFunctionTest
Running org.apache.phoenix.expression.CoerceExpressionTest
Tests run: 5, Failures: 0, Errors: 0, Skipped: 0, Time elapsed: 0.015 sec - in org.apache.phoenix.expression.CoerceExpressionTest
Running org.apache.phoenix.expression.SqrtFunctionTest
Tests run: 1, Failures: 0, Errors: 0, Skipped: 0, Time elapsed: 0.011 sec - in org.apache.phoenix.expression.SqrtFunctionTest
Running org.apache.phoenix.expression.ExpFunctionTest
Tests run: 24, Failures: 0, Errors: 0, Skipped: 0, Time elapsed: 0.019 sec - in org.apache.phoenix.expression.ArrayToStringFunctionTest
Running org.apache.phoenix.expression.ArrayPrependFunctionTest
Tests run: 1, Failures: 0, Errors: 0, Skipped: 0, Time elapsed: 0.041 sec - in org.apache.phoenix.expression.ExpFunctionTest
Running org.apache.phoenix.expression.SortOrderExpressionTest
Tests run: 24, Failures: 0, Errors: 0, Skipped: 0, Time elapsed: 0.04 sec - in org.apache.phoenix.expression.SortOrderExpressionTest
Running org.apache.phoenix.expression.AbsFunctionTest
Tests run: 1, Failures: 0, Errors: 0, Skipped: 0, Time elapsed: 0.034 sec - in org.apache.phoenix.expression.AbsFunctionTest
Running org.apache.phoenix.expression.ILikeExpressionTest
Tests run: 3, Failures: 0, Errors: 0, Skipped: 0, Time elapsed: 0.035 sec - in org.apache.phoenix.expression.ILikeExpressionTest
Running org.apache.phoenix.expression.ArithmeticOperationTest
Tests run: 37, Failures: 0, Errors: 0, Skipped: 0, Time elapsed: 0.192 sec - in org.apache.phoenix.expression.ArrayPrependFunctionTest
Running org.apache.phoenix.expression.util.regex.PatternPerformanceTest
Tests run: 1, Failures: 0, Errors: 0, Skipped: 0, Time elapsed: 0.003 sec - in org.apache.phoenix.expression.util.regex.PatternPerformanceTest
Tests run: 6, Failures: 0, Errors: 0, Skipped: 0, Time elapsed: 0.033 sec - in org.apache.phoenix.expression.ArithmeticOperationTest
Running org.apache.phoenix.expression.NullValueTest
Running org.apache.phoenix.expression.SignFunctionTest
Tests run: 1, Failures: 0, Errors: 0, Skipped: 0, Time elapsed: 0.011 sec - in org.apache.phoenix.expression.SignFunctionTest
Running org.apache.phoenix.expression.ColumnExpressionTest
Tests run: 4, Failures: 0, Errors: 0, Skipped: 0, Time elapsed: 0.005 sec - in org.apache.phoenix.expression.ColumnExpressionTest
Running org.apache.phoenix.expression.GetSetByteBitFunctionTest
Tests run: 3, Failures: 0, Errors: 0, Skipped: 0, Time elapsed: 0.207 sec - in org.apache.phoenix.expression.NullValueTest
Running org.apache.phoenix.expression.RegexpReplaceFunctionTest
Tests run: 1, Failures: 0, Errors: 0, Skipped: 0, Time elapsed: 0.012 sec - in org.apache.phoenix.expression.RegexpReplaceFunctionTest
Running org.apache.phoenix.expression.function.InstrFunctionTest
Tests run: 1, Failures: 0, Errors: 0, Skipped: 0, Time elapsed: 0.005 sec - in org.apache.phoenix.expression.function.InstrFunctionTest
Running org.apache.phoenix.expression.function.BuiltinFunctionConstructorTest
Tests run: 2, Failures: 0, Errors: 0, Skipped: 0, Time elapsed: 0.055 sec - in org.apache.phoenix.expression.function.BuiltinFunctionConstructorTest
Running org.apache.phoenix.expression.function.ExternalSqlTypeIdFunctionTest
Tests run: 3, Failures: 0, Errors: 0, Skipped: 0, Time elapsed: 0.002 sec - in org.apache.phoenix.expression.function.ExternalSqlTypeIdFunctionTest
Running org.apache.phoenix.util.csv.CsvUpsertExecutorTest
Tests run: 6, Failures: 0, Errors: 0, Skipped: 0, Time elapsed: 0.45 sec - in org.apache.phoenix.util.csv.CsvUpsertExecutorTest
Running org.apache.phoenix.util.csv.StringToArrayConverterTest
Tests run: 35, Failures: 0, Errors: 0, Skipped: 0, Time elapsed: 1.183 sec - in org.apache.phoenix.expression.ArrayConcatFunctionTest
Running org.apache.phoenix.util.PrefixByteEncoderDecoderTest
Tests run: 3, Failures: 0, Errors: 0, Skipped: 0, Time elapsed: 0.007 sec - in org.apache.phoenix.util.PrefixByteEncoderDecoderTest
Running org.apache.phoenix.util.SequenceUtilTest
Tests run: 18, Failures: 0, Errors: 0, Skipped: 0, Time elapsed: 0.031 sec - in org.apache.phoenix.util.SequenceUtilTest
Running org.apache.phoenix.util.Base62EncoderTest
Tests run: 1, Failures: 0, Errors: 0, Skipped: 0, Time elapsed: 0.03 sec - in org.apache.phoenix.util.Base62EncoderTest
Running org.apache.phoenix.util.PhoenixEncodeDecodeTest
Tests run: 2, Failures: 0, Errors: 0, Skipped: 0, Time elapsed: 0.98 sec - in org.apache.phoenix.expression.GetSetByteBitFunctionTest
Running org.apache.phoenix.util.ByteUtilTest
Tests run: 4, Failures: 0, Errors: 0, Skipped: 0, Time elapsed: 0.259 sec - in org.apache.phoenix.util.csv.StringToArrayConverterTest
Running org.apache.phoenix.util.DateUtilTest
Tests run: 18, Failures: 0, Errors: 0, Skipped: 0, Time elapsed: 0.015 sec - in org.apache.phoenix.util.DateUtilTest
Running org.apache.phoenix.util.PhoenixRuntimeTest
Tests run: 3, Failures: 0, Errors: 0, Skipped: 0, Time elapsed: 0.046 sec - in org.apache.phoenix.util.ByteUtilTest
Running org.apache.phoenix.util.ScanUtilTest
Tests run: 20, Failures: 0, Errors: 0, Skipped: 0, Time elapsed: 0.037 sec - in org.apache.phoenix.util.ScanUtilTest
Running org.apache.phoenix.util.TenantIdByteConversionTest
Tests run: 4, Failures: 0, Errors: 0, Skipped: 0, Time elapsed: 0.202 sec - in org.apache.phoenix.util.PhoenixEncodeDecodeTest
Running org.apache.phoenix.util.JDBCUtilTest
Tests run: 12, Failures: 0, Errors: 0, Skipped: 0, Time elapsed: 0.006 sec - in org.apache.phoenix.util.JDBCUtilTest
Running org.apache.phoenix.util.ColumnInfoTest
Tests run: 18, Failures: 0, Errors: 0, Skipped: 0, Time elapsed: 0.026 sec - in org.apache.phoenix.util.TenantIdByteConversionTest
Running org.apache.phoenix.util.LogUtilTest
Tests run: 5, Failures: 0, Errors: 0, Skipped: 0, Time elapsed: 0.017 sec - in org.apache.phoenix.util.ColumnInfoTest
Running org.apache.phoenix.util.LikeExpressionTest
Tests run: 1, Failures: 0, Errors: 0, Skipped: 0, Time elapsed: 0.002 sec - in org.apache.phoenix.util.LikeExpressionTest
Running org.apache.phoenix.util.PhoenixContextExecutorTest
Tests run: 1, Failures: 0, Errors: 0, Skipped: 0, Time elapsed: 0.004 sec - in org.apache.phoenix.util.PhoenixContextExecutorTest
Running org.apache.phoenix.util.StringUtilTest
Tests run: 5, Failures: 0, Errors: 0, Skipped: 0, Time elapsed: 0.004 sec - in org.apache.phoenix.util.StringUtilTest
Running org.apache.phoenix.util.IndexUtilTest
Tests run: 2, Failures: 0, Errors: 0, Skipped: 0, Time elapsed: 0.003 sec - in org.apache.phoenix.util.IndexUtilTest
Running org.apache.phoenix.util.json.JsonUpsertExecutorTest
Tests run: 3, Failures: 0, Errors: 0, Skipped: 0, Time elapsed: 0.103 sec - in org.apache.phoenix.util.LogUtilTest
Running org.apache.phoenix.util.QueryUtilTest
Tests run: 9, Failures: 0, Errors: 0, Skipped: 0, Time elapsed: 0.027 sec - in org.apache.phoenix.util.QueryUtilTest
Running org.apache.phoenix.util.MetaDataUtilTest
Tests run: 3, Failures: 0, Errors: 0, Skipped: 0, Time elapsed: 0.01 sec - in org.apache.phoenix.util.MetaDataUtilTest
Running org.apache.phoenix.util.PropertiesUtilTest
Tests run: 3, Failures: 0, Errors: 0, Skipped: 0, Time elapsed: 0.03 sec - in org.apache.phoenix.util.PropertiesUtilTest
Tests run: 5, Failures: 0, Errors: 0, Skipped: 0, Time elapsed: 0.276 sec - in org.apache.phoenix.util.json.JsonUpsertExecutorTest
Tests run: 11, Failures: 0, Errors: 0, Skipped: 0, Time elapsed: 0.59 sec - in org.apache.phoenix.util.PhoenixRuntimeTest

Results :

Tests in error: 
  MemoryManagerTest.testWaitUntilResize:209 » InsufficientMemory Requested memor...

Tests run: 1344, Failures: 0, Errors: 1, Skipped: 4

[INFO] ------------------------------------------------------------------------
[INFO] Reactor Summary:
[INFO] 
[INFO] Apache Phoenix .................................... SUCCESS [5.295s]
[INFO] Phoenix Core ...................................... FAILURE [1:18.619s]
[INFO] Phoenix - Flume ................................... SKIPPED
[INFO] Phoenix - Pig ..................................... SKIPPED
[INFO] Phoenix Query Server Client ....................... SKIPPED
[INFO] Phoenix Query Server .............................. SKIPPED
[INFO] Phoenix - Pherf ................................... SKIPPED
[INFO] Phoenix - Spark ................................... SKIPPED
[INFO] Phoenix - Hive .................................... SKIPPED
[INFO] Phoenix Assembly .................................. SKIPPED
[INFO] Phoenix - Tracing Web Application ................. SKIPPED
[INFO] ------------------------------------------------------------------------
[INFO] BUILD FAILURE
[INFO] ------------------------------------------------------------------------
[INFO] Total time: 1:25.162s
[INFO] Finished at: Fri Apr 29 20:56:26 UTC 2016
[INFO] Final Memory: 73M/1396M
[INFO] ------------------------------------------------------------------------
[ERROR] Failed to execute goal org.apache.maven.plugins:maven-surefire-plugin:2.19.1:test (default-test) on project phoenix-core: There are test failures.
[ERROR] 
[ERROR] Please refer to <https://builds.apache.org/job/Phoenix-4.x-HBase-1.1/ws/phoenix-core/target/surefire-reports> for the individual test results.
[ERROR] -> [Help 1]
[ERROR] 
[ERROR] To see the full stack trace of the errors, re-run Maven with the -e switch.
[ERROR] Re-run Maven using the -X switch to enable full debug logging.
[ERROR] 
[ERROR] For more information about the errors and possible solutions, please read the following articles:
[ERROR] [Help 1] http://cwiki.apache.org/confluence/display/MAVEN/MojoFailureException
[ERROR] 
[ERROR] After correcting the problems, you can resume the build with the command
[ERROR]   mvn <goals> -rf :phoenix-core
Build step 'Invoke top-level Maven targets' marked build as failure
Archiving artifacts
No prior successful build to compare, so performing full copy of artifacts
Recording test results

Build failed in Jenkins: Phoenix-4.x-HBase-1.1 #7

Posted by Apache Jenkins Server <je...@builds.apache.org>.
See <https://builds.apache.org/job/Phoenix-4.x-HBase-1.1/7/changes>

Changes:

[samarth] PHOENIX-2867 IT tests for phoenix-flume fails with ClassNotFound

------------------------------------------
[...truncated 681 lines...]
Tests run: 62, Failures: 0, Errors: 0, Skipped: 0, Time elapsed: 264.894 sec - in org.apache.phoenix.end2end.index.IndexExpressionIT
Running org.apache.phoenix.end2end.index.txn.RollbackIT
Tests run: 24, Failures: 0, Errors: 0, Skipped: 0, Time elapsed: 188.71 sec - in org.apache.phoenix.end2end.index.MutableIndexIT
Running org.apache.phoenix.iterate.RoundRobinResultIteratorIT
Tests run: 6, Failures: 0, Errors: 0, Skipped: 0, Time elapsed: 62.831 sec - in org.apache.phoenix.end2end.index.txn.MutableRollbackIT
Running org.apache.phoenix.rpc.UpdateCacheIT
Tests run: 8, Failures: 0, Errors: 0, Skipped: 0, Time elapsed: 52.623 sec - in org.apache.phoenix.end2end.index.txn.RollbackIT
Running org.apache.phoenix.trace.PhoenixTableMetricsWriterIT
Tests run: 2, Failures: 0, Errors: 0, Skipped: 0, Time elapsed: 2.527 sec - in org.apache.phoenix.trace.PhoenixTableMetricsWriterIT
Running org.apache.phoenix.trace.PhoenixTraceReaderIT
Tests run: 2, Failures: 0, Errors: 0, Skipped: 0, Time elapsed: 0.319 sec - in org.apache.phoenix.trace.PhoenixTraceReaderIT
Running org.apache.phoenix.trace.PhoenixTracingEndToEndIT
Tests run: 7, Failures: 0, Errors: 0, Skipped: 0, Time elapsed: 26.418 sec - in org.apache.phoenix.rpc.UpdateCacheIT
Running org.apache.phoenix.tx.TransactionIT
Tests run: 9, Failures: 0, Errors: 0, Skipped: 0, Time elapsed: 95.363 sec - in org.apache.phoenix.iterate.RoundRobinResultIteratorIT
Running org.apache.phoenix.tx.TxCheckpointIT
Tests run: 6, Failures: 0, Errors: 0, Skipped: 0, Time elapsed: 95.609 sec - in org.apache.phoenix.trace.PhoenixTracingEndToEndIT
Tests run: 16, Failures: 0, Errors: 0, Skipped: 0, Time elapsed: 114.629 sec - in org.apache.phoenix.tx.TxCheckpointIT
Tests run: 20, Failures: 0, Errors: 0, Skipped: 1, Time elapsed: 201.012 sec - in org.apache.phoenix.tx.TransactionIT
Tests run: 40, Failures: 0, Errors: 0, Skipped: 0, Time elapsed: 490.99 sec - in org.apache.phoenix.end2end.index.LocalIndexIT
Tests run: 128, Failures: 0, Errors: 0, Skipped: 0, Time elapsed: 564.819 sec - in org.apache.phoenix.end2end.index.IndexIT

Results :

Tests run: 1092, Failures: 0, Errors: 0, Skipped: 5

[INFO] 
[INFO] --- maven-failsafe-plugin:2.19.1:integration-test (HBaseManagedTimeTableReuseTest) @ phoenix-core ---

-------------------------------------------------------
 T E S T S
-------------------------------------------------------
Running org.apache.phoenix.end2end.ArithmeticQueryIT
Running org.apache.phoenix.end2end.AbsFunctionEnd2EndIT
Running org.apache.phoenix.end2end.ArrayFillFunctionIT
Running org.apache.phoenix.end2end.ArrayToStringFunctionIT
Running org.apache.phoenix.end2end.AlterSessionIT
Tests run: 2, Failures: 0, Errors: 0, Skipped: 0, Time elapsed: 0.098 sec - in org.apache.phoenix.end2end.AlterSessionIT
Running org.apache.phoenix.end2end.ArraysWithNullsIT
Tests run: 1, Failures: 0, Errors: 0, Skipped: 0, Time elapsed: 2.676 sec - in org.apache.phoenix.end2end.AbsFunctionEnd2EndIT
Running org.apache.phoenix.end2end.AutoCommitIT
Tests run: 1, Failures: 0, Errors: 0, Skipped: 0, Time elapsed: 2.364 sec - in org.apache.phoenix.end2end.AutoCommitIT
Running org.apache.phoenix.end2end.CbrtFunctionEnd2EndIT
Tests run: 2, Failures: 0, Errors: 0, Skipped: 0, Time elapsed: 0.329 sec - in org.apache.phoenix.end2end.CbrtFunctionEnd2EndIT
Running org.apache.phoenix.end2end.ConvertTimezoneFunctionIT
Tests run: 26, Failures: 0, Errors: 0, Skipped: 0, Time elapsed: 15.558 sec - in org.apache.phoenix.end2end.ArrayFillFunctionIT
Running org.apache.phoenix.end2end.DecodeFunctionIT
Tests run: 36, Failures: 0, Errors: 0, Skipped: 0, Time elapsed: 21.558 sec - in org.apache.phoenix.end2end.ArrayToStringFunctionIT
Running org.apache.phoenix.end2end.DynamicFamilyIT
Tests run: 7, Failures: 0, Errors: 0, Skipped: 0, Time elapsed: 16.097 sec - in org.apache.phoenix.end2end.ConvertTimezoneFunctionIT
Tests run: 4, Failures: 0, Errors: 0, Skipped: 0, Time elapsed: 4.719 sec - in org.apache.phoenix.end2end.DynamicFamilyIT
Running org.apache.phoenix.end2end.FirstValueFunctionIT
Tests run: 6, Failures: 0, Errors: 0, Skipped: 0, Time elapsed: 11.76 sec - in org.apache.phoenix.end2end.DecodeFunctionIT
Running org.apache.phoenix.end2end.GetSetByteBitFunctionEnd2EndIT
Tests run: 1, Failures: 0, Errors: 0, Skipped: 0, Time elapsed: 0.11 sec - in org.apache.phoenix.end2end.GetSetByteBitFunctionEnd2EndIT
Running org.apache.phoenix.end2end.MD5FunctionIT
Running org.apache.phoenix.end2end.LikeExpressionIT
Tests run: 16, Failures: 0, Errors: 0, Skipped: 0, Time elapsed: 32.909 sec - in org.apache.phoenix.end2end.ArraysWithNullsIT
Running org.apache.phoenix.end2end.MinMaxAggregateFunctionIT
Tests run: 3, Failures: 0, Errors: 0, Skipped: 0, Time elapsed: 4.665 sec - in org.apache.phoenix.end2end.LikeExpressionIT
Running org.apache.phoenix.end2end.NthValueFunctionIT
Tests run: 3, Failures: 0, Errors: 0, Skipped: 0, Time elapsed: 6.894 sec - in org.apache.phoenix.end2end.MD5FunctionIT
Running org.apache.phoenix.end2end.OctetLengthFunctionEnd2EndIT
Tests run: 1, Failures: 0, Errors: 0, Skipped: 0, Time elapsed: 2.374 sec - in org.apache.phoenix.end2end.MinMaxAggregateFunctionIT
Tests run: 1, Failures: 0, Errors: 0, Skipped: 0, Time elapsed: 2.305 sec - in org.apache.phoenix.end2end.OctetLengthFunctionEnd2EndIT
Running org.apache.phoenix.end2end.PrimitiveTypeIT
Tests run: 9, Failures: 0, Errors: 0, Skipped: 0, Time elapsed: 0.11 sec - in org.apache.phoenix.end2end.PrimitiveTypeIT
Tests run: 7, Failures: 0, Errors: 0, Skipped: 0, Time elapsed: 15.118 sec - in org.apache.phoenix.end2end.FirstValueFunctionIT
Running org.apache.phoenix.end2end.PowerFunctionEnd2EndIT
Running org.apache.phoenix.end2end.QueryMoreIT
Running org.apache.phoenix.end2end.RTrimFunctionIT
Tests run: 1, Failures: 0, Errors: 0, Skipped: 0, Time elapsed: 0.419 sec - in org.apache.phoenix.end2end.PowerFunctionEnd2EndIT
Running org.apache.phoenix.end2end.ReadOnlyIT
Tests run: 2, Failures: 0, Errors: 0, Skipped: 0, Time elapsed: 4.63 sec - in org.apache.phoenix.end2end.RTrimFunctionIT
Running org.apache.phoenix.end2end.RegexpSplitFunctionIT
Tests run: 11, Failures: 0, Errors: 0, Skipped: 0, Time elapsed: 0.253 sec - in org.apache.phoenix.end2end.RegexpSplitFunctionIT
Running org.apache.phoenix.end2end.ReverseFunctionIT
Tests run: 1, Failures: 0, Errors: 0, Skipped: 0, Time elapsed: 8.749 sec - in org.apache.phoenix.end2end.ReadOnlyIT
Running org.apache.phoenix.end2end.RoundFloorCeilFunctionsEnd2EndIT
Tests run: 26, Failures: 0, Errors: 0, Skipped: 0, Time elapsed: 57.635 sec - in org.apache.phoenix.end2end.ArithmeticQueryIT
Running org.apache.phoenix.end2end.SerialIteratorsIT
Tests run: 1, Failures: 0, Errors: 0, Skipped: 0, Time elapsed: 2.443 sec - in org.apache.phoenix.end2end.SerialIteratorsIT
Tests run: 33, Failures: 0, Errors: 0, Skipped: 0, Time elapsed: 7.017 sec - in org.apache.phoenix.end2end.RoundFloorCeilFunctionsEnd2EndIT
Running org.apache.phoenix.end2end.ServerExceptionIT
Tests run: 5, Failures: 0, Errors: 0, Skipped: 0, Time elapsed: 10.475 sec - in org.apache.phoenix.end2end.ReverseFunctionIT
Tests run: 11, Failures: 0, Errors: 0, Skipped: 0, Time elapsed: 25.286 sec - in org.apache.phoenix.end2end.NthValueFunctionIT
Running org.apache.phoenix.end2end.SortOrderIT
Running org.apache.phoenix.end2end.StatementHintsIT
Tests run: 1, Failures: 0, Errors: 0, Skipped: 0, Time elapsed: 2.324 sec - in org.apache.phoenix.end2end.ServerExceptionIT
Tests run: 2, Failures: 0, Errors: 0, Skipped: 0, Time elapsed: 2.344 sec - in org.apache.phoenix.end2end.StatementHintsIT
Running org.apache.phoenix.end2end.SignFunctionEnd2EndIT
Tests run: 2, Failures: 0, Errors: 0, Skipped: 0, Time elapsed: 0.42 sec - in org.apache.phoenix.end2end.SignFunctionEnd2EndIT
Running org.apache.phoenix.end2end.TimezoneOffsetFunctionIT
Running org.apache.phoenix.end2end.StringToArrayFunctionIT
Running org.apache.phoenix.end2end.StoreNullsIT
Tests run: 6, Failures: 0, Errors: 0, Skipped: 0, Time elapsed: 32.71 sec - in org.apache.phoenix.end2end.QueryMoreIT
Running org.apache.phoenix.end2end.UpsertSelectAutoCommitIT
Tests run: 22, Failures: 0, Errors: 0, Skipped: 0, Time elapsed: 13.92 sec - in org.apache.phoenix.end2end.StringToArrayFunctionIT
Tests run: 3, Failures: 0, Errors: 0, Skipped: 0, Time elapsed: 13.764 sec - in org.apache.phoenix.end2end.StoreNullsIT
Running org.apache.phoenix.end2end.salted.SaltedTableUpsertSelectIT
Running org.apache.phoenix.end2end.salted.SaltedTableVarLengthRowKeyIT
Tests run: 7, Failures: 0, Errors: 0, Skipped: 0, Time elapsed: 16.12 sec - in org.apache.phoenix.end2end.TimezoneOffsetFunctionIT
Tests run: 1, Failures: 0, Errors: 0, Skipped: 0, Time elapsed: 2.326 sec - in org.apache.phoenix.end2end.salted.SaltedTableVarLengthRowKeyIT
Running org.apache.phoenix.iterate.PhoenixQueryTimeoutIT
Tests run: 2, Failures: 0, Errors: 0, Skipped: 0, Time elapsed: 0.105 sec - in org.apache.phoenix.iterate.PhoenixQueryTimeoutIT
Tests run: 3, Failures: 0, Errors: 0, Skipped: 0, Time elapsed: 11.626 sec - in org.apache.phoenix.end2end.UpsertSelectAutoCommitIT
Tests run: 6, Failures: 0, Errors: 0, Skipped: 0, Time elapsed: 27.434 sec - in org.apache.phoenix.end2end.salted.SaltedTableUpsertSelectIT
Tests run: 45, Failures: 0, Errors: 0, Skipped: 0, Time elapsed: 118.52 sec - in org.apache.phoenix.end2end.SortOrderIT

Results :

Tests run: 317, Failures: 0, Errors: 0, Skipped: 0

[INFO] 
[INFO] --- maven-failsafe-plugin:2.19.1:integration-test (NeedTheirOwnClusterTests) @ phoenix-core ---

-------------------------------------------------------
 T E S T S
-------------------------------------------------------
Running org.apache.hadoop.hbase.regionserver.wal.WALReplayWithIndexWritesAndUncompressedWALInHBase_094_9_IT
Running org.apache.hadoop.hbase.regionserver.wal.WALReplayWithIndexWritesAndCompressedWALIT
Running org.apache.phoenix.coprocessor.StatisticsCollectionRunTrackerIT
Running org.apache.phoenix.end2end.AlterTableIT
Tests run: 1, Failures: 0, Errors: 0, Skipped: 0, Time elapsed: 28.957 sec - in org.apache.hadoop.hbase.regionserver.wal.WALReplayWithIndexWritesAndUncompressedWALInHBase_094_9_IT
Tests run: 1, Failures: 0, Errors: 0, Skipped: 0, Time elapsed: 28.991 sec - in org.apache.hadoop.hbase.regionserver.wal.WALReplayWithIndexWritesAndCompressedWALIT
Running org.apache.phoenix.end2end.ConnectionUtilIT
Tests run: 4, Failures: 0, Errors: 0, Skipped: 0, Time elapsed: 22.692 sec - in org.apache.phoenix.coprocessor.StatisticsCollectionRunTrackerIT
Running org.apache.phoenix.end2end.CountDistinctCompressionIT
Tests run: 1, Failures: 0, Errors: 0, Skipped: 0, Time elapsed: 28.634 sec - in org.apache.phoenix.end2end.ConnectionUtilIT
Running org.apache.phoenix.end2end.ContextClassloaderIT
Tests run: 1, Failures: 0, Errors: 0, Skipped: 0, Time elapsed: 4.925 sec - in org.apache.phoenix.end2end.CountDistinctCompressionIT
Tests run: 3, Failures: 0, Errors: 0, Skipped: 0, Time elapsed: 9.004 sec - in org.apache.phoenix.end2end.ContextClassloaderIT
Running org.apache.phoenix.end2end.CsvBulkLoadToolIT
Running org.apache.phoenix.end2end.IndexToolIT
Running org.apache.phoenix.end2end.KeyOnlyIT
Running org.apache.phoenix.end2end.MultiCfQueryExecIT
Tests run: 3, Failures: 0, Errors: 0, Skipped: 0, Time elapsed: 11.447 sec - in org.apache.phoenix.end2end.KeyOnlyIT
Tests run: 9, Failures: 0, Errors: 0, Skipped: 0, Time elapsed: 23.411 sec - in org.apache.phoenix.end2end.MultiCfQueryExecIT
Running org.apache.phoenix.end2end.MutableIndexToolIT
Running org.apache.phoenix.end2end.ParallelIteratorsIT
Tests run: 3, Failures: 0, Errors: 0, Skipped: 0, Time elapsed: 30.937 sec - in org.apache.phoenix.end2end.ParallelIteratorsIT
Tests run: 1, Failures: 0, Errors: 0, Skipped: 0, Time elapsed: 81.845 sec - in org.apache.phoenix.end2end.MutableIndexToolIT
Running org.apache.phoenix.end2end.QueryTimeoutIT
Running org.apache.phoenix.end2end.QueryWithLimitIT
Tests run: 1, Failures: 0, Errors: 0, Skipped: 0, Time elapsed: 21.056 sec - in org.apache.phoenix.end2end.QueryTimeoutIT
Tests run: 2, Failures: 0, Errors: 0, Skipped: 0, Time elapsed: 21.834 sec - in org.apache.phoenix.end2end.QueryWithLimitIT
Running org.apache.phoenix.end2end.QueryWithOffsetIT
Tests run: 8, Failures: 0, Errors: 0, Skipped: 0, Time elapsed: 13.503 sec - in org.apache.phoenix.end2end.QueryWithOffsetIT
Running org.apache.phoenix.end2end.SaltedViewIT
Running org.apache.phoenix.end2end.SpillableGroupByIT
Tests run: 1, Failures: 0, Errors: 0, Skipped: 0, Time elapsed: 13.645 sec - in org.apache.phoenix.end2end.SpillableGroupByIT
Tests run: 4, Failures: 0, Errors: 0, Skipped: 0, Time elapsed: 40.913 sec - in org.apache.phoenix.end2end.SaltedViewIT
Running org.apache.phoenix.end2end.StatsCollectionDisabledIT
Running org.apache.phoenix.end2end.StatsCollectorIT
Tests run: 1, Failures: 0, Errors: 0, Skipped: 0, Time elapsed: 13.04 sec - in org.apache.phoenix.end2end.StatsCollectionDisabledIT
Tests run: 56, Failures: 0, Errors: 0, Skipped: 0, Time elapsed: 382.963 sec - in org.apache.phoenix.end2end.AlterTableIT
Running org.apache.phoenix.end2end.StatsCollectorWithSplitsAndMultiCFIT
Tests run: 2, Failures: 0, Errors: 0, Skipped: 0, Time elapsed: 11.292 sec - in org.apache.phoenix.end2end.StatsCollectorWithSplitsAndMultiCFIT
Running org.apache.phoenix.end2end.TenantSpecificTablesDDLIT
Running org.apache.phoenix.end2end.TenantSpecificTablesDMLIT
Tests run: 16, Failures: 0, Errors: 0, Skipped: 0, Time elapsed: 22.631 sec - in org.apache.phoenix.end2end.TenantSpecificTablesDMLIT
Tests run: 17, Failures: 0, Errors: 0, Skipped: 0, Time elapsed: 41.668 sec - in org.apache.phoenix.end2end.TenantSpecificTablesDDLIT
Running org.apache.phoenix.end2end.TransactionalViewIT
Tests run: 16, Failures: 0, Errors: 0, Skipped: 0, Time elapsed: 132.274 sec - in org.apache.phoenix.end2end.StatsCollectorIT
Running org.apache.phoenix.end2end.UnionAllIT
Tests run: 10, Failures: 0, Errors: 0, Skipped: 0, Time elapsed: 423.351 sec - in org.apache.phoenix.end2end.CsvBulkLoadToolIT
Running org.apache.phoenix.end2end.ViewIT
Tests run: 13, Failures: 0, Errors: 0, Skipped: 0, Time elapsed: 30.585 sec - in org.apache.phoenix.end2end.UnionAllIT
Running org.apache.phoenix.end2end.UserDefinedFunctionsIT
Tests run: 2, Failures: 0, Errors: 0, Skipped: 0, Time elapsed: 62.277 sec - in org.apache.phoenix.end2end.TransactionalViewIT
Running org.apache.phoenix.end2end.index.ImmutableIndexWithStatsIT
Tests run: 1, Failures: 0, Errors: 0, Skipped: 0, Time elapsed: 12.455 sec - in org.apache.phoenix.end2end.index.ImmutableIndexWithStatsIT
Tests run: 14, Failures: 0, Errors: 0, Skipped: 0, Time elapsed: 53.544 sec - in org.apache.phoenix.end2end.UserDefinedFunctionsIT
Running org.apache.phoenix.end2end.index.MutableIndexFailureIT
Running org.apache.phoenix.end2end.index.MutableIndexReplicationIT
Running org.apache.phoenix.end2end.index.ReadOnlyIndexFailureIT
Tests run: 1, Failures: 0, Errors: 0, Skipped: 0, Time elapsed: 26.158 sec - in org.apache.phoenix.end2end.index.MutableIndexReplicationIT
Tests run: 2, Failures: 0, Errors: 0, Skipped: 0, Time elapsed: 24.952 sec - in org.apache.phoenix.end2end.index.ReadOnlyIndexFailureIT
Running org.apache.phoenix.end2end.index.txn.TxWriteFailureIT
Running org.apache.phoenix.execute.PartialCommitIT
Tests run: 48, Failures: 0, Errors: 0, Skipped: 0, Time elapsed: 163.615 sec - in org.apache.phoenix.end2end.ViewIT
Tests run: 8, Failures: 0, Errors: 0, Skipped: 0, Time elapsed: 105.198 sec - in org.apache.phoenix.end2end.index.MutableIndexFailureIT
Running org.apache.phoenix.hbase.index.FailForUnsupportedHBaseVersionsIT
Tests run: 12, Failures: 0, Errors: 0, Skipped: 0, Time elapsed: 4.734 sec - in org.apache.phoenix.execute.PartialCommitIT
Running org.apache.phoenix.hbase.index.balancer.IndexLoadBalancerIT
Running org.apache.phoenix.hbase.index.covered.EndToEndCoveredColumnsIndexBuilderIT
Tests run: 8, Failures: 0, Errors: 0, Skipped: 0, Time elapsed: 42.831 sec - in org.apache.phoenix.end2end.index.txn.TxWriteFailureIT
Tests run: 2, Failures: 0, Errors: 0, Skipped: 0, Time elapsed: 20.553 sec - in org.apache.phoenix.hbase.index.FailForUnsupportedHBaseVersionsIT
Tests run: 2, Failures: 0, Errors: 0, Skipped: 0, Time elapsed: 18.643 sec - in org.apache.phoenix.hbase.index.covered.EndToEndCoveredColumnsIndexBuilderIT
Running org.apache.phoenix.hbase.index.covered.example.EndToEndCoveredIndexingIT
Running org.apache.phoenix.hbase.index.covered.example.EndtoEndIndexingWithCompressionIT
Running org.apache.phoenix.hbase.index.covered.example.FailWithoutRetriesIT
Tests run: 1, Failures: 0, Errors: 0, Skipped: 0, Time elapsed: 6.98 sec - in org.apache.phoenix.hbase.index.covered.example.FailWithoutRetriesIT
Running org.apache.phoenix.iterate.RoundRobinResultIteratorWithStatsIT
Tests run: 9, Failures: 0, Errors: 0, Skipped: 1, Time elapsed: 85.196 sec - in org.apache.phoenix.hbase.index.balancer.IndexLoadBalancerIT
Tests run: 1, Failures: 0, Errors: 0, Skipped: 0, Time elapsed: 14.906 sec - in org.apache.phoenix.iterate.RoundRobinResultIteratorWithStatsIT
Running org.apache.phoenix.iterate.ScannerLeaseRenewalIT
Running org.apache.phoenix.monitoring.PhoenixMetricsIT
Tests run: 11, Failures: 0, Errors: 0, Skipped: 0, Time elapsed: 133.714 sec - in org.apache.phoenix.hbase.index.covered.example.EndToEndCoveredIndexingIT
Tests run: 11, Failures: 0, Errors: 0, Skipped: 0, Time elapsed: 131.008 sec - in org.apache.phoenix.hbase.index.covered.example.EndtoEndIndexingWithCompressionIT
Running org.apache.phoenix.rpc.PhoenixClientRpcIT
Running org.apache.phoenix.rpc.PhoenixServerRpcIT
Tests run: 2, Failures: 0, Errors: 0, Skipped: 0, Time elapsed: 13.864 sec - in org.apache.phoenix.rpc.PhoenixClientRpcIT
Tests run: 2, Failures: 0, Errors: 0, Skipped: 0, Time elapsed: 14.1 sec - in org.apache.phoenix.rpc.PhoenixServerRpcIT
Tests run: 18, Failures: 0, Errors: 0, Skipped: 0, Time elapsed: 62.181 sec - in org.apache.phoenix.monitoring.PhoenixMetricsIT
Tests run: 16, Failures: 0, Errors: 0, Skipped: 0, Time elapsed: 841.811 sec - in org.apache.phoenix.end2end.IndexToolIT
Tests run: 2, Failures: 0, Errors: 0, Skipped: 0, Time elapsed: 170.737 sec - in org.apache.phoenix.iterate.ScannerLeaseRenewalIT

Results :

Tests run: 347, Failures: 0, Errors: 0, Skipped: 1

[INFO] 
[INFO] --- maven-failsafe-plugin:2.19.1:verify (ClientManagedTimeTests) @ phoenix-core ---
[INFO] ------------------------------------------------------------------------
[INFO] Reactor Summary:
[INFO] 
[INFO] Apache Phoenix .................................... SUCCESS [2.819s]
[INFO] Phoenix Core ...................................... FAILURE [47:01.317s]
[INFO] Phoenix - Flume ................................... SKIPPED
[INFO] Phoenix - Pig ..................................... SKIPPED
[INFO] Phoenix Query Server Client ....................... SKIPPED
[INFO] Phoenix Query Server .............................. SKIPPED
[INFO] Phoenix - Pherf ................................... SKIPPED
[INFO] Phoenix - Spark ................................... SKIPPED
[INFO] Phoenix - Hive .................................... SKIPPED
[INFO] Phoenix Assembly .................................. SKIPPED
[INFO] Phoenix - Tracing Web Application ................. SKIPPED
[INFO] ------------------------------------------------------------------------
[INFO] BUILD FAILURE
[INFO] ------------------------------------------------------------------------
[INFO] Total time: 47:04.807s
[INFO] Finished at: Fri Apr 29 20:39:42 UTC 2016
[INFO] Final Memory: 66M/1003M
[INFO] ------------------------------------------------------------------------
[ERROR] Failed to execute goal org.apache.maven.plugins:maven-failsafe-plugin:2.19.1:verify (ClientManagedTimeTests) on project phoenix-core: There was a timeout or other error in the fork -> [Help 1]
[ERROR] 
[ERROR] To see the full stack trace of the errors, re-run Maven with the -e switch.
[ERROR] Re-run Maven using the -X switch to enable full debug logging.
[ERROR] 
[ERROR] For more information about the errors and possible solutions, please read the following articles:
[ERROR] [Help 1] http://cwiki.apache.org/confluence/display/MAVEN/MojoExecutionException
[ERROR] 
[ERROR] After correcting the problems, you can resume the build with the command
[ERROR]   mvn <goals> -rf :phoenix-core
Build step 'Invoke top-level Maven targets' marked build as failure
Archiving artifacts
No prior successful build to compare, so performing full copy of artifacts
Recording test results