You are viewing a plain text version of this content. The canonical link for it is here.
Posted to builds@beam.apache.org by Apache Jenkins Server <je...@builds.apache.org> on 2022/02/12 18:41:04 UTC

Build failed in Jenkins: beam_PostCommit_Java_Hadoop_Versions #1260

See <https://ci-beam.apache.org/job/beam_PostCommit_Java_Hadoop_Versions/1260/display/redirect?page=changes>

Changes:

[randomstep] [BEAM-9195] Bump org.testcontainers to 1.16.3


------------------------------------------
[...truncated 76.89 KB...]
    java.lang.NullPointerException at HadoopFileSystemTest.java:93

org.apache.beam.sdk.io.hdfs.HadoopFileSystemTest > testCreateAndReadFile FAILED
    java.lang.NoSuchMethodError at HadoopFileSystemTest.java:85
    java.lang.NullPointerException at HadoopFileSystemTest.java:93

> Task :sdks:java:io:parquet:hadoopVersion292Test

> Task :sdks:java:io:hadoop-file-system:hadoopVersion292Test

org.apache.beam.sdk.io.hdfs.HadoopFileSystemTest > testMatchDirectory FAILED
    java.lang.NoSuchMethodError at HadoopFileSystemTest.java:85
    java.lang.NullPointerException at HadoopFileSystemTest.java:93

org.apache.beam.sdk.io.hdfs.HadoopFileSystemTest > testRenameRetryScenario FAILED
    java.lang.NoSuchMethodError at HadoopFileSystemTest.java:85
    java.lang.NullPointerException at HadoopFileSystemTest.java:93

org.apache.beam.sdk.io.hdfs.HadoopFileSystemTest > testRenameMissingTargetDir FAILED
    java.lang.NoSuchMethodError at HadoopFileSystemTest.java:85
    java.lang.NullPointerException at HadoopFileSystemTest.java:93

org.apache.beam.sdk.io.hdfs.HadoopFileSystemTest > testCreateAndReadFileWithShift FAILED
    java.lang.NoSuchMethodError at HadoopFileSystemTest.java:85
    java.lang.NullPointerException at HadoopFileSystemTest.java:93

org.apache.beam.sdk.io.hdfs.HadoopFileSystemTest > testCreateAndReadFileWithShiftToEnd FAILED
    java.lang.NoSuchMethodError at HadoopFileSystemTest.java:85
    java.lang.NullPointerException at HadoopFileSystemTest.java:93

org.apache.beam.sdk.io.hdfs.HadoopFileSystemTest > testCopySourceMissing FAILED
    java.lang.NoSuchMethodError at HadoopFileSystemTest.java:85
    java.lang.NullPointerException at HadoopFileSystemTest.java:93

org.apache.beam.sdk.io.hdfs.HadoopFileSystemTest > testRenameMissingSource FAILED
    java.lang.NoSuchMethodError at HadoopFileSystemTest.java:85
    java.lang.NullPointerException at HadoopFileSystemTest.java:93

org.apache.beam.sdk.io.hdfs.HadoopFileSystemTest > testMatchNewResource FAILED
    java.lang.NoSuchMethodError at HadoopFileSystemTest.java:85
    java.lang.NullPointerException at HadoopFileSystemTest.java:93

org.apache.beam.sdk.io.hdfs.HadoopFileSystemTest > testMatchForRecursiveGlob FAILED
    java.lang.NoSuchMethodError at HadoopFileSystemTest.java:85
    java.lang.NullPointerException at HadoopFileSystemTest.java:93

org.apache.beam.sdk.io.hdfs.HadoopFileSystemTest > testDelete FAILED
    java.lang.NoSuchMethodError at HadoopFileSystemTest.java:85
    java.lang.NullPointerException at HadoopFileSystemTest.java:93

org.apache.beam.sdk.io.hdfs.HadoopFileSystemTest > testRename FAILED
    java.lang.NoSuchMethodError at HadoopFileSystemTest.java:85
    java.lang.NullPointerException at HadoopFileSystemTest.java:93

org.apache.beam.sdk.io.hdfs.HadoopResourceIdTest > testGetFilename FAILED
    java.lang.NoSuchMethodError at HadoopResourceIdTest.java:50
    java.lang.NullPointerException at HadoopResourceIdTest.java:61

org.apache.beam.sdk.io.hdfs.HadoopResourceIdTest > testResourceIdTester FAILED
    java.lang.NoSuchMethodError at HadoopResourceIdTest.java:50
    java.lang.NullPointerException at HadoopResourceIdTest.java:61

34 tests completed, 20 failed, 1 skipped

> Task :sdks:java:io:hadoop-file-system:hadoopVersion292Test FAILED
> Task :sdks:java:io:hadoop-format:runHadoopFormatIO2101IT
> Task :sdks:java:extensions:sorter:hadoopVersion321Test

> Task :sdks:java:io:hadoop-file-system:hadoopVersion321Test FAILED

org.apache.beam.sdk.io.hdfs.HadoopFileSystemRegistrarTest > testServiceLoader FAILED
    java.lang.NoClassDefFoundError at HadoopFileSystemRegistrarTest.java:55
        Caused by: java.lang.ClassNotFoundException at HadoopFileSystemRegistrarTest.java:55
    java.lang.NullPointerException at HadoopFileSystemRegistrarTest.java:61

org.apache.beam.sdk.io.hdfs.HadoopFileSystemTest > testDeleteNonExisting FAILED
    java.lang.NoClassDefFoundError at HadoopFileSystemTest.java:85
        Caused by: java.lang.ClassNotFoundException at HadoopFileSystemTest.java:85
    java.lang.NullPointerException at HadoopFileSystemTest.java:93

org.apache.beam.sdk.io.hdfs.HadoopFileSystemTest > testRenameExistingDestination FAILED
    java.lang.NoClassDefFoundError at HadoopFileSystemTest.java:85
        Caused by: java.lang.ClassNotFoundException at HadoopFileSystemTest.java:85
    java.lang.NullPointerException at HadoopFileSystemTest.java:93

org.apache.beam.sdk.io.hdfs.HadoopFileSystemTest > testMatch FAILED
    java.lang.NoClassDefFoundError at HadoopFileSystemTest.java:85
        Caused by: java.lang.ClassNotFoundException at HadoopFileSystemTest.java:85
    java.lang.NullPointerException at HadoopFileSystemTest.java:93

org.apache.beam.sdk.io.hdfs.HadoopFileSystemTest > testCopy FAILED
    java.lang.NoClassDefFoundError at HadoopFileSystemTest.java:85
        Caused by: java.lang.ClassNotFoundException at HadoopFileSystemTest.java:85
    java.lang.NullPointerException at HadoopFileSystemTest.java:93

org.apache.beam.sdk.io.hdfs.HadoopFileSystemTest > testMatchForNonExistentFile FAILED
    java.lang.NoClassDefFoundError at HadoopFileSystemTest.java:85
        Caused by: java.lang.ClassNotFoundException at HadoopFileSystemTest.java:85
    java.lang.NullPointerException at HadoopFileSystemTest.java:93

org.apache.beam.sdk.io.hdfs.HadoopFileSystemTest > testCreateAndReadFile FAILED
    java.lang.NoClassDefFoundError at HadoopFileSystemTest.java:85
        Caused by: java.lang.ClassNotFoundException at HadoopFileSystemTest.java:85
    java.lang.NullPointerException at HadoopFileSystemTest.java:93

org.apache.beam.sdk.io.hdfs.HadoopFileSystemTest > testMatchDirectory FAILED
    java.lang.NoClassDefFoundError at HadoopFileSystemTest.java:85
        Caused by: java.lang.ClassNotFoundException at HadoopFileSystemTest.java:85
    java.lang.NullPointerException at HadoopFileSystemTest.java:93

org.apache.beam.sdk.io.hdfs.HadoopFileSystemTest > testRenameRetryScenario FAILED
    java.lang.NoClassDefFoundError at HadoopFileSystemTest.java:85
        Caused by: java.lang.ClassNotFoundException at HadoopFileSystemTest.java:85
    java.lang.NullPointerException at HadoopFileSystemTest.java:93

org.apache.beam.sdk.io.hdfs.HadoopFileSystemTest > testRenameMissingTargetDir FAILED
    java.lang.NoClassDefFoundError at HadoopFileSystemTest.java:85
        Caused by: java.lang.ClassNotFoundException at HadoopFileSystemTest.java:85
    java.lang.NullPointerException at HadoopFileSystemTest.java:93

org.apache.beam.sdk.io.hdfs.HadoopFileSystemTest > testCreateAndReadFileWithShift FAILED
    java.lang.NoClassDefFoundError at HadoopFileSystemTest.java:85
        Caused by: java.lang.ClassNotFoundException at HadoopFileSystemTest.java:85
    java.lang.NullPointerException at HadoopFileSystemTest.java:93

org.apache.beam.sdk.io.hdfs.HadoopFileSystemTest > testCreateAndReadFileWithShiftToEnd FAILED
    java.lang.NoClassDefFoundError at HadoopFileSystemTest.java:85
        Caused by: java.lang.ClassNotFoundException at HadoopFileSystemTest.java:85
    java.lang.NullPointerException at HadoopFileSystemTest.java:93

org.apache.beam.sdk.io.hdfs.HadoopFileSystemTest > testCopySourceMissing FAILED
    java.lang.NoClassDefFoundError at HadoopFileSystemTest.java:85
        Caused by: java.lang.ClassNotFoundException at HadoopFileSystemTest.java:85
    java.lang.NullPointerException at HadoopFileSystemTest.java:93

org.apache.beam.sdk.io.hdfs.HadoopFileSystemTest > testRenameMissingSource FAILED
    java.lang.NoClassDefFoundError at HadoopFileSystemTest.java:85
        Caused by: java.lang.ClassNotFoundException at HadoopFileSystemTest.java:85
    java.lang.NullPointerException at HadoopFileSystemTest.java:93

org.apache.beam.sdk.io.hdfs.HadoopFileSystemTest > testMatchNewResource FAILED
    java.lang.NoClassDefFoundError at HadoopFileSystemTest.java:85
        Caused by: java.lang.ClassNotFoundException at HadoopFileSystemTest.java:85
    java.lang.NullPointerException at HadoopFileSystemTest.java:93

org.apache.beam.sdk.io.hdfs.HadoopFileSystemTest > testMatchForRecursiveGlob FAILED
    java.lang.NoClassDefFoundError at HadoopFileSystemTest.java:85
        Caused by: java.lang.ClassNotFoundException at HadoopFileSystemTest.java:85
    java.lang.NullPointerException at HadoopFileSystemTest.java:93

org.apache.beam.sdk.io.hdfs.HadoopFileSystemTest > testDelete FAILED
    java.lang.NoClassDefFoundError at HadoopFileSystemTest.java:85
        Caused by: java.lang.ClassNotFoundException at HadoopFileSystemTest.java:85
    java.lang.NullPointerException at HadoopFileSystemTest.java:93

org.apache.beam.sdk.io.hdfs.HadoopFileSystemTest > testRename FAILED
    java.lang.NoClassDefFoundError at HadoopFileSystemTest.java:85
        Caused by: java.lang.ClassNotFoundException at HadoopFileSystemTest.java:85
    java.lang.NullPointerException at HadoopFileSystemTest.java:93

org.apache.beam.sdk.io.hdfs.HadoopResourceIdTest > testGetFilename FAILED
    java.lang.NoClassDefFoundError at HadoopResourceIdTest.java:50
        Caused by: java.lang.ClassNotFoundException at HadoopResourceIdTest.java:50
    java.lang.NullPointerException at HadoopResourceIdTest.java:61

org.apache.beam.sdk.io.hdfs.HadoopResourceIdTest > testResourceIdTester FAILED
    java.lang.NoClassDefFoundError at HadoopResourceIdTest.java:50
        Caused by: java.lang.ClassNotFoundException at HadoopResourceIdTest.java:50
    java.lang.NullPointerException at HadoopResourceIdTest.java:61

34 tests completed, 20 failed, 1 skipped

> Task :sdks:java:io:hadoop-format:runHadoopFormatIO2101Test
> Task :sdks:java:io:parquet:hadoopVersion321Test
> Task :runners:spark:2:hadoopVersion285Test
> Task :sdks:java:io:hcatalog:hadoopVersion292Test

> Task :runners:spark:2:hadoopVersion285Test
testBatchPipelineTimeoutState(isStreaming=false) two
testBatchPipelineTimeoutState(isStreaming=false) one

> Task :sdks:java:extensions:sorter:hadoopVersionsTest
> Task :sdks:java:io:parquet:hadoopVersionsTest
> Task :sdks:java:io:hcatalog:hadoopVersionsTest
> Task :runners:spark:2:hadoopVersion292Test
> Task :sdks:java:io:hadoop-format:runHadoopFormatIO285ElasticIT
> Task :sdks:java:io:hadoop-format:runHadoopFormatIO285IT
> Task :sdks:java:io:hadoop-format:runHadoopFormatIO285Test
> Task :runners:spark:2:hadoopVersion321Test
testBatchPipelineTimeoutState(isStreaming=false) one
testBatchPipelineTimeoutState(isStreaming=false) two

> Task :sdks:java:io:hadoop-format:runHadoopFormatIO292ElasticIT
> Task :sdks:java:io:hadoop-format:runHadoopFormatIO292IT
> Task :runners:spark:2:hadoopVersionsTest
> Task :sdks:java:io:hadoop-format:runHadoopFormatIO292Test
> Task :sdks:java:io:hadoop-format:runHadoopFormatIO321ElasticIT
> Task :sdks:java:io:hadoop-format:runHadoopFormatIO321IT
> Task :sdks:java:io:hadoop-format:runHadoopFormatIO321Test
> Task :sdks:java:io:hadoop-format:hadoopVersionsTest

FAILURE: Build completed with 3 failures.

1: Task failed with an exception.
-----------
* What went wrong:
Execution failed for task ':sdks:java:io:hadoop-file-system:hadoopVersion285Test'.
> There were failing tests. See the report at: file://<https://ci-beam.apache.org/job/beam_PostCommit_Java_Hadoop_Versions/ws/src/sdks/java/io/hadoop-file-system/build/reports/tests/hadoopVersion285Test/index.html>

* Try:
> Run with --stacktrace option to get the stack trace.
> Run with --info or --debug option to get more log output.
> Run with --scan to get full insights.
==============================================================================

2: Task failed with an exception.
-----------
* What went wrong:
Execution failed for task ':sdks:java:io:hadoop-file-system:hadoopVersion292Test'.
> There were failing tests. See the report at: file://<https://ci-beam.apache.org/job/beam_PostCommit_Java_Hadoop_Versions/ws/src/sdks/java/io/hadoop-file-system/build/reports/tests/hadoopVersion292Test/index.html>

* Try:
> Run with --stacktrace option to get the stack trace.
> Run with --info or --debug option to get more log output.
> Run with --scan to get full insights.
==============================================================================

3: Task failed with an exception.
-----------
* What went wrong:
Execution failed for task ':sdks:java:io:hadoop-file-system:hadoopVersion321Test'.
> There were failing tests. See the report at: file://<https://ci-beam.apache.org/job/beam_PostCommit_Java_Hadoop_Versions/ws/src/sdks/java/io/hadoop-file-system/build/reports/tests/hadoopVersion321Test/index.html>

* Try:
> Run with --stacktrace option to get the stack trace.
> Run with --info or --debug option to get more log output.
> Run with --scan to get full insights.
==============================================================================

* Get more help at https://help.gradle.org

BUILD FAILED in 40m 32s
180 actionable tasks: 146 executed, 32 from cache, 2 up-to-date

Publishing build scan...
https://gradle.com/s/5nkadguapxs4o

Build step 'Invoke Gradle script' changed build result to FAILURE
Build step 'Invoke Gradle script' marked build as failure

---------------------------------------------------------------------
To unsubscribe, e-mail: builds-unsubscribe@beam.apache.org
For additional commands, e-mail: builds-help@beam.apache.org


Jenkins build is back to normal : beam_PostCommit_Java_Hadoop_Versions #1273

Posted by Apache Jenkins Server <je...@builds.apache.org>.
See <https://ci-beam.apache.org/job/beam_PostCommit_Java_Hadoop_Versions/1273/display/redirect?page=changes>


---------------------------------------------------------------------
To unsubscribe, e-mail: builds-unsubscribe@beam.apache.org
For additional commands, e-mail: builds-help@beam.apache.org


Build failed in Jenkins: beam_PostCommit_Java_Hadoop_Versions #1271

Posted by Apache Jenkins Server <je...@builds.apache.org>.
See <https://ci-beam.apache.org/job/beam_PostCommit_Java_Hadoop_Versions/1271/display/redirect>

Changes:


------------------------------------------
[...truncated 74.09 KB...]
> Task :sdks:java:io:hcatalog:hadoopVersion285Test
> Task :sdks:java:io:hadoop-format:runHadoopFormatIO2101IT
> Task :sdks:java:extensions:sorter:hadoopVersion321Test

> Task :sdks:java:io:hadoop-file-system:hadoopVersion292Test

org.apache.beam.sdk.io.hdfs.HadoopFileSystemTest > testRenameRetryScenario FAILED
    java.lang.NoSuchMethodError at HadoopFileSystemTest.java:85
    java.lang.NullPointerException at HadoopFileSystemTest.java:93

org.apache.beam.sdk.io.hdfs.HadoopFileSystemTest > testRenameMissingTargetDir FAILED
    java.lang.NoSuchMethodError at HadoopFileSystemTest.java:85
    java.lang.NullPointerException at HadoopFileSystemTest.java:93

org.apache.beam.sdk.io.hdfs.HadoopFileSystemTest > testCreateAndReadFileWithShift FAILED
    java.lang.NoSuchMethodError at HadoopFileSystemTest.java:85
    java.lang.NullPointerException at HadoopFileSystemTest.java:93

org.apache.beam.sdk.io.hdfs.HadoopFileSystemTest > testCreateAndReadFileWithShiftToEnd FAILED
    java.lang.NoSuchMethodError at HadoopFileSystemTest.java:85
    java.lang.NullPointerException at HadoopFileSystemTest.java:93

org.apache.beam.sdk.io.hdfs.HadoopFileSystemTest > testCopySourceMissing FAILED
    java.lang.NoSuchMethodError at HadoopFileSystemTest.java:85
    java.lang.NullPointerException at HadoopFileSystemTest.java:93

org.apache.beam.sdk.io.hdfs.HadoopFileSystemTest > testRenameMissingSource FAILED
    java.lang.NoSuchMethodError at HadoopFileSystemTest.java:85
    java.lang.NullPointerException at HadoopFileSystemTest.java:93

org.apache.beam.sdk.io.hdfs.HadoopFileSystemTest > testMatchNewResource FAILED
    java.lang.NoSuchMethodError at HadoopFileSystemTest.java:85
    java.lang.NullPointerException at HadoopFileSystemTest.java:93

org.apache.beam.sdk.io.hdfs.HadoopFileSystemTest > testMatchForRecursiveGlob FAILED
    java.lang.NoSuchMethodError at HadoopFileSystemTest.java:85
    java.lang.NullPointerException at HadoopFileSystemTest.java:93

org.apache.beam.sdk.io.hdfs.HadoopFileSystemTest > testDelete FAILED
    java.lang.NoSuchMethodError at HadoopFileSystemTest.java:85
    java.lang.NullPointerException at HadoopFileSystemTest.java:93

> Task :runners:spark:2:hadoopVersion285Test

> Task :sdks:java:io:hadoop-file-system:hadoopVersion292Test FAILED

org.apache.beam.sdk.io.hdfs.HadoopFileSystemTest > testRename FAILED
    java.lang.NoSuchMethodError at HadoopFileSystemTest.java:85
    java.lang.NullPointerException at HadoopFileSystemTest.java:93

org.apache.beam.sdk.io.hdfs.HadoopResourceIdTest > testGetFilename FAILED
    java.lang.NoSuchMethodError at HadoopResourceIdTest.java:50
    java.lang.NullPointerException at HadoopResourceIdTest.java:61

org.apache.beam.sdk.io.hdfs.HadoopResourceIdTest > testResourceIdTester FAILED
    java.lang.NoSuchMethodError at HadoopResourceIdTest.java:50
    java.lang.NullPointerException at HadoopResourceIdTest.java:61

34 tests completed, 20 failed, 1 skipped

> Task :sdks:java:io:hadoop-file-system:hadoopVersion321Test

org.apache.beam.sdk.io.hdfs.HadoopFileSystemRegistrarTest > testServiceLoader FAILED
    java.lang.NoClassDefFoundError at HadoopFileSystemRegistrarTest.java:55
        Caused by: java.lang.ClassNotFoundException at HadoopFileSystemRegistrarTest.java:55
    java.lang.NullPointerException at HadoopFileSystemRegistrarTest.java:61

org.apache.beam.sdk.io.hdfs.HadoopFileSystemTest > testDeleteNonExisting FAILED
    java.lang.NoClassDefFoundError at HadoopFileSystemTest.java:85
        Caused by: java.lang.ClassNotFoundException at HadoopFileSystemTest.java:85
    java.lang.NullPointerException at HadoopFileSystemTest.java:93

org.apache.beam.sdk.io.hdfs.HadoopFileSystemTest > testRenameExistingDestination FAILED
    java.lang.NoClassDefFoundError at HadoopFileSystemTest.java:85
        Caused by: java.lang.ClassNotFoundException at HadoopFileSystemTest.java:85
    java.lang.NullPointerException at HadoopFileSystemTest.java:93

org.apache.beam.sdk.io.hdfs.HadoopFileSystemTest > testMatch FAILED
    java.lang.NoClassDefFoundError at HadoopFileSystemTest.java:85
        Caused by: java.lang.ClassNotFoundException at HadoopFileSystemTest.java:85
    java.lang.NullPointerException at HadoopFileSystemTest.java:93

org.apache.beam.sdk.io.hdfs.HadoopFileSystemTest > testCopy FAILED
    java.lang.NoClassDefFoundError at HadoopFileSystemTest.java:85
        Caused by: java.lang.ClassNotFoundException at HadoopFileSystemTest.java:85
    java.lang.NullPointerException at HadoopFileSystemTest.java:93

org.apache.beam.sdk.io.hdfs.HadoopFileSystemTest > testMatchForNonExistentFile FAILED
    java.lang.NoClassDefFoundError at HadoopFileSystemTest.java:85
        Caused by: java.lang.ClassNotFoundException at HadoopFileSystemTest.java:85
    java.lang.NullPointerException at HadoopFileSystemTest.java:93

org.apache.beam.sdk.io.hdfs.HadoopFileSystemTest > testCreateAndReadFile FAILED
    java.lang.NoClassDefFoundError at HadoopFileSystemTest.java:85
        Caused by: java.lang.ClassNotFoundException at HadoopFileSystemTest.java:85
    java.lang.NullPointerException at HadoopFileSystemTest.java:93

org.apache.beam.sdk.io.hdfs.HadoopFileSystemTest > testMatchDirectory FAILED
    java.lang.NoClassDefFoundError at HadoopFileSystemTest.java:85
        Caused by: java.lang.ClassNotFoundException at HadoopFileSystemTest.java:85
    java.lang.NullPointerException at HadoopFileSystemTest.java:93

org.apache.beam.sdk.io.hdfs.HadoopFileSystemTest > testRenameRetryScenario FAILED
    java.lang.NoClassDefFoundError at HadoopFileSystemTest.java:85
        Caused by: java.lang.ClassNotFoundException at HadoopFileSystemTest.java:85
    java.lang.NullPointerException at HadoopFileSystemTest.java:93

org.apache.beam.sdk.io.hdfs.HadoopFileSystemTest > testRenameMissingTargetDir FAILED
    java.lang.NoClassDefFoundError at HadoopFileSystemTest.java:85
        Caused by: java.lang.ClassNotFoundException at HadoopFileSystemTest.java:85
    java.lang.NullPointerException at HadoopFileSystemTest.java:93

org.apache.beam.sdk.io.hdfs.HadoopFileSystemTest > testCreateAndReadFileWithShift FAILED
    java.lang.NoClassDefFoundError at HadoopFileSystemTest.java:85
        Caused by: java.lang.ClassNotFoundException at HadoopFileSystemTest.java:85
    java.lang.NullPointerException at HadoopFileSystemTest.java:93

org.apache.beam.sdk.io.hdfs.HadoopFileSystemTest > testCreateAndReadFileWithShiftToEnd FAILED
    java.lang.NoClassDefFoundError at HadoopFileSystemTest.java:85
        Caused by: java.lang.ClassNotFoundException at HadoopFileSystemTest.java:85
    java.lang.NullPointerException at HadoopFileSystemTest.java:93

org.apache.beam.sdk.io.hdfs.HadoopFileSystemTest > testCopySourceMissing FAILED
    java.lang.NoClassDefFoundError at HadoopFileSystemTest.java:85
        Caused by: java.lang.ClassNotFoundException at HadoopFileSystemTest.java:85
    java.lang.NullPointerException at HadoopFileSystemTest.java:93

org.apache.beam.sdk.io.hdfs.HadoopFileSystemTest > testRenameMissingSource FAILED
    java.lang.NoClassDefFoundError at HadoopFileSystemTest.java:85
        Caused by: java.lang.ClassNotFoundException at HadoopFileSystemTest.java:85
    java.lang.NullPointerException at HadoopFileSystemTest.java:93

org.apache.beam.sdk.io.hdfs.HadoopFileSystemTest > testMatchNewResource FAILED
    java.lang.NoClassDefFoundError at HadoopFileSystemTest.java:85
        Caused by: java.lang.ClassNotFoundException at HadoopFileSystemTest.java:85
    java.lang.NullPointerException at HadoopFileSystemTest.java:93

org.apache.beam.sdk.io.hdfs.HadoopFileSystemTest > testMatchForRecursiveGlob FAILED
    java.lang.NoClassDefFoundError at HadoopFileSystemTest.java:85
        Caused by: java.lang.ClassNotFoundException at HadoopFileSystemTest.java:85
    java.lang.NullPointerException at HadoopFileSystemTest.java:93

org.apache.beam.sdk.io.hdfs.HadoopFileSystemTest > testDelete FAILED
    java.lang.NoClassDefFoundError at HadoopFileSystemTest.java:85
        Caused by: java.lang.ClassNotFoundException at HadoopFileSystemTest.java:85
    java.lang.NullPointerException at HadoopFileSystemTest.java:93

org.apache.beam.sdk.io.hdfs.HadoopFileSystemTest > testRename FAILED
    java.lang.NoClassDefFoundError at HadoopFileSystemTest.java:85
        Caused by: java.lang.ClassNotFoundException at HadoopFileSystemTest.java:85
    java.lang.NullPointerException at HadoopFileSystemTest.java:93

org.apache.beam.sdk.io.hdfs.HadoopResourceIdTest > testGetFilename FAILED
    java.lang.NoClassDefFoundError at HadoopResourceIdTest.java:50
        Caused by: java.lang.ClassNotFoundException at HadoopResourceIdTest.java:50
    java.lang.NullPointerException at HadoopResourceIdTest.java:61

org.apache.beam.sdk.io.hdfs.HadoopResourceIdTest > testResourceIdTester FAILED
    java.lang.NoClassDefFoundError at HadoopResourceIdTest.java:50
        Caused by: java.lang.ClassNotFoundException at HadoopResourceIdTest.java:50
    java.lang.NullPointerException at HadoopResourceIdTest.java:61

34 tests completed, 20 failed, 1 skipped

> Task :sdks:java:io:hadoop-file-system:hadoopVersion321Test FAILED

> Task :runners:spark:2:hadoopVersion285Test
testBatchPipelineCanceledState(isStreaming=false) one
testBatchPipelineCanceledState(isStreaming=false) two
testBatchPipelineTimeoutState(isStreaming=false) two
testBatchPipelineTimeoutState(isStreaming=false) one

> Task :sdks:java:extensions:sorter:hadoopVersionsTest
> Task :sdks:java:io:parquet:hadoopVersion292Test
> Task :sdks:java:io:hadoop-format:runHadoopFormatIO2101Test
> Task :sdks:java:io:hcatalog:hadoopVersion292Test
> Task :sdks:java:io:parquet:hadoopVersion321Test
> Task :runners:spark:2:hadoopVersion292Test
testBatchPipelineCanceledState(isStreaming=false) two
testBatchPipelineCanceledState(isStreaming=false) one
testBatchPipelineTimeoutState(isStreaming=false) two
testBatchPipelineTimeoutState(isStreaming=false) one

> Task :sdks:java:io:parquet:hadoopVersionsTest
> Task :sdks:java:io:hcatalog:hadoopVersionsTest
> Task :sdks:java:io:hadoop-format:runHadoopFormatIO285ElasticIT
> Task :sdks:java:io:hadoop-format:runHadoopFormatIO285IT

> Task :runners:spark:2:hadoopVersion321Test
testBatchPipelineCanceledState(isStreaming=false) one

> Task :sdks:java:io:hadoop-format:runHadoopFormatIO285Test
> Task :runners:spark:2:hadoopVersionsTest
> Task :sdks:java:io:hadoop-format:runHadoopFormatIO292ElasticIT
> Task :sdks:java:io:hadoop-format:runHadoopFormatIO292IT
> Task :sdks:java:io:hadoop-format:runHadoopFormatIO292Test
> Task :sdks:java:io:hadoop-format:runHadoopFormatIO321ElasticIT
> Task :sdks:java:io:hadoop-format:runHadoopFormatIO321IT
> Task :sdks:java:io:hadoop-format:runHadoopFormatIO321Test
> Task :sdks:java:io:hadoop-format:hadoopVersionsTest

FAILURE: Build completed with 3 failures.

1: Task failed with an exception.
-----------
* What went wrong:
Execution failed for task ':sdks:java:io:hadoop-file-system:hadoopVersion285Test'.
> There were failing tests. See the report at: file://<https://ci-beam.apache.org/job/beam_PostCommit_Java_Hadoop_Versions/ws/src/sdks/java/io/hadoop-file-system/build/reports/tests/hadoopVersion285Test/index.html>

* Try:
> Run with --stacktrace option to get the stack trace.
> Run with --info or --debug option to get more log output.
> Run with --scan to get full insights.
==============================================================================

2: Task failed with an exception.
-----------
* What went wrong:
Execution failed for task ':sdks:java:io:hadoop-file-system:hadoopVersion292Test'.
> There were failing tests. See the report at: file://<https://ci-beam.apache.org/job/beam_PostCommit_Java_Hadoop_Versions/ws/src/sdks/java/io/hadoop-file-system/build/reports/tests/hadoopVersion292Test/index.html>

* Try:
> Run with --stacktrace option to get the stack trace.
> Run with --info or --debug option to get more log output.
> Run with --scan to get full insights.
==============================================================================

3: Task failed with an exception.
-----------
* What went wrong:
Execution failed for task ':sdks:java:io:hadoop-file-system:hadoopVersion321Test'.
> There were failing tests. See the report at: file://<https://ci-beam.apache.org/job/beam_PostCommit_Java_Hadoop_Versions/ws/src/sdks/java/io/hadoop-file-system/build/reports/tests/hadoopVersion321Test/index.html>

* Try:
> Run with --stacktrace option to get the stack trace.
> Run with --info or --debug option to get more log output.
> Run with --scan to get full insights.
==============================================================================

* Get more help at https://help.gradle.org

BUILD FAILED in 16m 26s
180 actionable tasks: 131 executed, 47 from cache, 2 up-to-date

Publishing build scan...
https://gradle.com/s/cemht5pve5sqa

Build step 'Invoke Gradle script' changed build result to FAILURE
Build step 'Invoke Gradle script' marked build as failure

---------------------------------------------------------------------
To unsubscribe, e-mail: builds-unsubscribe@beam.apache.org
For additional commands, e-mail: builds-help@beam.apache.org


Build failed in Jenkins: beam_PostCommit_Java_Hadoop_Versions #1270

Posted by Apache Jenkins Server <je...@builds.apache.org>.
See <https://ci-beam.apache.org/job/beam_PostCommit_Java_Hadoop_Versions/1270/display/redirect?page=changes>

Changes:

[Kenneth Knowles] Add test for processing time continuation trigger


------------------------------------------
[...truncated 75.74 KB...]
    java.lang.NoSuchMethodError at HadoopFileSystemTest.java:85
    java.lang.NullPointerException at HadoopFileSystemTest.java:93

org.apache.beam.sdk.io.hdfs.HadoopFileSystemTest > testCreateAndReadFile FAILED
    java.lang.NoSuchMethodError at HadoopFileSystemTest.java:85
    java.lang.NullPointerException at HadoopFileSystemTest.java:93

org.apache.beam.sdk.io.hdfs.HadoopFileSystemTest > testMatchDirectory FAILED
    java.lang.NoSuchMethodError at HadoopFileSystemTest.java:85
    java.lang.NullPointerException at HadoopFileSystemTest.java:93

org.apache.beam.sdk.io.hdfs.HadoopFileSystemTest > testRenameRetryScenario FAILED
    java.lang.NoSuchMethodError at HadoopFileSystemTest.java:85
    java.lang.NullPointerException at HadoopFileSystemTest.java:93

> Task :sdks:java:extensions:sorter:hadoopVersionsTest

> Task :sdks:java:io:hadoop-file-system:hadoopVersion292Test

org.apache.beam.sdk.io.hdfs.HadoopFileSystemTest > testRenameMissingTargetDir FAILED
    java.lang.NoSuchMethodError at HadoopFileSystemTest.java:85
    java.lang.NullPointerException at HadoopFileSystemTest.java:93

org.apache.beam.sdk.io.hdfs.HadoopFileSystemTest > testCreateAndReadFileWithShift FAILED
    java.lang.NoSuchMethodError at HadoopFileSystemTest.java:85
    java.lang.NullPointerException at HadoopFileSystemTest.java:93

org.apache.beam.sdk.io.hdfs.HadoopFileSystemTest > testCreateAndReadFileWithShiftToEnd FAILED
    java.lang.NoSuchMethodError at HadoopFileSystemTest.java:85
    java.lang.NullPointerException at HadoopFileSystemTest.java:93

org.apache.beam.sdk.io.hdfs.HadoopFileSystemTest > testCopySourceMissing FAILED
    java.lang.NoSuchMethodError at HadoopFileSystemTest.java:85
    java.lang.NullPointerException at HadoopFileSystemTest.java:93

org.apache.beam.sdk.io.hdfs.HadoopFileSystemTest > testRenameMissingSource FAILED
    java.lang.NoSuchMethodError at HadoopFileSystemTest.java:85
    java.lang.NullPointerException at HadoopFileSystemTest.java:93

org.apache.beam.sdk.io.hdfs.HadoopFileSystemTest > testMatchNewResource FAILED
    java.lang.NoSuchMethodError at HadoopFileSystemTest.java:85
    java.lang.NullPointerException at HadoopFileSystemTest.java:93

org.apache.beam.sdk.io.hdfs.HadoopFileSystemTest > testMatchForRecursiveGlob FAILED
    java.lang.NoSuchMethodError at HadoopFileSystemTest.java:85
    java.lang.NullPointerException at HadoopFileSystemTest.java:93

org.apache.beam.sdk.io.hdfs.HadoopFileSystemTest > testDelete FAILED
    java.lang.NoSuchMethodError at HadoopFileSystemTest.java:85
    java.lang.NullPointerException at HadoopFileSystemTest.java:93

org.apache.beam.sdk.io.hdfs.HadoopFileSystemTest > testRename FAILED
    java.lang.NoSuchMethodError at HadoopFileSystemTest.java:85
    java.lang.NullPointerException at HadoopFileSystemTest.java:93

org.apache.beam.sdk.io.hdfs.HadoopResourceIdTest > testGetFilename FAILED
    java.lang.NoSuchMethodError at HadoopResourceIdTest.java:50
    java.lang.NullPointerException at HadoopResourceIdTest.java:61

org.apache.beam.sdk.io.hdfs.HadoopResourceIdTest > testResourceIdTester FAILED
    java.lang.NoSuchMethodError at HadoopResourceIdTest.java:50
    java.lang.NullPointerException at HadoopResourceIdTest.java:61

34 tests completed, 20 failed, 1 skipped

> Task :sdks:java:io:hadoop-file-system:hadoopVersion292Test FAILED
> Task :sdks:java:io:hadoop-format:runHadoopFormatIO2101Test

> Task :sdks:java:io:hadoop-file-system:hadoopVersion321Test FAILED

org.apache.beam.sdk.io.hdfs.HadoopFileSystemRegistrarTest > testServiceLoader FAILED
    java.lang.NoClassDefFoundError at HadoopFileSystemRegistrarTest.java:55
        Caused by: java.lang.ClassNotFoundException at HadoopFileSystemRegistrarTest.java:55
    java.lang.NullPointerException at HadoopFileSystemRegistrarTest.java:61

org.apache.beam.sdk.io.hdfs.HadoopFileSystemTest > testDeleteNonExisting FAILED
    java.lang.NoClassDefFoundError at HadoopFileSystemTest.java:85
        Caused by: java.lang.ClassNotFoundException at HadoopFileSystemTest.java:85
    java.lang.NullPointerException at HadoopFileSystemTest.java:93

org.apache.beam.sdk.io.hdfs.HadoopFileSystemTest > testRenameExistingDestination FAILED
    java.lang.NoClassDefFoundError at HadoopFileSystemTest.java:85
        Caused by: java.lang.ClassNotFoundException at HadoopFileSystemTest.java:85
    java.lang.NullPointerException at HadoopFileSystemTest.java:93

org.apache.beam.sdk.io.hdfs.HadoopFileSystemTest > testMatch FAILED
    java.lang.NoClassDefFoundError at HadoopFileSystemTest.java:85
        Caused by: java.lang.ClassNotFoundException at HadoopFileSystemTest.java:85
    java.lang.NullPointerException at HadoopFileSystemTest.java:93

org.apache.beam.sdk.io.hdfs.HadoopFileSystemTest > testCopy FAILED
    java.lang.NoClassDefFoundError at HadoopFileSystemTest.java:85
        Caused by: java.lang.ClassNotFoundException at HadoopFileSystemTest.java:85
    java.lang.NullPointerException at HadoopFileSystemTest.java:93

org.apache.beam.sdk.io.hdfs.HadoopFileSystemTest > testMatchForNonExistentFile FAILED
    java.lang.NoClassDefFoundError at HadoopFileSystemTest.java:85
        Caused by: java.lang.ClassNotFoundException at HadoopFileSystemTest.java:85
    java.lang.NullPointerException at HadoopFileSystemTest.java:93

org.apache.beam.sdk.io.hdfs.HadoopFileSystemTest > testCreateAndReadFile FAILED
    java.lang.NoClassDefFoundError at HadoopFileSystemTest.java:85
        Caused by: java.lang.ClassNotFoundException at HadoopFileSystemTest.java:85
    java.lang.NullPointerException at HadoopFileSystemTest.java:93

org.apache.beam.sdk.io.hdfs.HadoopFileSystemTest > testMatchDirectory FAILED
    java.lang.NoClassDefFoundError at HadoopFileSystemTest.java:85
        Caused by: java.lang.ClassNotFoundException at HadoopFileSystemTest.java:85
    java.lang.NullPointerException at HadoopFileSystemTest.java:93

org.apache.beam.sdk.io.hdfs.HadoopFileSystemTest > testRenameRetryScenario FAILED
    java.lang.NoClassDefFoundError at HadoopFileSystemTest.java:85
        Caused by: java.lang.ClassNotFoundException at HadoopFileSystemTest.java:85
    java.lang.NullPointerException at HadoopFileSystemTest.java:93

org.apache.beam.sdk.io.hdfs.HadoopFileSystemTest > testRenameMissingTargetDir FAILED
    java.lang.NoClassDefFoundError at HadoopFileSystemTest.java:85
        Caused by: java.lang.ClassNotFoundException at HadoopFileSystemTest.java:85
    java.lang.NullPointerException at HadoopFileSystemTest.java:93

org.apache.beam.sdk.io.hdfs.HadoopFileSystemTest > testCreateAndReadFileWithShift FAILED
    java.lang.NoClassDefFoundError at HadoopFileSystemTest.java:85
        Caused by: java.lang.ClassNotFoundException at HadoopFileSystemTest.java:85
    java.lang.NullPointerException at HadoopFileSystemTest.java:93

org.apache.beam.sdk.io.hdfs.HadoopFileSystemTest > testCreateAndReadFileWithShiftToEnd FAILED
    java.lang.NoClassDefFoundError at HadoopFileSystemTest.java:85
        Caused by: java.lang.ClassNotFoundException at HadoopFileSystemTest.java:85
    java.lang.NullPointerException at HadoopFileSystemTest.java:93

org.apache.beam.sdk.io.hdfs.HadoopFileSystemTest > testCopySourceMissing FAILED
    java.lang.NoClassDefFoundError at HadoopFileSystemTest.java:85
        Caused by: java.lang.ClassNotFoundException at HadoopFileSystemTest.java:85
    java.lang.NullPointerException at HadoopFileSystemTest.java:93

org.apache.beam.sdk.io.hdfs.HadoopFileSystemTest > testRenameMissingSource FAILED
    java.lang.NoClassDefFoundError at HadoopFileSystemTest.java:85
        Caused by: java.lang.ClassNotFoundException at HadoopFileSystemTest.java:85
    java.lang.NullPointerException at HadoopFileSystemTest.java:93

org.apache.beam.sdk.io.hdfs.HadoopFileSystemTest > testMatchNewResource FAILED
    java.lang.NoClassDefFoundError at HadoopFileSystemTest.java:85
        Caused by: java.lang.ClassNotFoundException at HadoopFileSystemTest.java:85
    java.lang.NullPointerException at HadoopFileSystemTest.java:93

org.apache.beam.sdk.io.hdfs.HadoopFileSystemTest > testMatchForRecursiveGlob FAILED
    java.lang.NoClassDefFoundError at HadoopFileSystemTest.java:85
        Caused by: java.lang.ClassNotFoundException at HadoopFileSystemTest.java:85
    java.lang.NullPointerException at HadoopFileSystemTest.java:93

org.apache.beam.sdk.io.hdfs.HadoopFileSystemTest > testDelete FAILED
    java.lang.NoClassDefFoundError at HadoopFileSystemTest.java:85
        Caused by: java.lang.ClassNotFoundException at HadoopFileSystemTest.java:85
    java.lang.NullPointerException at HadoopFileSystemTest.java:93

org.apache.beam.sdk.io.hdfs.HadoopFileSystemTest > testRename FAILED
    java.lang.NoClassDefFoundError at HadoopFileSystemTest.java:85
        Caused by: java.lang.ClassNotFoundException at HadoopFileSystemTest.java:85
    java.lang.NullPointerException at HadoopFileSystemTest.java:93

org.apache.beam.sdk.io.hdfs.HadoopResourceIdTest > testGetFilename FAILED
    java.lang.NoClassDefFoundError at HadoopResourceIdTest.java:50
        Caused by: java.lang.ClassNotFoundException at HadoopResourceIdTest.java:50
    java.lang.NullPointerException at HadoopResourceIdTest.java:61

org.apache.beam.sdk.io.hdfs.HadoopResourceIdTest > testResourceIdTester FAILED
    java.lang.NoClassDefFoundError at HadoopResourceIdTest.java:50
        Caused by: java.lang.ClassNotFoundException at HadoopResourceIdTest.java:50
    java.lang.NullPointerException at HadoopResourceIdTest.java:61

34 tests completed, 20 failed, 1 skipped

> Task :sdks:java:io:parquet:hadoopVersion292Test
> Task :runners:spark:2:hadoopVersion285Test
> Task :sdks:java:io:hcatalog:hadoopVersion292Test

> Task :runners:spark:2:hadoopVersion285Test
testBatchPipelineCanceledState(isStreaming=false) one
testBatchPipelineTimeoutState(isStreaming=false) two
testBatchPipelineTimeoutState(isStreaming=false) one

> Task :sdks:java:io:parquet:hadoopVersion321Test
> Task :sdks:java:io:hcatalog:hadoopVersionsTest
> Task :sdks:java:io:parquet:hadoopVersionsTest
> Task :runners:spark:2:hadoopVersion292Test
> Task :sdks:java:io:hadoop-format:runHadoopFormatIO285ElasticIT
> Task :sdks:java:io:hadoop-format:runHadoopFormatIO285IT
> Task :sdks:java:io:hadoop-format:runHadoopFormatIO285Test
> Task :runners:spark:2:hadoopVersion321Test
testBatchPipelineTimeoutState(isStreaming=false) one
testBatchPipelineTimeoutState(isStreaming=false) two

> Task :sdks:java:io:hadoop-format:runHadoopFormatIO292ElasticIT
> Task :sdks:java:io:hadoop-format:runHadoopFormatIO292IT
> Task :runners:spark:2:hadoopVersionsTest
> Task :sdks:java:io:hadoop-format:runHadoopFormatIO292Test
> Task :sdks:java:io:hadoop-format:runHadoopFormatIO321ElasticIT
> Task :sdks:java:io:hadoop-format:runHadoopFormatIO321IT
> Task :sdks:java:io:hadoop-format:runHadoopFormatIO321Test
> Task :sdks:java:io:hadoop-format:hadoopVersionsTest

FAILURE: Build completed with 3 failures.

1: Task failed with an exception.
-----------
* What went wrong:
Execution failed for task ':sdks:java:io:hadoop-file-system:hadoopVersion285Test'.
> There were failing tests. See the report at: file://<https://ci-beam.apache.org/job/beam_PostCommit_Java_Hadoop_Versions/ws/src/sdks/java/io/hadoop-file-system/build/reports/tests/hadoopVersion285Test/index.html>

* Try:
> Run with --stacktrace option to get the stack trace.
> Run with --info or --debug option to get more log output.
> Run with --scan to get full insights.
==============================================================================

2: Task failed with an exception.
-----------
* What went wrong:
Execution failed for task ':sdks:java:io:hadoop-file-system:hadoopVersion292Test'.
> There were failing tests. See the report at: file://<https://ci-beam.apache.org/job/beam_PostCommit_Java_Hadoop_Versions/ws/src/sdks/java/io/hadoop-file-system/build/reports/tests/hadoopVersion292Test/index.html>

* Try:
> Run with --stacktrace option to get the stack trace.
> Run with --info or --debug option to get more log output.
> Run with --scan to get full insights.
==============================================================================

3: Task failed with an exception.
-----------
* What went wrong:
Execution failed for task ':sdks:java:io:hadoop-file-system:hadoopVersion321Test'.
> There were failing tests. See the report at: file://<https://ci-beam.apache.org/job/beam_PostCommit_Java_Hadoop_Versions/ws/src/sdks/java/io/hadoop-file-system/build/reports/tests/hadoopVersion321Test/index.html>

* Try:
> Run with --stacktrace option to get the stack trace.
> Run with --info or --debug option to get more log output.
> Run with --scan to get full insights.
==============================================================================

* Get more help at https://help.gradle.org

BUILD FAILED in 29m 48s
180 actionable tasks: 136 executed, 42 from cache, 2 up-to-date

Publishing build scan...
https://gradle.com/s/53mft64qhdc5y

Build step 'Invoke Gradle script' changed build result to FAILURE
Build step 'Invoke Gradle script' marked build as failure

---------------------------------------------------------------------
To unsubscribe, e-mail: builds-unsubscribe@beam.apache.org
For additional commands, e-mail: builds-help@beam.apache.org


Build failed in Jenkins: beam_PostCommit_Java_Hadoop_Versions #1269

Posted by Apache Jenkins Server <je...@builds.apache.org>.
See <https://ci-beam.apache.org/job/beam_PostCommit_Java_Hadoop_Versions/1269/display/redirect?page=changes>

Changes:

[Kyle Weaver] [BEAM-12712] Spark: Exclude looping timer tests.

[Kyle Weaver] [BEAM-13919] Annotate PerKeyOrderingTest with UsesStatefulParDo.

[artur.khanin] Updated example link

[noreply] [BEAM-13894] Unit test utilities in the ptest package (#16830)

[noreply] [BEAM-13922] [Coverage] Make boot.go more testable and add tests

[noreply] Exclude SpannerChangeStream IT from Dataflow V1 postcommit (#16851)

[noreply] [BEAM-13930] Address StateSpec consistency issue between Runner and Fn


------------------------------------------
[...truncated 77.38 KB...]

org.apache.beam.sdk.io.hdfs.HadoopFileSystemTest > testMatchNewResource FAILED
    java.lang.NoSuchMethodError at HadoopFileSystemTest.java:85
    java.lang.NullPointerException at HadoopFileSystemTest.java:93

org.apache.beam.sdk.io.hdfs.HadoopFileSystemTest > testMatchForRecursiveGlob FAILED
    java.lang.NoSuchMethodError at HadoopFileSystemTest.java:85
    java.lang.NullPointerException at HadoopFileSystemTest.java:93

org.apache.beam.sdk.io.hdfs.HadoopFileSystemTest > testDelete FAILED
    java.lang.NoSuchMethodError at HadoopFileSystemTest.java:85
    java.lang.NullPointerException at HadoopFileSystemTest.java:93

org.apache.beam.sdk.io.hdfs.HadoopFileSystemTest > testRename FAILED
    java.lang.NoSuchMethodError at HadoopFileSystemTest.java:85
    java.lang.NullPointerException at HadoopFileSystemTest.java:93

org.apache.beam.sdk.io.hdfs.HadoopResourceIdTest > testGetFilename FAILED
    java.lang.NoSuchMethodError at HadoopResourceIdTest.java:50
    java.lang.NullPointerException at HadoopResourceIdTest.java:61

> Task :sdks:java:extensions:sorter:hadoopVersion321Test
> Task :sdks:java:io:hcatalog:hadoopVersion285Test

> Task :sdks:java:io:hadoop-file-system:hadoopVersion292Test FAILED

org.apache.beam.sdk.io.hdfs.HadoopResourceIdTest > testResourceIdTester FAILED
    java.lang.NoSuchMethodError at HadoopResourceIdTest.java:50
    java.lang.NullPointerException at HadoopResourceIdTest.java:61

34 tests completed, 20 failed, 1 skipped

> Task :sdks:java:io:hadoop-file-system:hadoopVersion321Test

org.apache.beam.sdk.io.hdfs.HadoopFileSystemRegistrarTest > testServiceLoader FAILED
    java.lang.NoClassDefFoundError at HadoopFileSystemRegistrarTest.java:55
        Caused by: java.lang.ClassNotFoundException at HadoopFileSystemRegistrarTest.java:55
    java.lang.NullPointerException at HadoopFileSystemRegistrarTest.java:61

org.apache.beam.sdk.io.hdfs.HadoopFileSystemTest > testDeleteNonExisting FAILED
    java.lang.NoClassDefFoundError at HadoopFileSystemTest.java:85
        Caused by: java.lang.ClassNotFoundException at HadoopFileSystemTest.java:85
    java.lang.NullPointerException at HadoopFileSystemTest.java:93

org.apache.beam.sdk.io.hdfs.HadoopFileSystemTest > testRenameExistingDestination FAILED
    java.lang.NoClassDefFoundError at HadoopFileSystemTest.java:85
        Caused by: java.lang.ClassNotFoundException at HadoopFileSystemTest.java:85
    java.lang.NullPointerException at HadoopFileSystemTest.java:93

org.apache.beam.sdk.io.hdfs.HadoopFileSystemTest > testMatch FAILED
    java.lang.NoClassDefFoundError at HadoopFileSystemTest.java:85
        Caused by: java.lang.ClassNotFoundException at HadoopFileSystemTest.java:85
    java.lang.NullPointerException at HadoopFileSystemTest.java:93

org.apache.beam.sdk.io.hdfs.HadoopFileSystemTest > testCopy FAILED
    java.lang.NoClassDefFoundError at HadoopFileSystemTest.java:85
        Caused by: java.lang.ClassNotFoundException at HadoopFileSystemTest.java:85
    java.lang.NullPointerException at HadoopFileSystemTest.java:93

org.apache.beam.sdk.io.hdfs.HadoopFileSystemTest > testMatchForNonExistentFile FAILED
    java.lang.NoClassDefFoundError at HadoopFileSystemTest.java:85
        Caused by: java.lang.ClassNotFoundException at HadoopFileSystemTest.java:85
    java.lang.NullPointerException at HadoopFileSystemTest.java:93

org.apache.beam.sdk.io.hdfs.HadoopFileSystemTest > testCreateAndReadFile FAILED
    java.lang.NoClassDefFoundError at HadoopFileSystemTest.java:85
        Caused by: java.lang.ClassNotFoundException at HadoopFileSystemTest.java:85
    java.lang.NullPointerException at HadoopFileSystemTest.java:93

org.apache.beam.sdk.io.hdfs.HadoopFileSystemTest > testMatchDirectory FAILED
    java.lang.NoClassDefFoundError at HadoopFileSystemTest.java:85
        Caused by: java.lang.ClassNotFoundException at HadoopFileSystemTest.java:85
    java.lang.NullPointerException at HadoopFileSystemTest.java:93

org.apache.beam.sdk.io.hdfs.HadoopFileSystemTest > testRenameRetryScenario FAILED
    java.lang.NoClassDefFoundError at HadoopFileSystemTest.java:85
        Caused by: java.lang.ClassNotFoundException at HadoopFileSystemTest.java:85
    java.lang.NullPointerException at HadoopFileSystemTest.java:93

org.apache.beam.sdk.io.hdfs.HadoopFileSystemTest > testRenameMissingTargetDir FAILED
    java.lang.NoClassDefFoundError at HadoopFileSystemTest.java:85
        Caused by: java.lang.ClassNotFoundException at HadoopFileSystemTest.java:85
    java.lang.NullPointerException at HadoopFileSystemTest.java:93

org.apache.beam.sdk.io.hdfs.HadoopFileSystemTest > testCreateAndReadFileWithShift FAILED
    java.lang.NoClassDefFoundError at HadoopFileSystemTest.java:85
        Caused by: java.lang.ClassNotFoundException at HadoopFileSystemTest.java:85
    java.lang.NullPointerException at HadoopFileSystemTest.java:93

org.apache.beam.sdk.io.hdfs.HadoopFileSystemTest > testCreateAndReadFileWithShiftToEnd FAILED
    java.lang.NoClassDefFoundError at HadoopFileSystemTest.java:85
        Caused by: java.lang.ClassNotFoundException at HadoopFileSystemTest.java:85
    java.lang.NullPointerException at HadoopFileSystemTest.java:93

org.apache.beam.sdk.io.hdfs.HadoopFileSystemTest > testCopySourceMissing FAILED
    java.lang.NoClassDefFoundError at HadoopFileSystemTest.java:85
        Caused by: java.lang.ClassNotFoundException at HadoopFileSystemTest.java:85
    java.lang.NullPointerException at HadoopFileSystemTest.java:93

org.apache.beam.sdk.io.hdfs.HadoopFileSystemTest > testRenameMissingSource FAILED
    java.lang.NoClassDefFoundError at HadoopFileSystemTest.java:85
        Caused by: java.lang.ClassNotFoundException at HadoopFileSystemTest.java:85
    java.lang.NullPointerException at HadoopFileSystemTest.java:93

org.apache.beam.sdk.io.hdfs.HadoopFileSystemTest > testMatchNewResource FAILED
    java.lang.NoClassDefFoundError at HadoopFileSystemTest.java:85
        Caused by: java.lang.ClassNotFoundException at HadoopFileSystemTest.java:85
    java.lang.NullPointerException at HadoopFileSystemTest.java:93

org.apache.beam.sdk.io.hdfs.HadoopFileSystemTest > testMatchForRecursiveGlob FAILED
    java.lang.NoClassDefFoundError at HadoopFileSystemTest.java:85
        Caused by: java.lang.ClassNotFoundException at HadoopFileSystemTest.java:85
    java.lang.NullPointerException at HadoopFileSystemTest.java:93

org.apache.beam.sdk.io.hdfs.HadoopFileSystemTest > testDelete FAILED
    java.lang.NoClassDefFoundError at HadoopFileSystemTest.java:85
        Caused by: java.lang.ClassNotFoundException at HadoopFileSystemTest.java:85
    java.lang.NullPointerException at HadoopFileSystemTest.java:93

org.apache.beam.sdk.io.hdfs.HadoopFileSystemTest > testRename FAILED
    java.lang.NoClassDefFoundError at HadoopFileSystemTest.java:85
        Caused by: java.lang.ClassNotFoundException at HadoopFileSystemTest.java:85
    java.lang.NullPointerException at HadoopFileSystemTest.java:93

org.apache.beam.sdk.io.hdfs.HadoopResourceIdTest > testGetFilename FAILED
    java.lang.NoClassDefFoundError at HadoopResourceIdTest.java:50
        Caused by: java.lang.ClassNotFoundException at HadoopResourceIdTest.java:50
    java.lang.NullPointerException at HadoopResourceIdTest.java:61

org.apache.beam.sdk.io.hdfs.HadoopResourceIdTest > testResourceIdTester FAILED
    java.lang.NoClassDefFoundError at HadoopResourceIdTest.java:50
        Caused by: java.lang.ClassNotFoundException at HadoopResourceIdTest.java:50
    java.lang.NullPointerException at HadoopResourceIdTest.java:61

34 tests completed, 20 failed, 1 skipped

> Task :sdks:java:io:hadoop-file-system:hadoopVersion321Test FAILED
> Task :sdks:java:extensions:sorter:hadoopVersionsTest

> Task :sdks:java:io:google-cloud-platform:compileJava
Note: Some input files use or override a deprecated API.
Note: Recompile with -Xlint:deprecation for details.
Note: Some input files use unchecked or unsafe operations.
Note: Recompile with -Xlint:unchecked for details.

> Task :sdks:java:io:google-cloud-platform:classes
> Task :sdks:java:io:google-cloud-platform:jar
> Task :sdks:java:io:parquet:hadoopVersion292Test
> Task :examples:java:compileJava
> Task :runners:spark:2:hadoopVersion285Test
testBatchPipelineTimeoutState(isStreaming=false) two
testBatchPipelineTimeoutState(isStreaming=false) one

> Task :examples:java:compileJava
Note: Some input files use or override a deprecated API.
Note: Recompile with -Xlint:deprecation for details.
Note: Some input files use unchecked or unsafe operations.
Note: Recompile with -Xlint:unchecked for details.

> Task :examples:java:classes
> Task :examples:java:jar

> Task :examples:java:compileTestJava
Note: Some input files use or override a deprecated API.
Note: Recompile with -Xlint:deprecation for details.
Note: Some input files use unchecked or unsafe operations.
Note: Recompile with -Xlint:unchecked for details.

> Task :examples:java:testClasses
> Task :examples:java:testJar
> Task :sdks:java:io:hcatalog:hadoopVersion292Test
> Task :sdks:java:io:parquet:hadoopVersion321Test

> Task :sdks:java:io:hadoop-format:compileTestJava
Note: Some input files use or override a deprecated API.
Note: Recompile with -Xlint:deprecation for details.

> Task :sdks:java:io:hadoop-format:testClasses
> Task :sdks:java:io:hadoop-format:runHadoopFormatIO2101ElasticIT
> Task :sdks:java:io:parquet:hadoopVersionsTest
> Task :sdks:java:io:hcatalog:hadoopVersionsTest
> Task :runners:spark:2:hadoopVersion292Test
> Task :sdks:java:io:hadoop-format:runHadoopFormatIO2101IT
> Task :sdks:java:io:hadoop-format:runHadoopFormatIO2101Test

> Task :runners:spark:2:hadoopVersion321Test
testBatchPipelineTimeoutState(isStreaming=false) one
testBatchPipelineTimeoutState(isStreaming=false) two

> Task :runners:spark:2:hadoopVersionsTest
> Task :sdks:java:io:hadoop-format:runHadoopFormatIO285ElasticIT
> Task :sdks:java:io:hadoop-format:runHadoopFormatIO285IT
> Task :sdks:java:io:hadoop-format:runHadoopFormatIO285Test
> Task :sdks:java:io:hadoop-format:runHadoopFormatIO292ElasticIT
> Task :sdks:java:io:hadoop-format:runHadoopFormatIO292IT
> Task :sdks:java:io:hadoop-format:runHadoopFormatIO292Test
> Task :sdks:java:io:hadoop-format:runHadoopFormatIO321ElasticIT
> Task :sdks:java:io:hadoop-format:runHadoopFormatIO321IT
> Task :sdks:java:io:hadoop-format:runHadoopFormatIO321Test
> Task :sdks:java:io:hadoop-format:hadoopVersionsTest

FAILURE: Build completed with 3 failures.

1: Task failed with an exception.
-----------
* What went wrong:
Execution failed for task ':sdks:java:io:hadoop-file-system:hadoopVersion285Test'.
> There were failing tests. See the report at: file://<https://ci-beam.apache.org/job/beam_PostCommit_Java_Hadoop_Versions/ws/src/sdks/java/io/hadoop-file-system/build/reports/tests/hadoopVersion285Test/index.html>

* Try:
> Run with --stacktrace option to get the stack trace.
> Run with --info or --debug option to get more log output.
> Run with --scan to get full insights.
==============================================================================

2: Task failed with an exception.
-----------
* What went wrong:
Execution failed for task ':sdks:java:io:hadoop-file-system:hadoopVersion292Test'.
> There were failing tests. See the report at: file://<https://ci-beam.apache.org/job/beam_PostCommit_Java_Hadoop_Versions/ws/src/sdks/java/io/hadoop-file-system/build/reports/tests/hadoopVersion292Test/index.html>

* Try:
> Run with --stacktrace option to get the stack trace.
> Run with --info or --debug option to get more log output.
> Run with --scan to get full insights.
==============================================================================

3: Task failed with an exception.
-----------
* What went wrong:
Execution failed for task ':sdks:java:io:hadoop-file-system:hadoopVersion321Test'.
> There were failing tests. See the report at: file://<https://ci-beam.apache.org/job/beam_PostCommit_Java_Hadoop_Versions/ws/src/sdks/java/io/hadoop-file-system/build/reports/tests/hadoopVersion321Test/index.html>

* Try:
> Run with --stacktrace option to get the stack trace.
> Run with --info or --debug option to get more log output.
> Run with --scan to get full insights.
==============================================================================

* Get more help at https://help.gradle.org

BUILD FAILED in 35m 38s
180 actionable tasks: 161 executed, 17 from cache, 2 up-to-date

Publishing build scan...
https://gradle.com/s/nxub3ggyximpc

Build step 'Invoke Gradle script' changed build result to FAILURE
Build step 'Invoke Gradle script' marked build as failure

---------------------------------------------------------------------
To unsubscribe, e-mail: builds-unsubscribe@beam.apache.org
For additional commands, e-mail: builds-help@beam.apache.org


Build failed in Jenkins: beam_PostCommit_Java_Hadoop_Versions #1268

Posted by Apache Jenkins Server <je...@builds.apache.org>.
See <https://ci-beam.apache.org/job/beam_PostCommit_Java_Hadoop_Versions/1268/display/redirect?page=changes>

Changes:

[noreply] Update 2.36.0 blog post to mention ARM64 support

[noreply] Minor: Disable checker framework in nightly snapshot (#16829)

[noreply] [BEAM-13860] Make `DoFn.infer_output_type` return element type (#16788)


------------------------------------------
[...truncated 73.07 KB...]
    java.lang.NoSuchMethodError at HadoopFileSystemRegistrarTest.java:55
    java.lang.NullPointerException at HadoopFileSystemRegistrarTest.java:61

org.apache.beam.sdk.io.hdfs.HadoopFileSystemTest > testDeleteNonExisting FAILED
    java.lang.NoSuchMethodError at HadoopFileSystemTest.java:85
    java.lang.NullPointerException at HadoopFileSystemTest.java:93

org.apache.beam.sdk.io.hdfs.HadoopFileSystemTest > testRenameExistingDestination FAILED
    java.lang.NoSuchMethodError at HadoopFileSystemTest.java:85
    java.lang.NullPointerException at HadoopFileSystemTest.java:93

org.apache.beam.sdk.io.hdfs.HadoopFileSystemTest > testMatch FAILED
    java.lang.NoSuchMethodError at HadoopFileSystemTest.java:85
    java.lang.NullPointerException at HadoopFileSystemTest.java:93

org.apache.beam.sdk.io.hdfs.HadoopFileSystemTest > testCopy FAILED
    java.lang.NoSuchMethodError at HadoopFileSystemTest.java:85
    java.lang.NullPointerException at HadoopFileSystemTest.java:93

org.apache.beam.sdk.io.hdfs.HadoopFileSystemTest > testMatchForNonExistentFile FAILED
    java.lang.NoSuchMethodError at HadoopFileSystemTest.java:85
    java.lang.NullPointerException at HadoopFileSystemTest.java:93

org.apache.beam.sdk.io.hdfs.HadoopFileSystemTest > testCreateAndReadFile FAILED
    java.lang.NoSuchMethodError at HadoopFileSystemTest.java:85
    java.lang.NullPointerException at HadoopFileSystemTest.java:93

org.apache.beam.sdk.io.hdfs.HadoopFileSystemTest > testMatchDirectory FAILED
    java.lang.NoSuchMethodError at HadoopFileSystemTest.java:85
    java.lang.NullPointerException at HadoopFileSystemTest.java:93

org.apache.beam.sdk.io.hdfs.HadoopFileSystemTest > testRenameRetryScenario FAILED
    java.lang.NoSuchMethodError at HadoopFileSystemTest.java:85
    java.lang.NullPointerException at HadoopFileSystemTest.java:93

org.apache.beam.sdk.io.hdfs.HadoopFileSystemTest > testRenameMissingTargetDir FAILED
    java.lang.NoSuchMethodError at HadoopFileSystemTest.java:85
    java.lang.NullPointerException at HadoopFileSystemTest.java:93

org.apache.beam.sdk.io.hdfs.HadoopFileSystemTest > testCreateAndReadFileWithShift FAILED
    java.lang.NoSuchMethodError at HadoopFileSystemTest.java:85
    java.lang.NullPointerException at HadoopFileSystemTest.java:93

org.apache.beam.sdk.io.hdfs.HadoopFileSystemTest > testCreateAndReadFileWithShiftToEnd FAILED
    java.lang.NoSuchMethodError at HadoopFileSystemTest.java:85
    java.lang.NullPointerException at HadoopFileSystemTest.java:93

org.apache.beam.sdk.io.hdfs.HadoopFileSystemTest > testCopySourceMissing FAILED
    java.lang.NoSuchMethodError at HadoopFileSystemTest.java:85
    java.lang.NullPointerException at HadoopFileSystemTest.java:93

org.apache.beam.sdk.io.hdfs.HadoopFileSystemTest > testRenameMissingSource FAILED
    java.lang.NoSuchMethodError at HadoopFileSystemTest.java:85
    java.lang.NullPointerException at HadoopFileSystemTest.java:93

org.apache.beam.sdk.io.hdfs.HadoopFileSystemTest > testMatchNewResource FAILED
    java.lang.NoSuchMethodError at HadoopFileSystemTest.java:85
    java.lang.NullPointerException at HadoopFileSystemTest.java:93

org.apache.beam.sdk.io.hdfs.HadoopFileSystemTest > testMatchForRecursiveGlob FAILED
    java.lang.NoSuchMethodError at HadoopFileSystemTest.java:85
    java.lang.NullPointerException at HadoopFileSystemTest.java:93

org.apache.beam.sdk.io.hdfs.HadoopFileSystemTest > testDelete FAILED
    java.lang.NoSuchMethodError at HadoopFileSystemTest.java:85
    java.lang.NullPointerException at HadoopFileSystemTest.java:93

org.apache.beam.sdk.io.hdfs.HadoopFileSystemTest > testRename FAILED
    java.lang.NoSuchMethodError at HadoopFileSystemTest.java:85
    java.lang.NullPointerException at HadoopFileSystemTest.java:93

org.apache.beam.sdk.io.hdfs.HadoopResourceIdTest > testGetFilename FAILED
    java.lang.NoSuchMethodError at HadoopResourceIdTest.java:50
    java.lang.NullPointerException at HadoopResourceIdTest.java:61

org.apache.beam.sdk.io.hdfs.HadoopResourceIdTest > testResourceIdTester FAILED
    java.lang.NoSuchMethodError at HadoopResourceIdTest.java:50
    java.lang.NullPointerException at HadoopResourceIdTest.java:61

34 tests completed, 20 failed, 1 skipped

> Task :sdks:java:io:hadoop-file-system:hadoopVersion292Test FAILED

> Task :sdks:java:io:hadoop-file-system:hadoopVersion321Test

org.apache.beam.sdk.io.hdfs.HadoopFileSystemRegistrarTest > testServiceLoader FAILED
    java.lang.NoClassDefFoundError at HadoopFileSystemRegistrarTest.java:55
        Caused by: java.lang.ClassNotFoundException at HadoopFileSystemRegistrarTest.java:55
    java.lang.NullPointerException at HadoopFileSystemRegistrarTest.java:61

org.apache.beam.sdk.io.hdfs.HadoopFileSystemTest > testDeleteNonExisting FAILED
    java.lang.NoClassDefFoundError at HadoopFileSystemTest.java:85
        Caused by: java.lang.ClassNotFoundException at HadoopFileSystemTest.java:85
    java.lang.NullPointerException at HadoopFileSystemTest.java:93

org.apache.beam.sdk.io.hdfs.HadoopFileSystemTest > testRenameExistingDestination FAILED
    java.lang.NoClassDefFoundError at HadoopFileSystemTest.java:85
        Caused by: java.lang.ClassNotFoundException at HadoopFileSystemTest.java:85
    java.lang.NullPointerException at HadoopFileSystemTest.java:93

org.apache.beam.sdk.io.hdfs.HadoopFileSystemTest > testMatch FAILED
    java.lang.NoClassDefFoundError at HadoopFileSystemTest.java:85
        Caused by: java.lang.ClassNotFoundException at HadoopFileSystemTest.java:85
    java.lang.NullPointerException at HadoopFileSystemTest.java:93

org.apache.beam.sdk.io.hdfs.HadoopFileSystemTest > testCopy FAILED
    java.lang.NoClassDefFoundError at HadoopFileSystemTest.java:85
        Caused by: java.lang.ClassNotFoundException at HadoopFileSystemTest.java:85
    java.lang.NullPointerException at HadoopFileSystemTest.java:93

org.apache.beam.sdk.io.hdfs.HadoopFileSystemTest > testMatchForNonExistentFile FAILED
    java.lang.NoClassDefFoundError at HadoopFileSystemTest.java:85
        Caused by: java.lang.ClassNotFoundException at HadoopFileSystemTest.java:85
    java.lang.NullPointerException at HadoopFileSystemTest.java:93

org.apache.beam.sdk.io.hdfs.HadoopFileSystemTest > testCreateAndReadFile FAILED
    java.lang.NoClassDefFoundError at HadoopFileSystemTest.java:85
        Caused by: java.lang.ClassNotFoundException at HadoopFileSystemTest.java:85
    java.lang.NullPointerException at HadoopFileSystemTest.java:93

org.apache.beam.sdk.io.hdfs.HadoopFileSystemTest > testMatchDirectory FAILED
    java.lang.NoClassDefFoundError at HadoopFileSystemTest.java:85
        Caused by: java.lang.ClassNotFoundException at HadoopFileSystemTest.java:85
    java.lang.NullPointerException at HadoopFileSystemTest.java:93

org.apache.beam.sdk.io.hdfs.HadoopFileSystemTest > testRenameRetryScenario FAILED
    java.lang.NoClassDefFoundError at HadoopFileSystemTest.java:85
        Caused by: java.lang.ClassNotFoundException at HadoopFileSystemTest.java:85
    java.lang.NullPointerException at HadoopFileSystemTest.java:93

org.apache.beam.sdk.io.hdfs.HadoopFileSystemTest > testRenameMissingTargetDir FAILED
    java.lang.NoClassDefFoundError at HadoopFileSystemTest.java:85
        Caused by: java.lang.ClassNotFoundException at HadoopFileSystemTest.java:85
    java.lang.NullPointerException at HadoopFileSystemTest.java:93

org.apache.beam.sdk.io.hdfs.HadoopFileSystemTest > testCreateAndReadFileWithShift FAILED
    java.lang.NoClassDefFoundError at HadoopFileSystemTest.java:85
        Caused by: java.lang.ClassNotFoundException at HadoopFileSystemTest.java:85
    java.lang.NullPointerException at HadoopFileSystemTest.java:93

org.apache.beam.sdk.io.hdfs.HadoopFileSystemTest > testCreateAndReadFileWithShiftToEnd FAILED
    java.lang.NoClassDefFoundError at HadoopFileSystemTest.java:85
        Caused by: java.lang.ClassNotFoundException at HadoopFileSystemTest.java:85
    java.lang.NullPointerException at HadoopFileSystemTest.java:93

org.apache.beam.sdk.io.hdfs.HadoopFileSystemTest > testCopySourceMissing FAILED
    java.lang.NoClassDefFoundError at HadoopFileSystemTest.java:85
        Caused by: java.lang.ClassNotFoundException at HadoopFileSystemTest.java:85
    java.lang.NullPointerException at HadoopFileSystemTest.java:93

org.apache.beam.sdk.io.hdfs.HadoopFileSystemTest > testRenameMissingSource FAILED
    java.lang.NoClassDefFoundError at HadoopFileSystemTest.java:85
        Caused by: java.lang.ClassNotFoundException at HadoopFileSystemTest.java:85
    java.lang.NullPointerException at HadoopFileSystemTest.java:93

org.apache.beam.sdk.io.hdfs.HadoopFileSystemTest > testMatchNewResource FAILED
    java.lang.NoClassDefFoundError at HadoopFileSystemTest.java:85
        Caused by: java.lang.ClassNotFoundException at HadoopFileSystemTest.java:85
    java.lang.NullPointerException at HadoopFileSystemTest.java:93

org.apache.beam.sdk.io.hdfs.HadoopFileSystemTest > testMatchForRecursiveGlob FAILED
    java.lang.NoClassDefFoundError at HadoopFileSystemTest.java:85
        Caused by: java.lang.ClassNotFoundException at HadoopFileSystemTest.java:85
    java.lang.NullPointerException at HadoopFileSystemTest.java:93

org.apache.beam.sdk.io.hdfs.HadoopFileSystemTest > testDelete FAILED
    java.lang.NoClassDefFoundError at HadoopFileSystemTest.java:85
        Caused by: java.lang.ClassNotFoundException at HadoopFileSystemTest.java:85
    java.lang.NullPointerException at HadoopFileSystemTest.java:93

org.apache.beam.sdk.io.hdfs.HadoopFileSystemTest > testRename FAILED
    java.lang.NoClassDefFoundError at HadoopFileSystemTest.java:85
        Caused by: java.lang.ClassNotFoundException at HadoopFileSystemTest.java:85
    java.lang.NullPointerException at HadoopFileSystemTest.java:93

org.apache.beam.sdk.io.hdfs.HadoopResourceIdTest > testGetFilename FAILED
    java.lang.NoClassDefFoundError at HadoopResourceIdTest.java:50
        Caused by: java.lang.ClassNotFoundException at HadoopResourceIdTest.java:50
    java.lang.NullPointerException at HadoopResourceIdTest.java:61

org.apache.beam.sdk.io.hdfs.HadoopResourceIdTest > testResourceIdTester FAILED
    java.lang.NoClassDefFoundError at HadoopResourceIdTest.java:50
        Caused by: java.lang.ClassNotFoundException at HadoopResourceIdTest.java:50
    java.lang.NullPointerException at HadoopResourceIdTest.java:61

34 tests completed, 20 failed, 1 skipped

> Task :sdks:java:io:hadoop-file-system:hadoopVersion321Test FAILED
> Task :sdks:java:io:hadoop-format:runHadoopFormatIO2101IT
> Task :sdks:java:io:hadoop-format:runHadoopFormatIO2101Test
> Task :sdks:java:io:hadoop-format:runHadoopFormatIO285ElasticIT
> Task :sdks:java:io:hadoop-format:runHadoopFormatIO285IT
> Task :sdks:java:io:hadoop-format:runHadoopFormatIO285Test
> Task :sdks:java:io:hadoop-format:runHadoopFormatIO292ElasticIT
> Task :sdks:java:io:hadoop-format:runHadoopFormatIO292IT
> Task :sdks:java:io:hadoop-format:runHadoopFormatIO292Test
> Task :sdks:java:io:hadoop-format:runHadoopFormatIO321ElasticIT
> Task :sdks:java:io:hadoop-format:runHadoopFormatIO321IT
> Task :sdks:java:io:hadoop-format:runHadoopFormatIO321Test
> Task :sdks:java:io:hadoop-format:hadoopVersionsTest

FAILURE: Build completed with 3 failures.

1: Task failed with an exception.
-----------
* What went wrong:
Execution failed for task ':sdks:java:io:hadoop-file-system:hadoopVersion285Test'.
> There were failing tests. See the report at: file://<https://ci-beam.apache.org/job/beam_PostCommit_Java_Hadoop_Versions/ws/src/sdks/java/io/hadoop-file-system/build/reports/tests/hadoopVersion285Test/index.html>

* Try:
> Run with --stacktrace option to get the stack trace.
> Run with --info or --debug option to get more log output.
> Run with --scan to get full insights.
==============================================================================

2: Task failed with an exception.
-----------
* What went wrong:
Execution failed for task ':sdks:java:io:hadoop-file-system:hadoopVersion292Test'.
> There were failing tests. See the report at: file://<https://ci-beam.apache.org/job/beam_PostCommit_Java_Hadoop_Versions/ws/src/sdks/java/io/hadoop-file-system/build/reports/tests/hadoopVersion292Test/index.html>

* Try:
> Run with --stacktrace option to get the stack trace.
> Run with --info or --debug option to get more log output.
> Run with --scan to get full insights.
==============================================================================

3: Task failed with an exception.
-----------
* What went wrong:
Execution failed for task ':sdks:java:io:hadoop-file-system:hadoopVersion321Test'.
> There were failing tests. See the report at: file://<https://ci-beam.apache.org/job/beam_PostCommit_Java_Hadoop_Versions/ws/src/sdks/java/io/hadoop-file-system/build/reports/tests/hadoopVersion321Test/index.html>

* Try:
> Run with --stacktrace option to get the stack trace.
> Run with --info or --debug option to get more log output.
> Run with --scan to get full insights.
==============================================================================

* Get more help at https://help.gradle.org

BUILD FAILED in 15m 26s
180 actionable tasks: 99 executed, 79 from cache, 2 up-to-date

Publishing build scan...
https://gradle.com/s/kwgw7lxaevxii

Build step 'Invoke Gradle script' changed build result to FAILURE
Build step 'Invoke Gradle script' marked build as failure

---------------------------------------------------------------------
To unsubscribe, e-mail: builds-unsubscribe@beam.apache.org
For additional commands, e-mail: builds-help@beam.apache.org


Build failed in Jenkins: beam_PostCommit_Java_Hadoop_Versions #1267

Posted by Apache Jenkins Server <je...@builds.apache.org>.
See <https://ci-beam.apache.org/job/beam_PostCommit_Java_Hadoop_Versions/1267/display/redirect?page=changes>

Changes:

[akustov] fix name project id from secreton scio deploy action

[alexander.zhuravlev] [BEAM-13775] Fixed bug with run button

[ihr] [BEAM-13836] Fix the answers placeholders locations in the Python katas

[noreply] Merge pull request #16703 from [BEAM-13804][Playground][Bugfix] Add

[noreply] Merge pull request #16611 from [BEAM-13712][Playground] Add graph for

[noreply] Merge pull request #16757 from [BEAM-13655] [Playground] Persist the


------------------------------------------
[...truncated 74.13 KB...]
org.apache.beam.sdk.io.hdfs.HadoopFileSystemTest > testMatchForNonExistentFile FAILED
    java.lang.NoSuchMethodError at HadoopFileSystemTest.java:85
    java.lang.NullPointerException at HadoopFileSystemTest.java:93

org.apache.beam.sdk.io.hdfs.HadoopFileSystemTest > testCreateAndReadFile FAILED
    java.lang.NoSuchMethodError at HadoopFileSystemTest.java:85
    java.lang.NullPointerException at HadoopFileSystemTest.java:93

org.apache.beam.sdk.io.hdfs.HadoopFileSystemTest > testMatchDirectory FAILED
    java.lang.NoSuchMethodError at HadoopFileSystemTest.java:85
    java.lang.NullPointerException at HadoopFileSystemTest.java:93

org.apache.beam.sdk.io.hdfs.HadoopFileSystemTest > testRenameRetryScenario FAILED
    java.lang.NoSuchMethodError at HadoopFileSystemTest.java:85
    java.lang.NullPointerException at HadoopFileSystemTest.java:93

org.apache.beam.sdk.io.hdfs.HadoopFileSystemTest > testRenameMissingTargetDir FAILED
    java.lang.NoSuchMethodError at HadoopFileSystemTest.java:85
    java.lang.NullPointerException at HadoopFileSystemTest.java:93

org.apache.beam.sdk.io.hdfs.HadoopFileSystemTest > testCreateAndReadFileWithShift FAILED
    java.lang.NoSuchMethodError at HadoopFileSystemTest.java:85
    java.lang.NullPointerException at HadoopFileSystemTest.java:93

org.apache.beam.sdk.io.hdfs.HadoopFileSystemTest > testCreateAndReadFileWithShiftToEnd FAILED
    java.lang.NoSuchMethodError at HadoopFileSystemTest.java:85
    java.lang.NullPointerException at HadoopFileSystemTest.java:93

org.apache.beam.sdk.io.hdfs.HadoopFileSystemTest > testCopySourceMissing FAILED
    java.lang.NoSuchMethodError at HadoopFileSystemTest.java:85
    java.lang.NullPointerException at HadoopFileSystemTest.java:93

org.apache.beam.sdk.io.hdfs.HadoopFileSystemTest > testRenameMissingSource FAILED
    java.lang.NoSuchMethodError at HadoopFileSystemTest.java:85
    java.lang.NullPointerException at HadoopFileSystemTest.java:93

org.apache.beam.sdk.io.hdfs.HadoopFileSystemTest > testMatchNewResource FAILED
    java.lang.NoSuchMethodError at HadoopFileSystemTest.java:85
    java.lang.NullPointerException at HadoopFileSystemTest.java:93

org.apache.beam.sdk.io.hdfs.HadoopFileSystemTest > testMatchForRecursiveGlob FAILED
    java.lang.NoSuchMethodError at HadoopFileSystemTest.java:85
    java.lang.NullPointerException at HadoopFileSystemTest.java:93

org.apache.beam.sdk.io.hdfs.HadoopFileSystemTest > testDelete FAILED
    java.lang.NoSuchMethodError at HadoopFileSystemTest.java:85
    java.lang.NullPointerException at HadoopFileSystemTest.java:93

org.apache.beam.sdk.io.hdfs.HadoopFileSystemTest > testRename FAILED
    java.lang.NoSuchMethodError at HadoopFileSystemTest.java:85
    java.lang.NullPointerException at HadoopFileSystemTest.java:93

org.apache.beam.sdk.io.hdfs.HadoopResourceIdTest > testGetFilename FAILED
    java.lang.NoSuchMethodError at HadoopResourceIdTest.java:50
    java.lang.NullPointerException at HadoopResourceIdTest.java:61

org.apache.beam.sdk.io.hdfs.HadoopResourceIdTest > testResourceIdTester FAILED
    java.lang.NoSuchMethodError at HadoopResourceIdTest.java:50
    java.lang.NullPointerException at HadoopResourceIdTest.java:61

34 tests completed, 20 failed, 1 skipped

> Task :sdks:java:io:hadoop-format:runHadoopFormatIO2101IT
> Task :sdks:java:io:hadoop-file-system:hadoopVersion292Test FAILED

> Task :sdks:java:io:hadoop-file-system:hadoopVersion321Test

org.apache.beam.sdk.io.hdfs.HadoopFileSystemRegistrarTest > testServiceLoader FAILED
    java.lang.NoClassDefFoundError at HadoopFileSystemRegistrarTest.java:55
        Caused by: java.lang.ClassNotFoundException at HadoopFileSystemRegistrarTest.java:55
    java.lang.NullPointerException at HadoopFileSystemRegistrarTest.java:61

org.apache.beam.sdk.io.hdfs.HadoopFileSystemTest > testDeleteNonExisting FAILED
    java.lang.NoClassDefFoundError at HadoopFileSystemTest.java:85
        Caused by: java.lang.ClassNotFoundException at HadoopFileSystemTest.java:85
    java.lang.NullPointerException at HadoopFileSystemTest.java:93

org.apache.beam.sdk.io.hdfs.HadoopFileSystemTest > testRenameExistingDestination FAILED
    java.lang.NoClassDefFoundError at HadoopFileSystemTest.java:85
        Caused by: java.lang.ClassNotFoundException at HadoopFileSystemTest.java:85
    java.lang.NullPointerException at HadoopFileSystemTest.java:93

org.apache.beam.sdk.io.hdfs.HadoopFileSystemTest > testMatch FAILED
    java.lang.NoClassDefFoundError at HadoopFileSystemTest.java:85
        Caused by: java.lang.ClassNotFoundException at HadoopFileSystemTest.java:85
    java.lang.NullPointerException at HadoopFileSystemTest.java:93

org.apache.beam.sdk.io.hdfs.HadoopFileSystemTest > testCopy FAILED
    java.lang.NoClassDefFoundError at HadoopFileSystemTest.java:85
        Caused by: java.lang.ClassNotFoundException at HadoopFileSystemTest.java:85
    java.lang.NullPointerException at HadoopFileSystemTest.java:93

org.apache.beam.sdk.io.hdfs.HadoopFileSystemTest > testMatchForNonExistentFile FAILED
    java.lang.NoClassDefFoundError at HadoopFileSystemTest.java:85
        Caused by: java.lang.ClassNotFoundException at HadoopFileSystemTest.java:85
    java.lang.NullPointerException at HadoopFileSystemTest.java:93

org.apache.beam.sdk.io.hdfs.HadoopFileSystemTest > testCreateAndReadFile FAILED
    java.lang.NoClassDefFoundError at HadoopFileSystemTest.java:85
        Caused by: java.lang.ClassNotFoundException at HadoopFileSystemTest.java:85
    java.lang.NullPointerException at HadoopFileSystemTest.java:93

org.apache.beam.sdk.io.hdfs.HadoopFileSystemTest > testMatchDirectory FAILED
    java.lang.NoClassDefFoundError at HadoopFileSystemTest.java:85
        Caused by: java.lang.ClassNotFoundException at HadoopFileSystemTest.java:85
    java.lang.NullPointerException at HadoopFileSystemTest.java:93

org.apache.beam.sdk.io.hdfs.HadoopFileSystemTest > testRenameRetryScenario FAILED
    java.lang.NoClassDefFoundError at HadoopFileSystemTest.java:85
        Caused by: java.lang.ClassNotFoundException at HadoopFileSystemTest.java:85
    java.lang.NullPointerException at HadoopFileSystemTest.java:93

org.apache.beam.sdk.io.hdfs.HadoopFileSystemTest > testRenameMissingTargetDir FAILED
    java.lang.NoClassDefFoundError at HadoopFileSystemTest.java:85
        Caused by: java.lang.ClassNotFoundException at HadoopFileSystemTest.java:85
    java.lang.NullPointerException at HadoopFileSystemTest.java:93

org.apache.beam.sdk.io.hdfs.HadoopFileSystemTest > testCreateAndReadFileWithShift FAILED
    java.lang.NoClassDefFoundError at HadoopFileSystemTest.java:85
        Caused by: java.lang.ClassNotFoundException at HadoopFileSystemTest.java:85
    java.lang.NullPointerException at HadoopFileSystemTest.java:93

org.apache.beam.sdk.io.hdfs.HadoopFileSystemTest > testCreateAndReadFileWithShiftToEnd FAILED
    java.lang.NoClassDefFoundError at HadoopFileSystemTest.java:85
        Caused by: java.lang.ClassNotFoundException at HadoopFileSystemTest.java:85
    java.lang.NullPointerException at HadoopFileSystemTest.java:93

org.apache.beam.sdk.io.hdfs.HadoopFileSystemTest > testCopySourceMissing FAILED
    java.lang.NoClassDefFoundError at HadoopFileSystemTest.java:85
        Caused by: java.lang.ClassNotFoundException at HadoopFileSystemTest.java:85
    java.lang.NullPointerException at HadoopFileSystemTest.java:93

org.apache.beam.sdk.io.hdfs.HadoopFileSystemTest > testRenameMissingSource FAILED
    java.lang.NoClassDefFoundError at HadoopFileSystemTest.java:85
        Caused by: java.lang.ClassNotFoundException at HadoopFileSystemTest.java:85
    java.lang.NullPointerException at HadoopFileSystemTest.java:93

org.apache.beam.sdk.io.hdfs.HadoopFileSystemTest > testMatchNewResource FAILED
    java.lang.NoClassDefFoundError at HadoopFileSystemTest.java:85
        Caused by: java.lang.ClassNotFoundException at HadoopFileSystemTest.java:85
    java.lang.NullPointerException at HadoopFileSystemTest.java:93

org.apache.beam.sdk.io.hdfs.HadoopFileSystemTest > testMatchForRecursiveGlob FAILED
    java.lang.NoClassDefFoundError at HadoopFileSystemTest.java:85
        Caused by: java.lang.ClassNotFoundException at HadoopFileSystemTest.java:85
    java.lang.NullPointerException at HadoopFileSystemTest.java:93

org.apache.beam.sdk.io.hdfs.HadoopFileSystemTest > testDelete FAILED
    java.lang.NoClassDefFoundError at HadoopFileSystemTest.java:85
        Caused by: java.lang.ClassNotFoundException at HadoopFileSystemTest.java:85
    java.lang.NullPointerException at HadoopFileSystemTest.java:93

org.apache.beam.sdk.io.hdfs.HadoopFileSystemTest > testRename FAILED
    java.lang.NoClassDefFoundError at HadoopFileSystemTest.java:85
        Caused by: java.lang.ClassNotFoundException at HadoopFileSystemTest.java:85
    java.lang.NullPointerException at HadoopFileSystemTest.java:93

org.apache.beam.sdk.io.hdfs.HadoopResourceIdTest > testGetFilename FAILED
    java.lang.NoClassDefFoundError at HadoopResourceIdTest.java:50
        Caused by: java.lang.ClassNotFoundException at HadoopResourceIdTest.java:50
    java.lang.NullPointerException at HadoopResourceIdTest.java:61

org.apache.beam.sdk.io.hdfs.HadoopResourceIdTest > testResourceIdTester FAILED
    java.lang.NoClassDefFoundError at HadoopResourceIdTest.java:50
        Caused by: java.lang.ClassNotFoundException at HadoopResourceIdTest.java:50
    java.lang.NullPointerException at HadoopResourceIdTest.java:61

34 tests completed, 20 failed, 1 skipped

> Task :sdks:java:io:hadoop-file-system:hadoopVersion321Test FAILED
> Task :sdks:java:io:hadoop-format:runHadoopFormatIO2101Test
> Task :sdks:java:io:hadoop-format:runHadoopFormatIO285ElasticIT
> Task :sdks:java:io:hadoop-format:runHadoopFormatIO285IT
> Task :sdks:java:io:hadoop-format:runHadoopFormatIO285Test
> Task :sdks:java:io:hadoop-format:runHadoopFormatIO292ElasticIT
> Task :sdks:java:io:hadoop-format:runHadoopFormatIO292IT
> Task :sdks:java:io:hadoop-format:runHadoopFormatIO292Test
> Task :sdks:java:io:hadoop-format:runHadoopFormatIO321ElasticIT

org.apache.beam.sdk.io.hadoop.format.HadoopFormatIOElasticIT > classMethod FAILED
    java.net.SocketTimeoutException at HadoopFormatIOElasticIT.java:286
        Caused by: java.net.SocketTimeoutException at HttpAsyncRequestExecutor.java:387

1 test completed, 1 failed

> Task :sdks:java:io:hadoop-format:runHadoopFormatIO321ElasticIT FAILED
> Task :sdks:java:io:hadoop-format:runHadoopFormatIO321IT
> Task :sdks:java:io:hadoop-format:runHadoopFormatIO321Test

FAILURE: Build completed with 4 failures.

1: Task failed with an exception.
-----------
* What went wrong:
Execution failed for task ':sdks:java:io:hadoop-file-system:hadoopVersion285Test'.
> There were failing tests. See the report at: file://<https://ci-beam.apache.org/job/beam_PostCommit_Java_Hadoop_Versions/ws/src/sdks/java/io/hadoop-file-system/build/reports/tests/hadoopVersion285Test/index.html>

* Try:
> Run with --stacktrace option to get the stack trace.
> Run with --info or --debug option to get more log output.
> Run with --scan to get full insights.
==============================================================================

2: Task failed with an exception.
-----------
* What went wrong:
Execution failed for task ':sdks:java:io:hadoop-file-system:hadoopVersion292Test'.
> There were failing tests. See the report at: file://<https://ci-beam.apache.org/job/beam_PostCommit_Java_Hadoop_Versions/ws/src/sdks/java/io/hadoop-file-system/build/reports/tests/hadoopVersion292Test/index.html>

* Try:
> Run with --stacktrace option to get the stack trace.
> Run with --info or --debug option to get more log output.
> Run with --scan to get full insights.
==============================================================================

3: Task failed with an exception.
-----------
* What went wrong:
Execution failed for task ':sdks:java:io:hadoop-file-system:hadoopVersion321Test'.
> There were failing tests. See the report at: file://<https://ci-beam.apache.org/job/beam_PostCommit_Java_Hadoop_Versions/ws/src/sdks/java/io/hadoop-file-system/build/reports/tests/hadoopVersion321Test/index.html>

* Try:
> Run with --stacktrace option to get the stack trace.
> Run with --info or --debug option to get more log output.
> Run with --scan to get full insights.
==============================================================================

4: Task failed with an exception.
-----------
* What went wrong:
Execution failed for task ':sdks:java:io:hadoop-format:runHadoopFormatIO321ElasticIT'.
> There were failing tests. See the report at: file://<https://ci-beam.apache.org/job/beam_PostCommit_Java_Hadoop_Versions/ws/src/sdks/java/io/hadoop-format/build/reports/tests/runHadoopFormatIO321ElasticIT/index.html>

* Try:
> Run with --stacktrace option to get the stack trace.
> Run with --info or --debug option to get more log output.
> Run with --scan to get full insights.
==============================================================================

* Get more help at https://help.gradle.org

BUILD FAILED in 18m 54s
180 actionable tasks: 99 executed, 79 from cache, 2 up-to-date

Publishing build scan...
https://gradle.com/s/cabkurpoilspg

Build step 'Invoke Gradle script' changed build result to FAILURE
Build step 'Invoke Gradle script' marked build as failure

---------------------------------------------------------------------
To unsubscribe, e-mail: builds-unsubscribe@beam.apache.org
For additional commands, e-mail: builds-help@beam.apache.org


Build failed in Jenkins: beam_PostCommit_Java_Hadoop_Versions #1266

Posted by Apache Jenkins Server <je...@builds.apache.org>.
See <https://ci-beam.apache.org/job/beam_PostCommit_Java_Hadoop_Versions/1266/display/redirect>

Changes:


------------------------------------------
[...truncated 72.88 KB...]
    java.lang.NullPointerException at HadoopFileSystemRegistrarTest.java:61

org.apache.beam.sdk.io.hdfs.HadoopFileSystemTest > testDeleteNonExisting FAILED
    java.lang.NoSuchMethodError at HadoopFileSystemTest.java:85
    java.lang.NullPointerException at HadoopFileSystemTest.java:93

org.apache.beam.sdk.io.hdfs.HadoopFileSystemTest > testRenameExistingDestination FAILED
    java.lang.NoSuchMethodError at HadoopFileSystemTest.java:85
    java.lang.NullPointerException at HadoopFileSystemTest.java:93

org.apache.beam.sdk.io.hdfs.HadoopFileSystemTest > testMatch FAILED
    java.lang.NoSuchMethodError at HadoopFileSystemTest.java:85
    java.lang.NullPointerException at HadoopFileSystemTest.java:93

org.apache.beam.sdk.io.hdfs.HadoopFileSystemTest > testCopy FAILED
    java.lang.NoSuchMethodError at HadoopFileSystemTest.java:85
    java.lang.NullPointerException at HadoopFileSystemTest.java:93

org.apache.beam.sdk.io.hdfs.HadoopFileSystemTest > testMatchForNonExistentFile FAILED
    java.lang.NoSuchMethodError at HadoopFileSystemTest.java:85
    java.lang.NullPointerException at HadoopFileSystemTest.java:93

org.apache.beam.sdk.io.hdfs.HadoopFileSystemTest > testCreateAndReadFile FAILED
    java.lang.NoSuchMethodError at HadoopFileSystemTest.java:85
    java.lang.NullPointerException at HadoopFileSystemTest.java:93

org.apache.beam.sdk.io.hdfs.HadoopFileSystemTest > testMatchDirectory FAILED
    java.lang.NoSuchMethodError at HadoopFileSystemTest.java:85
    java.lang.NullPointerException at HadoopFileSystemTest.java:93

org.apache.beam.sdk.io.hdfs.HadoopFileSystemTest > testRenameRetryScenario FAILED
    java.lang.NoSuchMethodError at HadoopFileSystemTest.java:85
    java.lang.NullPointerException at HadoopFileSystemTest.java:93

org.apache.beam.sdk.io.hdfs.HadoopFileSystemTest > testRenameMissingTargetDir FAILED
    java.lang.NoSuchMethodError at HadoopFileSystemTest.java:85
    java.lang.NullPointerException at HadoopFileSystemTest.java:93

org.apache.beam.sdk.io.hdfs.HadoopFileSystemTest > testCreateAndReadFileWithShift FAILED
    java.lang.NoSuchMethodError at HadoopFileSystemTest.java:85
    java.lang.NullPointerException at HadoopFileSystemTest.java:93

org.apache.beam.sdk.io.hdfs.HadoopFileSystemTest > testCreateAndReadFileWithShiftToEnd FAILED
    java.lang.NoSuchMethodError at HadoopFileSystemTest.java:85
    java.lang.NullPointerException at HadoopFileSystemTest.java:93

org.apache.beam.sdk.io.hdfs.HadoopFileSystemTest > testCopySourceMissing FAILED
    java.lang.NoSuchMethodError at HadoopFileSystemTest.java:85
    java.lang.NullPointerException at HadoopFileSystemTest.java:93

> Task :sdks:java:io:hadoop-format:runHadoopFormatIO2101IT

> Task :sdks:java:io:hadoop-file-system:hadoopVersion292Test FAILED

org.apache.beam.sdk.io.hdfs.HadoopFileSystemTest > testRenameMissingSource FAILED
    java.lang.NoSuchMethodError at HadoopFileSystemTest.java:85
    java.lang.NullPointerException at HadoopFileSystemTest.java:93

org.apache.beam.sdk.io.hdfs.HadoopFileSystemTest > testMatchNewResource FAILED
    java.lang.NoSuchMethodError at HadoopFileSystemTest.java:85
    java.lang.NullPointerException at HadoopFileSystemTest.java:93

org.apache.beam.sdk.io.hdfs.HadoopFileSystemTest > testMatchForRecursiveGlob FAILED
    java.lang.NoSuchMethodError at HadoopFileSystemTest.java:85
    java.lang.NullPointerException at HadoopFileSystemTest.java:93

org.apache.beam.sdk.io.hdfs.HadoopFileSystemTest > testDelete FAILED
    java.lang.NoSuchMethodError at HadoopFileSystemTest.java:85
    java.lang.NullPointerException at HadoopFileSystemTest.java:93

org.apache.beam.sdk.io.hdfs.HadoopFileSystemTest > testRename FAILED
    java.lang.NoSuchMethodError at HadoopFileSystemTest.java:85
    java.lang.NullPointerException at HadoopFileSystemTest.java:93

org.apache.beam.sdk.io.hdfs.HadoopResourceIdTest > testGetFilename FAILED
    java.lang.NoSuchMethodError at HadoopResourceIdTest.java:50
    java.lang.NullPointerException at HadoopResourceIdTest.java:61

org.apache.beam.sdk.io.hdfs.HadoopResourceIdTest > testResourceIdTester FAILED
    java.lang.NoSuchMethodError at HadoopResourceIdTest.java:50
    java.lang.NullPointerException at HadoopResourceIdTest.java:61

34 tests completed, 20 failed, 1 skipped

> Task :sdks:java:io:hadoop-file-system:hadoopVersion321Test

org.apache.beam.sdk.io.hdfs.HadoopFileSystemRegistrarTest > testServiceLoader FAILED
    java.lang.NoClassDefFoundError at HadoopFileSystemRegistrarTest.java:55
        Caused by: java.lang.ClassNotFoundException at HadoopFileSystemRegistrarTest.java:55
    java.lang.NullPointerException at HadoopFileSystemRegistrarTest.java:61

org.apache.beam.sdk.io.hdfs.HadoopFileSystemTest > testDeleteNonExisting FAILED
    java.lang.NoClassDefFoundError at HadoopFileSystemTest.java:85
        Caused by: java.lang.ClassNotFoundException at HadoopFileSystemTest.java:85
    java.lang.NullPointerException at HadoopFileSystemTest.java:93

org.apache.beam.sdk.io.hdfs.HadoopFileSystemTest > testRenameExistingDestination FAILED
    java.lang.NoClassDefFoundError at HadoopFileSystemTest.java:85
        Caused by: java.lang.ClassNotFoundException at HadoopFileSystemTest.java:85
    java.lang.NullPointerException at HadoopFileSystemTest.java:93

org.apache.beam.sdk.io.hdfs.HadoopFileSystemTest > testMatch FAILED
    java.lang.NoClassDefFoundError at HadoopFileSystemTest.java:85
        Caused by: java.lang.ClassNotFoundException at HadoopFileSystemTest.java:85
    java.lang.NullPointerException at HadoopFileSystemTest.java:93

org.apache.beam.sdk.io.hdfs.HadoopFileSystemTest > testCopy FAILED
    java.lang.NoClassDefFoundError at HadoopFileSystemTest.java:85
        Caused by: java.lang.ClassNotFoundException at HadoopFileSystemTest.java:85
    java.lang.NullPointerException at HadoopFileSystemTest.java:93

org.apache.beam.sdk.io.hdfs.HadoopFileSystemTest > testMatchForNonExistentFile FAILED
    java.lang.NoClassDefFoundError at HadoopFileSystemTest.java:85
        Caused by: java.lang.ClassNotFoundException at HadoopFileSystemTest.java:85
    java.lang.NullPointerException at HadoopFileSystemTest.java:93

org.apache.beam.sdk.io.hdfs.HadoopFileSystemTest > testCreateAndReadFile FAILED
    java.lang.NoClassDefFoundError at HadoopFileSystemTest.java:85
        Caused by: java.lang.ClassNotFoundException at HadoopFileSystemTest.java:85
    java.lang.NullPointerException at HadoopFileSystemTest.java:93

org.apache.beam.sdk.io.hdfs.HadoopFileSystemTest > testMatchDirectory FAILED
    java.lang.NoClassDefFoundError at HadoopFileSystemTest.java:85
        Caused by: java.lang.ClassNotFoundException at HadoopFileSystemTest.java:85
    java.lang.NullPointerException at HadoopFileSystemTest.java:93

org.apache.beam.sdk.io.hdfs.HadoopFileSystemTest > testRenameRetryScenario FAILED
    java.lang.NoClassDefFoundError at HadoopFileSystemTest.java:85
        Caused by: java.lang.ClassNotFoundException at HadoopFileSystemTest.java:85
    java.lang.NullPointerException at HadoopFileSystemTest.java:93

org.apache.beam.sdk.io.hdfs.HadoopFileSystemTest > testRenameMissingTargetDir FAILED
    java.lang.NoClassDefFoundError at HadoopFileSystemTest.java:85
        Caused by: java.lang.ClassNotFoundException at HadoopFileSystemTest.java:85
    java.lang.NullPointerException at HadoopFileSystemTest.java:93

org.apache.beam.sdk.io.hdfs.HadoopFileSystemTest > testCreateAndReadFileWithShift FAILED
    java.lang.NoClassDefFoundError at HadoopFileSystemTest.java:85
        Caused by: java.lang.ClassNotFoundException at HadoopFileSystemTest.java:85
    java.lang.NullPointerException at HadoopFileSystemTest.java:93

org.apache.beam.sdk.io.hdfs.HadoopFileSystemTest > testCreateAndReadFileWithShiftToEnd FAILED
    java.lang.NoClassDefFoundError at HadoopFileSystemTest.java:85
        Caused by: java.lang.ClassNotFoundException at HadoopFileSystemTest.java:85
    java.lang.NullPointerException at HadoopFileSystemTest.java:93

org.apache.beam.sdk.io.hdfs.HadoopFileSystemTest > testCopySourceMissing FAILED
    java.lang.NoClassDefFoundError at HadoopFileSystemTest.java:85
        Caused by: java.lang.ClassNotFoundException at HadoopFileSystemTest.java:85
    java.lang.NullPointerException at HadoopFileSystemTest.java:93

org.apache.beam.sdk.io.hdfs.HadoopFileSystemTest > testRenameMissingSource FAILED
    java.lang.NoClassDefFoundError at HadoopFileSystemTest.java:85
        Caused by: java.lang.ClassNotFoundException at HadoopFileSystemTest.java:85
    java.lang.NullPointerException at HadoopFileSystemTest.java:93

org.apache.beam.sdk.io.hdfs.HadoopFileSystemTest > testMatchNewResource FAILED
    java.lang.NoClassDefFoundError at HadoopFileSystemTest.java:85
        Caused by: java.lang.ClassNotFoundException at HadoopFileSystemTest.java:85
    java.lang.NullPointerException at HadoopFileSystemTest.java:93

org.apache.beam.sdk.io.hdfs.HadoopFileSystemTest > testMatchForRecursiveGlob FAILED
    java.lang.NoClassDefFoundError at HadoopFileSystemTest.java:85
        Caused by: java.lang.ClassNotFoundException at HadoopFileSystemTest.java:85
    java.lang.NullPointerException at HadoopFileSystemTest.java:93

org.apache.beam.sdk.io.hdfs.HadoopFileSystemTest > testDelete FAILED
    java.lang.NoClassDefFoundError at HadoopFileSystemTest.java:85
        Caused by: java.lang.ClassNotFoundException at HadoopFileSystemTest.java:85
    java.lang.NullPointerException at HadoopFileSystemTest.java:93

org.apache.beam.sdk.io.hdfs.HadoopFileSystemTest > testRename FAILED
    java.lang.NoClassDefFoundError at HadoopFileSystemTest.java:85
        Caused by: java.lang.ClassNotFoundException at HadoopFileSystemTest.java:85
    java.lang.NullPointerException at HadoopFileSystemTest.java:93

org.apache.beam.sdk.io.hdfs.HadoopResourceIdTest > testGetFilename FAILED
    java.lang.NoClassDefFoundError at HadoopResourceIdTest.java:50
        Caused by: java.lang.ClassNotFoundException at HadoopResourceIdTest.java:50
    java.lang.NullPointerException at HadoopResourceIdTest.java:61

org.apache.beam.sdk.io.hdfs.HadoopResourceIdTest > testResourceIdTester FAILED
    java.lang.NoClassDefFoundError at HadoopResourceIdTest.java:50
        Caused by: java.lang.ClassNotFoundException at HadoopResourceIdTest.java:50
    java.lang.NullPointerException at HadoopResourceIdTest.java:61

34 tests completed, 20 failed, 1 skipped

> Task :sdks:java:io:hadoop-file-system:hadoopVersion321Test FAILED
> Task :sdks:java:io:hadoop-format:runHadoopFormatIO2101Test
> Task :sdks:java:io:hadoop-format:runHadoopFormatIO285ElasticIT
> Task :sdks:java:io:hadoop-format:runHadoopFormatIO285IT
> Task :sdks:java:io:hadoop-format:runHadoopFormatIO285Test
> Task :sdks:java:io:hadoop-format:runHadoopFormatIO292ElasticIT
> Task :sdks:java:io:hadoop-format:runHadoopFormatIO292IT
> Task :sdks:java:io:hadoop-format:runHadoopFormatIO292Test
> Task :sdks:java:io:hadoop-format:runHadoopFormatIO321ElasticIT
> Task :sdks:java:io:hadoop-format:runHadoopFormatIO321IT
> Task :sdks:java:io:hadoop-format:runHadoopFormatIO321Test
> Task :sdks:java:io:hadoop-format:hadoopVersionsTest

FAILURE: Build completed with 3 failures.

1: Task failed with an exception.
-----------
* What went wrong:
Execution failed for task ':sdks:java:io:hadoop-file-system:hadoopVersion285Test'.
> There were failing tests. See the report at: file://<https://ci-beam.apache.org/job/beam_PostCommit_Java_Hadoop_Versions/ws/src/sdks/java/io/hadoop-file-system/build/reports/tests/hadoopVersion285Test/index.html>

* Try:
> Run with --stacktrace option to get the stack trace.
> Run with --info or --debug option to get more log output.
> Run with --scan to get full insights.
==============================================================================

2: Task failed with an exception.
-----------
* What went wrong:
Execution failed for task ':sdks:java:io:hadoop-file-system:hadoopVersion292Test'.
> There were failing tests. See the report at: file://<https://ci-beam.apache.org/job/beam_PostCommit_Java_Hadoop_Versions/ws/src/sdks/java/io/hadoop-file-system/build/reports/tests/hadoopVersion292Test/index.html>

* Try:
> Run with --stacktrace option to get the stack trace.
> Run with --info or --debug option to get more log output.
> Run with --scan to get full insights.
==============================================================================

3: Task failed with an exception.
-----------
* What went wrong:
Execution failed for task ':sdks:java:io:hadoop-file-system:hadoopVersion321Test'.
> There were failing tests. See the report at: file://<https://ci-beam.apache.org/job/beam_PostCommit_Java_Hadoop_Versions/ws/src/sdks/java/io/hadoop-file-system/build/reports/tests/hadoopVersion321Test/index.html>

* Try:
> Run with --stacktrace option to get the stack trace.
> Run with --info or --debug option to get more log output.
> Run with --scan to get full insights.
==============================================================================

* Get more help at https://help.gradle.org

BUILD FAILED in 16m 14s
180 actionable tasks: 99 executed, 79 from cache, 2 up-to-date

Publishing build scan...
https://gradle.com/s/oxkf3y3m3b6cw

Build step 'Invoke Gradle script' changed build result to FAILURE
Build step 'Invoke Gradle script' marked build as failure

---------------------------------------------------------------------
To unsubscribe, e-mail: builds-unsubscribe@beam.apache.org
For additional commands, e-mail: builds-help@beam.apache.org


Build failed in Jenkins: beam_PostCommit_Java_Hadoop_Versions #1265

Posted by Apache Jenkins Server <je...@builds.apache.org>.
See <https://ci-beam.apache.org/job/beam_PostCommit_Java_Hadoop_Versions/1265/display/redirect>

Changes:


------------------------------------------
[...truncated 72.88 KB...]
    java.lang.NullPointerException at HadoopFileSystemRegistrarTest.java:61

org.apache.beam.sdk.io.hdfs.HadoopFileSystemTest > testDeleteNonExisting FAILED
    java.lang.NoSuchMethodError at HadoopFileSystemTest.java:85
    java.lang.NullPointerException at HadoopFileSystemTest.java:93

org.apache.beam.sdk.io.hdfs.HadoopFileSystemTest > testRenameExistingDestination FAILED
    java.lang.NoSuchMethodError at HadoopFileSystemTest.java:85
    java.lang.NullPointerException at HadoopFileSystemTest.java:93

org.apache.beam.sdk.io.hdfs.HadoopFileSystemTest > testMatch FAILED
    java.lang.NoSuchMethodError at HadoopFileSystemTest.java:85
    java.lang.NullPointerException at HadoopFileSystemTest.java:93

org.apache.beam.sdk.io.hdfs.HadoopFileSystemTest > testCopy FAILED
    java.lang.NoSuchMethodError at HadoopFileSystemTest.java:85
    java.lang.NullPointerException at HadoopFileSystemTest.java:93

org.apache.beam.sdk.io.hdfs.HadoopFileSystemTest > testMatchForNonExistentFile FAILED
    java.lang.NoSuchMethodError at HadoopFileSystemTest.java:85
    java.lang.NullPointerException at HadoopFileSystemTest.java:93

org.apache.beam.sdk.io.hdfs.HadoopFileSystemTest > testCreateAndReadFile FAILED
    java.lang.NoSuchMethodError at HadoopFileSystemTest.java:85
    java.lang.NullPointerException at HadoopFileSystemTest.java:93

org.apache.beam.sdk.io.hdfs.HadoopFileSystemTest > testMatchDirectory FAILED
    java.lang.NoSuchMethodError at HadoopFileSystemTest.java:85
    java.lang.NullPointerException at HadoopFileSystemTest.java:93

org.apache.beam.sdk.io.hdfs.HadoopFileSystemTest > testRenameRetryScenario FAILED
    java.lang.NoSuchMethodError at HadoopFileSystemTest.java:85
    java.lang.NullPointerException at HadoopFileSystemTest.java:93

org.apache.beam.sdk.io.hdfs.HadoopFileSystemTest > testRenameMissingTargetDir FAILED
    java.lang.NoSuchMethodError at HadoopFileSystemTest.java:85
    java.lang.NullPointerException at HadoopFileSystemTest.java:93

org.apache.beam.sdk.io.hdfs.HadoopFileSystemTest > testCreateAndReadFileWithShift FAILED
    java.lang.NoSuchMethodError at HadoopFileSystemTest.java:85
    java.lang.NullPointerException at HadoopFileSystemTest.java:93

org.apache.beam.sdk.io.hdfs.HadoopFileSystemTest > testCreateAndReadFileWithShiftToEnd FAILED
    java.lang.NoSuchMethodError at HadoopFileSystemTest.java:85
    java.lang.NullPointerException at HadoopFileSystemTest.java:93

org.apache.beam.sdk.io.hdfs.HadoopFileSystemTest > testCopySourceMissing FAILED
    java.lang.NoSuchMethodError at HadoopFileSystemTest.java:85
    java.lang.NullPointerException at HadoopFileSystemTest.java:93

org.apache.beam.sdk.io.hdfs.HadoopFileSystemTest > testRenameMissingSource FAILED
    java.lang.NoSuchMethodError at HadoopFileSystemTest.java:85
    java.lang.NullPointerException at HadoopFileSystemTest.java:93

org.apache.beam.sdk.io.hdfs.HadoopFileSystemTest > testMatchNewResource FAILED
    java.lang.NoSuchMethodError at HadoopFileSystemTest.java:85
    java.lang.NullPointerException at HadoopFileSystemTest.java:93

org.apache.beam.sdk.io.hdfs.HadoopFileSystemTest > testMatchForRecursiveGlob FAILED
    java.lang.NoSuchMethodError at HadoopFileSystemTest.java:85
    java.lang.NullPointerException at HadoopFileSystemTest.java:93

org.apache.beam.sdk.io.hdfs.HadoopFileSystemTest > testDelete FAILED
    java.lang.NoSuchMethodError at HadoopFileSystemTest.java:85
    java.lang.NullPointerException at HadoopFileSystemTest.java:93

org.apache.beam.sdk.io.hdfs.HadoopFileSystemTest > testRename FAILED
    java.lang.NoSuchMethodError at HadoopFileSystemTest.java:85
    java.lang.NullPointerException at HadoopFileSystemTest.java:93

org.apache.beam.sdk.io.hdfs.HadoopResourceIdTest > testGetFilename FAILED
    java.lang.NoSuchMethodError at HadoopResourceIdTest.java:50
    java.lang.NullPointerException at HadoopResourceIdTest.java:61

> Task :sdks:java:io:hadoop-format:runHadoopFormatIO2101IT

> Task :sdks:java:io:hadoop-file-system:hadoopVersion292Test FAILED

org.apache.beam.sdk.io.hdfs.HadoopResourceIdTest > testResourceIdTester FAILED
    java.lang.NoSuchMethodError at HadoopResourceIdTest.java:50
    java.lang.NullPointerException at HadoopResourceIdTest.java:61

34 tests completed, 20 failed, 1 skipped

> Task :sdks:java:io:hadoop-file-system:hadoopVersion321Test

org.apache.beam.sdk.io.hdfs.HadoopFileSystemRegistrarTest > testServiceLoader FAILED
    java.lang.NoClassDefFoundError at HadoopFileSystemRegistrarTest.java:55
        Caused by: java.lang.ClassNotFoundException at HadoopFileSystemRegistrarTest.java:55
    java.lang.NullPointerException at HadoopFileSystemRegistrarTest.java:61

org.apache.beam.sdk.io.hdfs.HadoopFileSystemTest > testDeleteNonExisting FAILED
    java.lang.NoClassDefFoundError at HadoopFileSystemTest.java:85
        Caused by: java.lang.ClassNotFoundException at HadoopFileSystemTest.java:85
    java.lang.NullPointerException at HadoopFileSystemTest.java:93

org.apache.beam.sdk.io.hdfs.HadoopFileSystemTest > testRenameExistingDestination FAILED
    java.lang.NoClassDefFoundError at HadoopFileSystemTest.java:85
        Caused by: java.lang.ClassNotFoundException at HadoopFileSystemTest.java:85
    java.lang.NullPointerException at HadoopFileSystemTest.java:93

org.apache.beam.sdk.io.hdfs.HadoopFileSystemTest > testMatch FAILED
    java.lang.NoClassDefFoundError at HadoopFileSystemTest.java:85
        Caused by: java.lang.ClassNotFoundException at HadoopFileSystemTest.java:85
    java.lang.NullPointerException at HadoopFileSystemTest.java:93

org.apache.beam.sdk.io.hdfs.HadoopFileSystemTest > testCopy FAILED
    java.lang.NoClassDefFoundError at HadoopFileSystemTest.java:85
        Caused by: java.lang.ClassNotFoundException at HadoopFileSystemTest.java:85
    java.lang.NullPointerException at HadoopFileSystemTest.java:93

org.apache.beam.sdk.io.hdfs.HadoopFileSystemTest > testMatchForNonExistentFile FAILED
    java.lang.NoClassDefFoundError at HadoopFileSystemTest.java:85
        Caused by: java.lang.ClassNotFoundException at HadoopFileSystemTest.java:85
    java.lang.NullPointerException at HadoopFileSystemTest.java:93

org.apache.beam.sdk.io.hdfs.HadoopFileSystemTest > testCreateAndReadFile FAILED
    java.lang.NoClassDefFoundError at HadoopFileSystemTest.java:85
        Caused by: java.lang.ClassNotFoundException at HadoopFileSystemTest.java:85
    java.lang.NullPointerException at HadoopFileSystemTest.java:93

org.apache.beam.sdk.io.hdfs.HadoopFileSystemTest > testMatchDirectory FAILED
    java.lang.NoClassDefFoundError at HadoopFileSystemTest.java:85
        Caused by: java.lang.ClassNotFoundException at HadoopFileSystemTest.java:85
    java.lang.NullPointerException at HadoopFileSystemTest.java:93

org.apache.beam.sdk.io.hdfs.HadoopFileSystemTest > testRenameRetryScenario FAILED
    java.lang.NoClassDefFoundError at HadoopFileSystemTest.java:85
        Caused by: java.lang.ClassNotFoundException at HadoopFileSystemTest.java:85
    java.lang.NullPointerException at HadoopFileSystemTest.java:93

org.apache.beam.sdk.io.hdfs.HadoopFileSystemTest > testRenameMissingTargetDir FAILED
    java.lang.NoClassDefFoundError at HadoopFileSystemTest.java:85
        Caused by: java.lang.ClassNotFoundException at HadoopFileSystemTest.java:85
    java.lang.NullPointerException at HadoopFileSystemTest.java:93

org.apache.beam.sdk.io.hdfs.HadoopFileSystemTest > testCreateAndReadFileWithShift FAILED
    java.lang.NoClassDefFoundError at HadoopFileSystemTest.java:85
        Caused by: java.lang.ClassNotFoundException at HadoopFileSystemTest.java:85
    java.lang.NullPointerException at HadoopFileSystemTest.java:93

org.apache.beam.sdk.io.hdfs.HadoopFileSystemTest > testCreateAndReadFileWithShiftToEnd FAILED
    java.lang.NoClassDefFoundError at HadoopFileSystemTest.java:85
        Caused by: java.lang.ClassNotFoundException at HadoopFileSystemTest.java:85
    java.lang.NullPointerException at HadoopFileSystemTest.java:93

org.apache.beam.sdk.io.hdfs.HadoopFileSystemTest > testCopySourceMissing FAILED
    java.lang.NoClassDefFoundError at HadoopFileSystemTest.java:85
        Caused by: java.lang.ClassNotFoundException at HadoopFileSystemTest.java:85
    java.lang.NullPointerException at HadoopFileSystemTest.java:93

org.apache.beam.sdk.io.hdfs.HadoopFileSystemTest > testRenameMissingSource FAILED
    java.lang.NoClassDefFoundError at HadoopFileSystemTest.java:85
        Caused by: java.lang.ClassNotFoundException at HadoopFileSystemTest.java:85
    java.lang.NullPointerException at HadoopFileSystemTest.java:93

org.apache.beam.sdk.io.hdfs.HadoopFileSystemTest > testMatchNewResource FAILED
    java.lang.NoClassDefFoundError at HadoopFileSystemTest.java:85
        Caused by: java.lang.ClassNotFoundException at HadoopFileSystemTest.java:85
    java.lang.NullPointerException at HadoopFileSystemTest.java:93

org.apache.beam.sdk.io.hdfs.HadoopFileSystemTest > testMatchForRecursiveGlob FAILED
    java.lang.NoClassDefFoundError at HadoopFileSystemTest.java:85
        Caused by: java.lang.ClassNotFoundException at HadoopFileSystemTest.java:85
    java.lang.NullPointerException at HadoopFileSystemTest.java:93

org.apache.beam.sdk.io.hdfs.HadoopFileSystemTest > testDelete FAILED
    java.lang.NoClassDefFoundError at HadoopFileSystemTest.java:85
        Caused by: java.lang.ClassNotFoundException at HadoopFileSystemTest.java:85
    java.lang.NullPointerException at HadoopFileSystemTest.java:93

org.apache.beam.sdk.io.hdfs.HadoopFileSystemTest > testRename FAILED
    java.lang.NoClassDefFoundError at HadoopFileSystemTest.java:85
        Caused by: java.lang.ClassNotFoundException at HadoopFileSystemTest.java:85
    java.lang.NullPointerException at HadoopFileSystemTest.java:93

org.apache.beam.sdk.io.hdfs.HadoopResourceIdTest > testGetFilename FAILED
    java.lang.NoClassDefFoundError at HadoopResourceIdTest.java:50
        Caused by: java.lang.ClassNotFoundException at HadoopResourceIdTest.java:50
    java.lang.NullPointerException at HadoopResourceIdTest.java:61

org.apache.beam.sdk.io.hdfs.HadoopResourceIdTest > testResourceIdTester FAILED
    java.lang.NoClassDefFoundError at HadoopResourceIdTest.java:50
        Caused by: java.lang.ClassNotFoundException at HadoopResourceIdTest.java:50
    java.lang.NullPointerException at HadoopResourceIdTest.java:61

34 tests completed, 20 failed, 1 skipped

> Task :sdks:java:io:hadoop-file-system:hadoopVersion321Test FAILED
> Task :sdks:java:io:hadoop-format:runHadoopFormatIO2101Test
> Task :sdks:java:io:hadoop-format:runHadoopFormatIO285ElasticIT
> Task :sdks:java:io:hadoop-format:runHadoopFormatIO285IT
> Task :sdks:java:io:hadoop-format:runHadoopFormatIO285Test
> Task :sdks:java:io:hadoop-format:runHadoopFormatIO292ElasticIT
> Task :sdks:java:io:hadoop-format:runHadoopFormatIO292IT
> Task :sdks:java:io:hadoop-format:runHadoopFormatIO292Test
> Task :sdks:java:io:hadoop-format:runHadoopFormatIO321ElasticIT
> Task :sdks:java:io:hadoop-format:runHadoopFormatIO321IT
> Task :sdks:java:io:hadoop-format:runHadoopFormatIO321Test
> Task :sdks:java:io:hadoop-format:hadoopVersionsTest

FAILURE: Build completed with 3 failures.

1: Task failed with an exception.
-----------
* What went wrong:
Execution failed for task ':sdks:java:io:hadoop-file-system:hadoopVersion285Test'.
> There were failing tests. See the report at: file://<https://ci-beam.apache.org/job/beam_PostCommit_Java_Hadoop_Versions/ws/src/sdks/java/io/hadoop-file-system/build/reports/tests/hadoopVersion285Test/index.html>

* Try:
> Run with --stacktrace option to get the stack trace.
> Run with --info or --debug option to get more log output.
> Run with --scan to get full insights.
==============================================================================

2: Task failed with an exception.
-----------
* What went wrong:
Execution failed for task ':sdks:java:io:hadoop-file-system:hadoopVersion292Test'.
> There were failing tests. See the report at: file://<https://ci-beam.apache.org/job/beam_PostCommit_Java_Hadoop_Versions/ws/src/sdks/java/io/hadoop-file-system/build/reports/tests/hadoopVersion292Test/index.html>

* Try:
> Run with --stacktrace option to get the stack trace.
> Run with --info or --debug option to get more log output.
> Run with --scan to get full insights.
==============================================================================

3: Task failed with an exception.
-----------
* What went wrong:
Execution failed for task ':sdks:java:io:hadoop-file-system:hadoopVersion321Test'.
> There were failing tests. See the report at: file://<https://ci-beam.apache.org/job/beam_PostCommit_Java_Hadoop_Versions/ws/src/sdks/java/io/hadoop-file-system/build/reports/tests/hadoopVersion321Test/index.html>

* Try:
> Run with --stacktrace option to get the stack trace.
> Run with --info or --debug option to get more log output.
> Run with --scan to get full insights.
==============================================================================

* Get more help at https://help.gradle.org

BUILD FAILED in 12m 12s
180 actionable tasks: 99 executed, 79 from cache, 2 up-to-date

Publishing build scan...
https://gradle.com/s/knaboz6s4hh3o

Build step 'Invoke Gradle script' changed build result to FAILURE
Build step 'Invoke Gradle script' marked build as failure

---------------------------------------------------------------------
To unsubscribe, e-mail: builds-unsubscribe@beam.apache.org
For additional commands, e-mail: builds-help@beam.apache.org


Build failed in Jenkins: beam_PostCommit_Java_Hadoop_Versions #1264

Posted by Apache Jenkins Server <je...@builds.apache.org>.
See <https://ci-beam.apache.org/job/beam_PostCommit_Java_Hadoop_Versions/1264/display/redirect>

Changes:


------------------------------------------
[...truncated 73.07 KB...]

org.apache.beam.sdk.io.hdfs.HadoopFileSystemRegistrarTest > testServiceLoader FAILED
    java.lang.NoSuchMethodError at HadoopFileSystemRegistrarTest.java:55
    java.lang.NullPointerException at HadoopFileSystemRegistrarTest.java:61

org.apache.beam.sdk.io.hdfs.HadoopFileSystemTest > testDeleteNonExisting FAILED
    java.lang.NoSuchMethodError at HadoopFileSystemTest.java:85
    java.lang.NullPointerException at HadoopFileSystemTest.java:93

org.apache.beam.sdk.io.hdfs.HadoopFileSystemTest > testRenameExistingDestination FAILED
    java.lang.NoSuchMethodError at HadoopFileSystemTest.java:85
    java.lang.NullPointerException at HadoopFileSystemTest.java:93

org.apache.beam.sdk.io.hdfs.HadoopFileSystemTest > testMatch FAILED
    java.lang.NoSuchMethodError at HadoopFileSystemTest.java:85
    java.lang.NullPointerException at HadoopFileSystemTest.java:93

org.apache.beam.sdk.io.hdfs.HadoopFileSystemTest > testCopy FAILED
    java.lang.NoSuchMethodError at HadoopFileSystemTest.java:85
    java.lang.NullPointerException at HadoopFileSystemTest.java:93

org.apache.beam.sdk.io.hdfs.HadoopFileSystemTest > testMatchForNonExistentFile FAILED
    java.lang.NoSuchMethodError at HadoopFileSystemTest.java:85
    java.lang.NullPointerException at HadoopFileSystemTest.java:93

org.apache.beam.sdk.io.hdfs.HadoopFileSystemTest > testCreateAndReadFile FAILED
    java.lang.NoSuchMethodError at HadoopFileSystemTest.java:85
    java.lang.NullPointerException at HadoopFileSystemTest.java:93

org.apache.beam.sdk.io.hdfs.HadoopFileSystemTest > testMatchDirectory FAILED
    java.lang.NoSuchMethodError at HadoopFileSystemTest.java:85
    java.lang.NullPointerException at HadoopFileSystemTest.java:93

org.apache.beam.sdk.io.hdfs.HadoopFileSystemTest > testRenameRetryScenario FAILED
    java.lang.NoSuchMethodError at HadoopFileSystemTest.java:85
    java.lang.NullPointerException at HadoopFileSystemTest.java:93

org.apache.beam.sdk.io.hdfs.HadoopFileSystemTest > testRenameMissingTargetDir FAILED
    java.lang.NoSuchMethodError at HadoopFileSystemTest.java:85
    java.lang.NullPointerException at HadoopFileSystemTest.java:93

org.apache.beam.sdk.io.hdfs.HadoopFileSystemTest > testCreateAndReadFileWithShift FAILED
    java.lang.NoSuchMethodError at HadoopFileSystemTest.java:85
    java.lang.NullPointerException at HadoopFileSystemTest.java:93

org.apache.beam.sdk.io.hdfs.HadoopFileSystemTest > testCreateAndReadFileWithShiftToEnd FAILED
    java.lang.NoSuchMethodError at HadoopFileSystemTest.java:85
    java.lang.NullPointerException at HadoopFileSystemTest.java:93

org.apache.beam.sdk.io.hdfs.HadoopFileSystemTest > testCopySourceMissing FAILED
    java.lang.NoSuchMethodError at HadoopFileSystemTest.java:85
    java.lang.NullPointerException at HadoopFileSystemTest.java:93

org.apache.beam.sdk.io.hdfs.HadoopFileSystemTest > testRenameMissingSource FAILED
    java.lang.NoSuchMethodError at HadoopFileSystemTest.java:85
    java.lang.NullPointerException at HadoopFileSystemTest.java:93

org.apache.beam.sdk.io.hdfs.HadoopFileSystemTest > testMatchNewResource FAILED
    java.lang.NoSuchMethodError at HadoopFileSystemTest.java:85
    java.lang.NullPointerException at HadoopFileSystemTest.java:93

org.apache.beam.sdk.io.hdfs.HadoopFileSystemTest > testMatchForRecursiveGlob FAILED
    java.lang.NoSuchMethodError at HadoopFileSystemTest.java:85
    java.lang.NullPointerException at HadoopFileSystemTest.java:93

org.apache.beam.sdk.io.hdfs.HadoopFileSystemTest > testDelete FAILED
    java.lang.NoSuchMethodError at HadoopFileSystemTest.java:85
    java.lang.NullPointerException at HadoopFileSystemTest.java:93

org.apache.beam.sdk.io.hdfs.HadoopFileSystemTest > testRename FAILED
    java.lang.NoSuchMethodError at HadoopFileSystemTest.java:85
    java.lang.NullPointerException at HadoopFileSystemTest.java:93

org.apache.beam.sdk.io.hdfs.HadoopResourceIdTest > testGetFilename FAILED
    java.lang.NoSuchMethodError at HadoopResourceIdTest.java:50
    java.lang.NullPointerException at HadoopResourceIdTest.java:61

org.apache.beam.sdk.io.hdfs.HadoopResourceIdTest > testResourceIdTester FAILED
    java.lang.NoSuchMethodError at HadoopResourceIdTest.java:50
    java.lang.NullPointerException at HadoopResourceIdTest.java:61

34 tests completed, 20 failed, 1 skipped

> Task :sdks:java:io:hadoop-file-system:hadoopVersion292Test FAILED
> Task :sdks:java:io:hadoop-format:runHadoopFormatIO2101Test

> Task :sdks:java:io:hadoop-file-system:hadoopVersion321Test FAILED

org.apache.beam.sdk.io.hdfs.HadoopFileSystemRegistrarTest > testServiceLoader FAILED
    java.lang.NoClassDefFoundError at HadoopFileSystemRegistrarTest.java:55
        Caused by: java.lang.ClassNotFoundException at HadoopFileSystemRegistrarTest.java:55
    java.lang.NullPointerException at HadoopFileSystemRegistrarTest.java:61

org.apache.beam.sdk.io.hdfs.HadoopFileSystemTest > testDeleteNonExisting FAILED
    java.lang.NoClassDefFoundError at HadoopFileSystemTest.java:85
        Caused by: java.lang.ClassNotFoundException at HadoopFileSystemTest.java:85
    java.lang.NullPointerException at HadoopFileSystemTest.java:93

org.apache.beam.sdk.io.hdfs.HadoopFileSystemTest > testRenameExistingDestination FAILED
    java.lang.NoClassDefFoundError at HadoopFileSystemTest.java:85
        Caused by: java.lang.ClassNotFoundException at HadoopFileSystemTest.java:85
    java.lang.NullPointerException at HadoopFileSystemTest.java:93

org.apache.beam.sdk.io.hdfs.HadoopFileSystemTest > testMatch FAILED
    java.lang.NoClassDefFoundError at HadoopFileSystemTest.java:85
        Caused by: java.lang.ClassNotFoundException at HadoopFileSystemTest.java:85
    java.lang.NullPointerException at HadoopFileSystemTest.java:93

org.apache.beam.sdk.io.hdfs.HadoopFileSystemTest > testCopy FAILED
    java.lang.NoClassDefFoundError at HadoopFileSystemTest.java:85
        Caused by: java.lang.ClassNotFoundException at HadoopFileSystemTest.java:85
    java.lang.NullPointerException at HadoopFileSystemTest.java:93

org.apache.beam.sdk.io.hdfs.HadoopFileSystemTest > testMatchForNonExistentFile FAILED
    java.lang.NoClassDefFoundError at HadoopFileSystemTest.java:85
        Caused by: java.lang.ClassNotFoundException at HadoopFileSystemTest.java:85
    java.lang.NullPointerException at HadoopFileSystemTest.java:93

org.apache.beam.sdk.io.hdfs.HadoopFileSystemTest > testCreateAndReadFile FAILED
    java.lang.NoClassDefFoundError at HadoopFileSystemTest.java:85
        Caused by: java.lang.ClassNotFoundException at HadoopFileSystemTest.java:85
    java.lang.NullPointerException at HadoopFileSystemTest.java:93

org.apache.beam.sdk.io.hdfs.HadoopFileSystemTest > testMatchDirectory FAILED
    java.lang.NoClassDefFoundError at HadoopFileSystemTest.java:85
        Caused by: java.lang.ClassNotFoundException at HadoopFileSystemTest.java:85
    java.lang.NullPointerException at HadoopFileSystemTest.java:93

org.apache.beam.sdk.io.hdfs.HadoopFileSystemTest > testRenameRetryScenario FAILED
    java.lang.NoClassDefFoundError at HadoopFileSystemTest.java:85
        Caused by: java.lang.ClassNotFoundException at HadoopFileSystemTest.java:85
    java.lang.NullPointerException at HadoopFileSystemTest.java:93

org.apache.beam.sdk.io.hdfs.HadoopFileSystemTest > testRenameMissingTargetDir FAILED
    java.lang.NoClassDefFoundError at HadoopFileSystemTest.java:85
        Caused by: java.lang.ClassNotFoundException at HadoopFileSystemTest.java:85
    java.lang.NullPointerException at HadoopFileSystemTest.java:93

org.apache.beam.sdk.io.hdfs.HadoopFileSystemTest > testCreateAndReadFileWithShift FAILED
    java.lang.NoClassDefFoundError at HadoopFileSystemTest.java:85
        Caused by: java.lang.ClassNotFoundException at HadoopFileSystemTest.java:85
    java.lang.NullPointerException at HadoopFileSystemTest.java:93

org.apache.beam.sdk.io.hdfs.HadoopFileSystemTest > testCreateAndReadFileWithShiftToEnd FAILED
    java.lang.NoClassDefFoundError at HadoopFileSystemTest.java:85
        Caused by: java.lang.ClassNotFoundException at HadoopFileSystemTest.java:85
    java.lang.NullPointerException at HadoopFileSystemTest.java:93

org.apache.beam.sdk.io.hdfs.HadoopFileSystemTest > testCopySourceMissing FAILED
    java.lang.NoClassDefFoundError at HadoopFileSystemTest.java:85
        Caused by: java.lang.ClassNotFoundException at HadoopFileSystemTest.java:85
    java.lang.NullPointerException at HadoopFileSystemTest.java:93

org.apache.beam.sdk.io.hdfs.HadoopFileSystemTest > testRenameMissingSource FAILED
    java.lang.NoClassDefFoundError at HadoopFileSystemTest.java:85
        Caused by: java.lang.ClassNotFoundException at HadoopFileSystemTest.java:85
    java.lang.NullPointerException at HadoopFileSystemTest.java:93

org.apache.beam.sdk.io.hdfs.HadoopFileSystemTest > testMatchNewResource FAILED
    java.lang.NoClassDefFoundError at HadoopFileSystemTest.java:85
        Caused by: java.lang.ClassNotFoundException at HadoopFileSystemTest.java:85
    java.lang.NullPointerException at HadoopFileSystemTest.java:93

org.apache.beam.sdk.io.hdfs.HadoopFileSystemTest > testMatchForRecursiveGlob FAILED
    java.lang.NoClassDefFoundError at HadoopFileSystemTest.java:85
        Caused by: java.lang.ClassNotFoundException at HadoopFileSystemTest.java:85
    java.lang.NullPointerException at HadoopFileSystemTest.java:93

org.apache.beam.sdk.io.hdfs.HadoopFileSystemTest > testDelete FAILED
    java.lang.NoClassDefFoundError at HadoopFileSystemTest.java:85
        Caused by: java.lang.ClassNotFoundException at HadoopFileSystemTest.java:85
    java.lang.NullPointerException at HadoopFileSystemTest.java:93

org.apache.beam.sdk.io.hdfs.HadoopFileSystemTest > testRename FAILED
    java.lang.NoClassDefFoundError at HadoopFileSystemTest.java:85
        Caused by: java.lang.ClassNotFoundException at HadoopFileSystemTest.java:85
    java.lang.NullPointerException at HadoopFileSystemTest.java:93

org.apache.beam.sdk.io.hdfs.HadoopResourceIdTest > testGetFilename FAILED
    java.lang.NoClassDefFoundError at HadoopResourceIdTest.java:50
        Caused by: java.lang.ClassNotFoundException at HadoopResourceIdTest.java:50
    java.lang.NullPointerException at HadoopResourceIdTest.java:61

org.apache.beam.sdk.io.hdfs.HadoopResourceIdTest > testResourceIdTester FAILED
    java.lang.NoClassDefFoundError at HadoopResourceIdTest.java:50
        Caused by: java.lang.ClassNotFoundException at HadoopResourceIdTest.java:50
    java.lang.NullPointerException at HadoopResourceIdTest.java:61

34 tests completed, 20 failed, 1 skipped

> Task :sdks:java:io:hadoop-format:runHadoopFormatIO285ElasticIT
> Task :sdks:java:io:hadoop-format:runHadoopFormatIO285IT
> Task :sdks:java:io:hadoop-format:runHadoopFormatIO285Test
> Task :sdks:java:io:hadoop-format:runHadoopFormatIO292ElasticIT
> Task :sdks:java:io:hadoop-format:runHadoopFormatIO292IT
> Task :sdks:java:io:hadoop-format:runHadoopFormatIO292Test
> Task :sdks:java:io:hadoop-format:runHadoopFormatIO321ElasticIT
> Task :sdks:java:io:hadoop-format:runHadoopFormatIO321IT
> Task :sdks:java:io:hadoop-format:runHadoopFormatIO321Test
> Task :sdks:java:io:hadoop-format:hadoopVersionsTest

FAILURE: Build completed with 3 failures.

1: Task failed with an exception.
-----------
* What went wrong:
Execution failed for task ':sdks:java:io:hadoop-file-system:hadoopVersion285Test'.
> There were failing tests. See the report at: file://<https://ci-beam.apache.org/job/beam_PostCommit_Java_Hadoop_Versions/ws/src/sdks/java/io/hadoop-file-system/build/reports/tests/hadoopVersion285Test/index.html>

* Try:
> Run with --stacktrace option to get the stack trace.
> Run with --info or --debug option to get more log output.
> Run with --scan to get full insights.
==============================================================================

2: Task failed with an exception.
-----------
* What went wrong:
Execution failed for task ':sdks:java:io:hadoop-file-system:hadoopVersion292Test'.
> There were failing tests. See the report at: file://<https://ci-beam.apache.org/job/beam_PostCommit_Java_Hadoop_Versions/ws/src/sdks/java/io/hadoop-file-system/build/reports/tests/hadoopVersion292Test/index.html>

* Try:
> Run with --stacktrace option to get the stack trace.
> Run with --info or --debug option to get more log output.
> Run with --scan to get full insights.
==============================================================================

3: Task failed with an exception.
-----------
* What went wrong:
Execution failed for task ':sdks:java:io:hadoop-file-system:hadoopVersion321Test'.
> There were failing tests. See the report at: file://<https://ci-beam.apache.org/job/beam_PostCommit_Java_Hadoop_Versions/ws/src/sdks/java/io/hadoop-file-system/build/reports/tests/hadoopVersion321Test/index.html>

* Try:
> Run with --stacktrace option to get the stack trace.
> Run with --info or --debug option to get more log output.
> Run with --scan to get full insights.
==============================================================================

* Get more help at https://help.gradle.org

BUILD FAILED in 19m 50s
180 actionable tasks: 99 executed, 79 from cache, 2 up-to-date

Publishing build scan...
https://gradle.com/s/hlzsj2hwwmans

Build step 'Invoke Gradle script' changed build result to FAILURE
Build step 'Invoke Gradle script' marked build as failure

---------------------------------------------------------------------
To unsubscribe, e-mail: builds-unsubscribe@beam.apache.org
For additional commands, e-mail: builds-help@beam.apache.org


Build failed in Jenkins: beam_PostCommit_Java_Hadoop_Versions #1263

Posted by Apache Jenkins Server <je...@builds.apache.org>.
See <https://ci-beam.apache.org/job/beam_PostCommit_Java_Hadoop_Versions/1263/display/redirect>

Changes:


------------------------------------------
[...truncated 74.16 KB...]
org.apache.beam.sdk.io.hdfs.HadoopFileSystemTest > testDeleteNonExisting FAILED
    java.lang.NoSuchMethodError at HadoopFileSystemTest.java:85
    java.lang.NullPointerException at HadoopFileSystemTest.java:93

org.apache.beam.sdk.io.hdfs.HadoopFileSystemTest > testRenameExistingDestination FAILED
    java.lang.NoSuchMethodError at HadoopFileSystemTest.java:85
    java.lang.NullPointerException at HadoopFileSystemTest.java:93

org.apache.beam.sdk.io.hdfs.HadoopFileSystemTest > testMatch FAILED
    java.lang.NoSuchMethodError at HadoopFileSystemTest.java:85
    java.lang.NullPointerException at HadoopFileSystemTest.java:93

org.apache.beam.sdk.io.hdfs.HadoopFileSystemTest > testCopy FAILED
    java.lang.NoSuchMethodError at HadoopFileSystemTest.java:85
    java.lang.NullPointerException at HadoopFileSystemTest.java:93

org.apache.beam.sdk.io.hdfs.HadoopFileSystemTest > testMatchForNonExistentFile FAILED
    java.lang.NoSuchMethodError at HadoopFileSystemTest.java:85
    java.lang.NullPointerException at HadoopFileSystemTest.java:93

org.apache.beam.sdk.io.hdfs.HadoopFileSystemTest > testCreateAndReadFile FAILED
    java.lang.NoSuchMethodError at HadoopFileSystemTest.java:85
    java.lang.NullPointerException at HadoopFileSystemTest.java:93

org.apache.beam.sdk.io.hdfs.HadoopFileSystemTest > testMatchDirectory FAILED
    java.lang.NoSuchMethodError at HadoopFileSystemTest.java:85
    java.lang.NullPointerException at HadoopFileSystemTest.java:93

> Task :sdks:java:io:hadoop-format:runHadoopFormatIO2101IT

> Task :sdks:java:io:hadoop-file-system:hadoopVersion292Test

org.apache.beam.sdk.io.hdfs.HadoopFileSystemTest > testRenameRetryScenario FAILED
    java.lang.NoSuchMethodError at HadoopFileSystemTest.java:85
    java.lang.NullPointerException at HadoopFileSystemTest.java:93

org.apache.beam.sdk.io.hdfs.HadoopFileSystemTest > testRenameMissingTargetDir FAILED
    java.lang.NoSuchMethodError at HadoopFileSystemTest.java:85
    java.lang.NullPointerException at HadoopFileSystemTest.java:93

org.apache.beam.sdk.io.hdfs.HadoopFileSystemTest > testCreateAndReadFileWithShift FAILED
    java.lang.NoSuchMethodError at HadoopFileSystemTest.java:85
    java.lang.NullPointerException at HadoopFileSystemTest.java:93

org.apache.beam.sdk.io.hdfs.HadoopFileSystemTest > testCreateAndReadFileWithShiftToEnd FAILED
    java.lang.NoSuchMethodError at HadoopFileSystemTest.java:85
    java.lang.NullPointerException at HadoopFileSystemTest.java:93

org.apache.beam.sdk.io.hdfs.HadoopFileSystemTest > testCopySourceMissing FAILED
    java.lang.NoSuchMethodError at HadoopFileSystemTest.java:85
    java.lang.NullPointerException at HadoopFileSystemTest.java:93

org.apache.beam.sdk.io.hdfs.HadoopFileSystemTest > testRenameMissingSource FAILED
    java.lang.NoSuchMethodError at HadoopFileSystemTest.java:85
    java.lang.NullPointerException at HadoopFileSystemTest.java:93

org.apache.beam.sdk.io.hdfs.HadoopFileSystemTest > testMatchNewResource FAILED
    java.lang.NoSuchMethodError at HadoopFileSystemTest.java:85
    java.lang.NullPointerException at HadoopFileSystemTest.java:93

org.apache.beam.sdk.io.hdfs.HadoopFileSystemTest > testMatchForRecursiveGlob FAILED
    java.lang.NoSuchMethodError at HadoopFileSystemTest.java:85
    java.lang.NullPointerException at HadoopFileSystemTest.java:93

org.apache.beam.sdk.io.hdfs.HadoopFileSystemTest > testDelete FAILED
    java.lang.NoSuchMethodError at HadoopFileSystemTest.java:85
    java.lang.NullPointerException at HadoopFileSystemTest.java:93

org.apache.beam.sdk.io.hdfs.HadoopFileSystemTest > testRename FAILED
    java.lang.NoSuchMethodError at HadoopFileSystemTest.java:85
    java.lang.NullPointerException at HadoopFileSystemTest.java:93

org.apache.beam.sdk.io.hdfs.HadoopResourceIdTest > testGetFilename FAILED
    java.lang.NoSuchMethodError at HadoopResourceIdTest.java:50
    java.lang.NullPointerException at HadoopResourceIdTest.java:61

org.apache.beam.sdk.io.hdfs.HadoopResourceIdTest > testResourceIdTester FAILED
    java.lang.NoSuchMethodError at HadoopResourceIdTest.java:50
    java.lang.NullPointerException at HadoopResourceIdTest.java:61

34 tests completed, 20 failed, 1 skipped

> Task :sdks:java:io:hadoop-file-system:hadoopVersion292Test FAILED

> Task :sdks:java:io:hadoop-file-system:hadoopVersion321Test

org.apache.beam.sdk.io.hdfs.HadoopFileSystemRegistrarTest > testServiceLoader FAILED
    java.lang.NoClassDefFoundError at HadoopFileSystemRegistrarTest.java:55
        Caused by: java.lang.ClassNotFoundException at HadoopFileSystemRegistrarTest.java:55
    java.lang.NullPointerException at HadoopFileSystemRegistrarTest.java:61

org.apache.beam.sdk.io.hdfs.HadoopFileSystemTest > testDeleteNonExisting FAILED
    java.lang.NoClassDefFoundError at HadoopFileSystemTest.java:85
        Caused by: java.lang.ClassNotFoundException at HadoopFileSystemTest.java:85
    java.lang.NullPointerException at HadoopFileSystemTest.java:93

org.apache.beam.sdk.io.hdfs.HadoopFileSystemTest > testRenameExistingDestination FAILED
    java.lang.NoClassDefFoundError at HadoopFileSystemTest.java:85
        Caused by: java.lang.ClassNotFoundException at HadoopFileSystemTest.java:85
    java.lang.NullPointerException at HadoopFileSystemTest.java:93

org.apache.beam.sdk.io.hdfs.HadoopFileSystemTest > testMatch FAILED
    java.lang.NoClassDefFoundError at HadoopFileSystemTest.java:85
        Caused by: java.lang.ClassNotFoundException at HadoopFileSystemTest.java:85
    java.lang.NullPointerException at HadoopFileSystemTest.java:93

org.apache.beam.sdk.io.hdfs.HadoopFileSystemTest > testCopy FAILED
    java.lang.NoClassDefFoundError at HadoopFileSystemTest.java:85
        Caused by: java.lang.ClassNotFoundException at HadoopFileSystemTest.java:85
    java.lang.NullPointerException at HadoopFileSystemTest.java:93

org.apache.beam.sdk.io.hdfs.HadoopFileSystemTest > testMatchForNonExistentFile FAILED
    java.lang.NoClassDefFoundError at HadoopFileSystemTest.java:85
        Caused by: java.lang.ClassNotFoundException at HadoopFileSystemTest.java:85
    java.lang.NullPointerException at HadoopFileSystemTest.java:93

org.apache.beam.sdk.io.hdfs.HadoopFileSystemTest > testCreateAndReadFile FAILED
    java.lang.NoClassDefFoundError at HadoopFileSystemTest.java:85
        Caused by: java.lang.ClassNotFoundException at HadoopFileSystemTest.java:85
    java.lang.NullPointerException at HadoopFileSystemTest.java:93

org.apache.beam.sdk.io.hdfs.HadoopFileSystemTest > testMatchDirectory FAILED
    java.lang.NoClassDefFoundError at HadoopFileSystemTest.java:85
        Caused by: java.lang.ClassNotFoundException at HadoopFileSystemTest.java:85
    java.lang.NullPointerException at HadoopFileSystemTest.java:93

org.apache.beam.sdk.io.hdfs.HadoopFileSystemTest > testRenameRetryScenario FAILED
    java.lang.NoClassDefFoundError at HadoopFileSystemTest.java:85
        Caused by: java.lang.ClassNotFoundException at HadoopFileSystemTest.java:85
    java.lang.NullPointerException at HadoopFileSystemTest.java:93

org.apache.beam.sdk.io.hdfs.HadoopFileSystemTest > testRenameMissingTargetDir FAILED
    java.lang.NoClassDefFoundError at HadoopFileSystemTest.java:85
        Caused by: java.lang.ClassNotFoundException at HadoopFileSystemTest.java:85
    java.lang.NullPointerException at HadoopFileSystemTest.java:93

org.apache.beam.sdk.io.hdfs.HadoopFileSystemTest > testCreateAndReadFileWithShift FAILED
    java.lang.NoClassDefFoundError at HadoopFileSystemTest.java:85
        Caused by: java.lang.ClassNotFoundException at HadoopFileSystemTest.java:85
    java.lang.NullPointerException at HadoopFileSystemTest.java:93

org.apache.beam.sdk.io.hdfs.HadoopFileSystemTest > testCreateAndReadFileWithShiftToEnd FAILED
    java.lang.NoClassDefFoundError at HadoopFileSystemTest.java:85
        Caused by: java.lang.ClassNotFoundException at HadoopFileSystemTest.java:85
    java.lang.NullPointerException at HadoopFileSystemTest.java:93

org.apache.beam.sdk.io.hdfs.HadoopFileSystemTest > testCopySourceMissing FAILED
    java.lang.NoClassDefFoundError at HadoopFileSystemTest.java:85
        Caused by: java.lang.ClassNotFoundException at HadoopFileSystemTest.java:85
    java.lang.NullPointerException at HadoopFileSystemTest.java:93

org.apache.beam.sdk.io.hdfs.HadoopFileSystemTest > testRenameMissingSource FAILED
    java.lang.NoClassDefFoundError at HadoopFileSystemTest.java:85
        Caused by: java.lang.ClassNotFoundException at HadoopFileSystemTest.java:85
    java.lang.NullPointerException at HadoopFileSystemTest.java:93

org.apache.beam.sdk.io.hdfs.HadoopFileSystemTest > testMatchNewResource FAILED
    java.lang.NoClassDefFoundError at HadoopFileSystemTest.java:85
        Caused by: java.lang.ClassNotFoundException at HadoopFileSystemTest.java:85
    java.lang.NullPointerException at HadoopFileSystemTest.java:93

org.apache.beam.sdk.io.hdfs.HadoopFileSystemTest > testMatchForRecursiveGlob FAILED
    java.lang.NoClassDefFoundError at HadoopFileSystemTest.java:85
        Caused by: java.lang.ClassNotFoundException at HadoopFileSystemTest.java:85
    java.lang.NullPointerException at HadoopFileSystemTest.java:93

org.apache.beam.sdk.io.hdfs.HadoopFileSystemTest > testDelete FAILED
    java.lang.NoClassDefFoundError at HadoopFileSystemTest.java:85
        Caused by: java.lang.ClassNotFoundException at HadoopFileSystemTest.java:85
    java.lang.NullPointerException at HadoopFileSystemTest.java:93

org.apache.beam.sdk.io.hdfs.HadoopFileSystemTest > testRename FAILED
    java.lang.NoClassDefFoundError at HadoopFileSystemTest.java:85
        Caused by: java.lang.ClassNotFoundException at HadoopFileSystemTest.java:85
    java.lang.NullPointerException at HadoopFileSystemTest.java:93

org.apache.beam.sdk.io.hdfs.HadoopResourceIdTest > testGetFilename FAILED
    java.lang.NoClassDefFoundError at HadoopResourceIdTest.java:50
        Caused by: java.lang.ClassNotFoundException at HadoopResourceIdTest.java:50
    java.lang.NullPointerException at HadoopResourceIdTest.java:61

org.apache.beam.sdk.io.hdfs.HadoopResourceIdTest > testResourceIdTester FAILED
    java.lang.NoClassDefFoundError at HadoopResourceIdTest.java:50
        Caused by: java.lang.ClassNotFoundException at HadoopResourceIdTest.java:50
    java.lang.NullPointerException at HadoopResourceIdTest.java:61

34 tests completed, 20 failed, 1 skipped

> Task :sdks:java:io:hadoop-file-system:hadoopVersion321Test FAILED
> Task :sdks:java:io:hadoop-format:runHadoopFormatIO2101Test
> Task :sdks:java:io:hadoop-format:runHadoopFormatIO285ElasticIT
> Task :sdks:java:io:hadoop-format:runHadoopFormatIO285IT
> Task :sdks:java:io:hadoop-format:runHadoopFormatIO285Test
> Task :sdks:java:io:hadoop-format:runHadoopFormatIO292ElasticIT
> Task :sdks:java:io:hadoop-format:runHadoopFormatIO292IT
> Task :sdks:java:io:hadoop-format:runHadoopFormatIO292Test
> Task :sdks:java:io:hadoop-format:runHadoopFormatIO321ElasticIT
> Task :sdks:java:io:hadoop-format:runHadoopFormatIO321IT
> Task :sdks:java:io:hadoop-format:runHadoopFormatIO321Test
> Task :sdks:java:io:hadoop-format:hadoopVersionsTest

FAILURE: Build completed with 3 failures.

1: Task failed with an exception.
-----------
* What went wrong:
Execution failed for task ':sdks:java:io:hadoop-file-system:hadoopVersion285Test'.
> There were failing tests. See the report at: file://<https://ci-beam.apache.org/job/beam_PostCommit_Java_Hadoop_Versions/ws/src/sdks/java/io/hadoop-file-system/build/reports/tests/hadoopVersion285Test/index.html>

* Try:
> Run with --stacktrace option to get the stack trace.
> Run with --info or --debug option to get more log output.
> Run with --scan to get full insights.
==============================================================================

2: Task failed with an exception.
-----------
* What went wrong:
Execution failed for task ':sdks:java:io:hadoop-file-system:hadoopVersion292Test'.
> There were failing tests. See the report at: file://<https://ci-beam.apache.org/job/beam_PostCommit_Java_Hadoop_Versions/ws/src/sdks/java/io/hadoop-file-system/build/reports/tests/hadoopVersion292Test/index.html>

* Try:
> Run with --stacktrace option to get the stack trace.
> Run with --info or --debug option to get more log output.
> Run with --scan to get full insights.
==============================================================================

3: Task failed with an exception.
-----------
* What went wrong:
Execution failed for task ':sdks:java:io:hadoop-file-system:hadoopVersion321Test'.
> There were failing tests. See the report at: file://<https://ci-beam.apache.org/job/beam_PostCommit_Java_Hadoop_Versions/ws/src/sdks/java/io/hadoop-file-system/build/reports/tests/hadoopVersion321Test/index.html>

* Try:
> Run with --stacktrace option to get the stack trace.
> Run with --info or --debug option to get more log output.
> Run with --scan to get full insights.
==============================================================================

* Get more help at https://help.gradle.org

BUILD FAILED in 15m 19s
180 actionable tasks: 105 executed, 73 from cache, 2 up-to-date

Publishing build scan...
https://gradle.com/s/ntbzppjcfopwk

Build step 'Invoke Gradle script' changed build result to FAILURE
Build step 'Invoke Gradle script' marked build as failure

---------------------------------------------------------------------
To unsubscribe, e-mail: builds-unsubscribe@beam.apache.org
For additional commands, e-mail: builds-help@beam.apache.org


Build failed in Jenkins: beam_PostCommit_Java_Hadoop_Versions #1262

Posted by Apache Jenkins Server <je...@builds.apache.org>.
See <https://ci-beam.apache.org/job/beam_PostCommit_Java_Hadoop_Versions/1262/display/redirect>

Changes:


------------------------------------------
[...truncated 73.47 KB...]

org.apache.beam.sdk.io.hdfs.HadoopFileSystemTest > testDeleteNonExisting FAILED
    java.lang.NoSuchMethodError at HadoopFileSystemTest.java:85
    java.lang.NullPointerException at HadoopFileSystemTest.java:93

org.apache.beam.sdk.io.hdfs.HadoopFileSystemTest > testRenameExistingDestination FAILED
    java.lang.NoSuchMethodError at HadoopFileSystemTest.java:85
    java.lang.NullPointerException at HadoopFileSystemTest.java:93

org.apache.beam.sdk.io.hdfs.HadoopFileSystemTest > testMatch FAILED
    java.lang.NoSuchMethodError at HadoopFileSystemTest.java:85
    java.lang.NullPointerException at HadoopFileSystemTest.java:93

org.apache.beam.sdk.io.hdfs.HadoopFileSystemTest > testCopy FAILED
    java.lang.NoSuchMethodError at HadoopFileSystemTest.java:85
    java.lang.NullPointerException at HadoopFileSystemTest.java:93

org.apache.beam.sdk.io.hdfs.HadoopFileSystemTest > testMatchForNonExistentFile FAILED
    java.lang.NoSuchMethodError at HadoopFileSystemTest.java:85
    java.lang.NullPointerException at HadoopFileSystemTest.java:93

org.apache.beam.sdk.io.hdfs.HadoopFileSystemTest > testCreateAndReadFile FAILED
    java.lang.NoSuchMethodError at HadoopFileSystemTest.java:85
    java.lang.NullPointerException at HadoopFileSystemTest.java:93

org.apache.beam.sdk.io.hdfs.HadoopFileSystemTest > testMatchDirectory FAILED
    java.lang.NoSuchMethodError at HadoopFileSystemTest.java:85
    java.lang.NullPointerException at HadoopFileSystemTest.java:93

org.apache.beam.sdk.io.hdfs.HadoopFileSystemTest > testRenameRetryScenario FAILED
    java.lang.NoSuchMethodError at HadoopFileSystemTest.java:85
    java.lang.NullPointerException at HadoopFileSystemTest.java:93

org.apache.beam.sdk.io.hdfs.HadoopFileSystemTest > testRenameMissingTargetDir FAILED
    java.lang.NoSuchMethodError at HadoopFileSystemTest.java:85
    java.lang.NullPointerException at HadoopFileSystemTest.java:93

org.apache.beam.sdk.io.hdfs.HadoopFileSystemTest > testCreateAndReadFileWithShift FAILED
    java.lang.NoSuchMethodError at HadoopFileSystemTest.java:85
    java.lang.NullPointerException at HadoopFileSystemTest.java:93

org.apache.beam.sdk.io.hdfs.HadoopFileSystemTest > testCreateAndReadFileWithShiftToEnd FAILED
    java.lang.NoSuchMethodError at HadoopFileSystemTest.java:85
    java.lang.NullPointerException at HadoopFileSystemTest.java:93

> Task :sdks:java:io:hadoop-format:runHadoopFormatIO2101Test

> Task :sdks:java:io:hadoop-file-system:hadoopVersion292Test

org.apache.beam.sdk.io.hdfs.HadoopFileSystemTest > testCopySourceMissing FAILED
    java.lang.NoSuchMethodError at HadoopFileSystemTest.java:85
    java.lang.NullPointerException at HadoopFileSystemTest.java:93

org.apache.beam.sdk.io.hdfs.HadoopFileSystemTest > testRenameMissingSource FAILED
    java.lang.NoSuchMethodError at HadoopFileSystemTest.java:85
    java.lang.NullPointerException at HadoopFileSystemTest.java:93

org.apache.beam.sdk.io.hdfs.HadoopFileSystemTest > testMatchNewResource FAILED
    java.lang.NoSuchMethodError at HadoopFileSystemTest.java:85
    java.lang.NullPointerException at HadoopFileSystemTest.java:93

org.apache.beam.sdk.io.hdfs.HadoopFileSystemTest > testMatchForRecursiveGlob FAILED
    java.lang.NoSuchMethodError at HadoopFileSystemTest.java:85
    java.lang.NullPointerException at HadoopFileSystemTest.java:93

org.apache.beam.sdk.io.hdfs.HadoopFileSystemTest > testDelete FAILED
    java.lang.NoSuchMethodError at HadoopFileSystemTest.java:85
    java.lang.NullPointerException at HadoopFileSystemTest.java:93

org.apache.beam.sdk.io.hdfs.HadoopFileSystemTest > testRename FAILED
    java.lang.NoSuchMethodError at HadoopFileSystemTest.java:85
    java.lang.NullPointerException at HadoopFileSystemTest.java:93

org.apache.beam.sdk.io.hdfs.HadoopResourceIdTest > testGetFilename FAILED
    java.lang.NoSuchMethodError at HadoopResourceIdTest.java:50
    java.lang.NullPointerException at HadoopResourceIdTest.java:61

org.apache.beam.sdk.io.hdfs.HadoopResourceIdTest > testResourceIdTester FAILED
    java.lang.NoSuchMethodError at HadoopResourceIdTest.java:50
    java.lang.NullPointerException at HadoopResourceIdTest.java:61

34 tests completed, 20 failed, 1 skipped

> Task :sdks:java:io:hadoop-file-system:hadoopVersion292Test FAILED

> Task :sdks:java:io:hadoop-file-system:hadoopVersion321Test

org.apache.beam.sdk.io.hdfs.HadoopFileSystemRegistrarTest > testServiceLoader FAILED
    java.lang.NoClassDefFoundError at HadoopFileSystemRegistrarTest.java:55
        Caused by: java.lang.ClassNotFoundException at HadoopFileSystemRegistrarTest.java:55
    java.lang.NullPointerException at HadoopFileSystemRegistrarTest.java:61

org.apache.beam.sdk.io.hdfs.HadoopFileSystemTest > testDeleteNonExisting FAILED
    java.lang.NoClassDefFoundError at HadoopFileSystemTest.java:85
        Caused by: java.lang.ClassNotFoundException at HadoopFileSystemTest.java:85
    java.lang.NullPointerException at HadoopFileSystemTest.java:93

org.apache.beam.sdk.io.hdfs.HadoopFileSystemTest > testRenameExistingDestination FAILED
    java.lang.NoClassDefFoundError at HadoopFileSystemTest.java:85
        Caused by: java.lang.ClassNotFoundException at HadoopFileSystemTest.java:85
    java.lang.NullPointerException at HadoopFileSystemTest.java:93

org.apache.beam.sdk.io.hdfs.HadoopFileSystemTest > testMatch FAILED
    java.lang.NoClassDefFoundError at HadoopFileSystemTest.java:85
        Caused by: java.lang.ClassNotFoundException at HadoopFileSystemTest.java:85
    java.lang.NullPointerException at HadoopFileSystemTest.java:93

org.apache.beam.sdk.io.hdfs.HadoopFileSystemTest > testCopy FAILED
    java.lang.NoClassDefFoundError at HadoopFileSystemTest.java:85
        Caused by: java.lang.ClassNotFoundException at HadoopFileSystemTest.java:85
    java.lang.NullPointerException at HadoopFileSystemTest.java:93

org.apache.beam.sdk.io.hdfs.HadoopFileSystemTest > testMatchForNonExistentFile FAILED
    java.lang.NoClassDefFoundError at HadoopFileSystemTest.java:85
        Caused by: java.lang.ClassNotFoundException at HadoopFileSystemTest.java:85
    java.lang.NullPointerException at HadoopFileSystemTest.java:93

org.apache.beam.sdk.io.hdfs.HadoopFileSystemTest > testCreateAndReadFile FAILED
    java.lang.NoClassDefFoundError at HadoopFileSystemTest.java:85
        Caused by: java.lang.ClassNotFoundException at HadoopFileSystemTest.java:85
    java.lang.NullPointerException at HadoopFileSystemTest.java:93

org.apache.beam.sdk.io.hdfs.HadoopFileSystemTest > testMatchDirectory FAILED
    java.lang.NoClassDefFoundError at HadoopFileSystemTest.java:85
        Caused by: java.lang.ClassNotFoundException at HadoopFileSystemTest.java:85
    java.lang.NullPointerException at HadoopFileSystemTest.java:93

org.apache.beam.sdk.io.hdfs.HadoopFileSystemTest > testRenameRetryScenario FAILED
    java.lang.NoClassDefFoundError at HadoopFileSystemTest.java:85
        Caused by: java.lang.ClassNotFoundException at HadoopFileSystemTest.java:85
    java.lang.NullPointerException at HadoopFileSystemTest.java:93

org.apache.beam.sdk.io.hdfs.HadoopFileSystemTest > testRenameMissingTargetDir FAILED
    java.lang.NoClassDefFoundError at HadoopFileSystemTest.java:85
        Caused by: java.lang.ClassNotFoundException at HadoopFileSystemTest.java:85
    java.lang.NullPointerException at HadoopFileSystemTest.java:93

org.apache.beam.sdk.io.hdfs.HadoopFileSystemTest > testCreateAndReadFileWithShift FAILED
    java.lang.NoClassDefFoundError at HadoopFileSystemTest.java:85
        Caused by: java.lang.ClassNotFoundException at HadoopFileSystemTest.java:85
    java.lang.NullPointerException at HadoopFileSystemTest.java:93

org.apache.beam.sdk.io.hdfs.HadoopFileSystemTest > testCreateAndReadFileWithShiftToEnd FAILED
    java.lang.NoClassDefFoundError at HadoopFileSystemTest.java:85
        Caused by: java.lang.ClassNotFoundException at HadoopFileSystemTest.java:85
    java.lang.NullPointerException at HadoopFileSystemTest.java:93

org.apache.beam.sdk.io.hdfs.HadoopFileSystemTest > testCopySourceMissing FAILED
    java.lang.NoClassDefFoundError at HadoopFileSystemTest.java:85
        Caused by: java.lang.ClassNotFoundException at HadoopFileSystemTest.java:85
    java.lang.NullPointerException at HadoopFileSystemTest.java:93

org.apache.beam.sdk.io.hdfs.HadoopFileSystemTest > testRenameMissingSource FAILED
    java.lang.NoClassDefFoundError at HadoopFileSystemTest.java:85
        Caused by: java.lang.ClassNotFoundException at HadoopFileSystemTest.java:85
    java.lang.NullPointerException at HadoopFileSystemTest.java:93

org.apache.beam.sdk.io.hdfs.HadoopFileSystemTest > testMatchNewResource FAILED
    java.lang.NoClassDefFoundError at HadoopFileSystemTest.java:85
        Caused by: java.lang.ClassNotFoundException at HadoopFileSystemTest.java:85
    java.lang.NullPointerException at HadoopFileSystemTest.java:93

org.apache.beam.sdk.io.hdfs.HadoopFileSystemTest > testMatchForRecursiveGlob FAILED
    java.lang.NoClassDefFoundError at HadoopFileSystemTest.java:85
        Caused by: java.lang.ClassNotFoundException at HadoopFileSystemTest.java:85
    java.lang.NullPointerException at HadoopFileSystemTest.java:93

org.apache.beam.sdk.io.hdfs.HadoopFileSystemTest > testDelete FAILED
    java.lang.NoClassDefFoundError at HadoopFileSystemTest.java:85
        Caused by: java.lang.ClassNotFoundException at HadoopFileSystemTest.java:85
    java.lang.NullPointerException at HadoopFileSystemTest.java:93

org.apache.beam.sdk.io.hdfs.HadoopFileSystemTest > testRename FAILED
    java.lang.NoClassDefFoundError at HadoopFileSystemTest.java:85
        Caused by: java.lang.ClassNotFoundException at HadoopFileSystemTest.java:85
    java.lang.NullPointerException at HadoopFileSystemTest.java:93

org.apache.beam.sdk.io.hdfs.HadoopResourceIdTest > testGetFilename FAILED
    java.lang.NoClassDefFoundError at HadoopResourceIdTest.java:50
        Caused by: java.lang.ClassNotFoundException at HadoopResourceIdTest.java:50
    java.lang.NullPointerException at HadoopResourceIdTest.java:61

org.apache.beam.sdk.io.hdfs.HadoopResourceIdTest > testResourceIdTester FAILED
    java.lang.NoClassDefFoundError at HadoopResourceIdTest.java:50
        Caused by: java.lang.ClassNotFoundException at HadoopResourceIdTest.java:50
    java.lang.NullPointerException at HadoopResourceIdTest.java:61

34 tests completed, 20 failed, 1 skipped

> Task :sdks:java:io:hadoop-file-system:hadoopVersion321Test FAILED
> Task :sdks:java:io:hadoop-format:runHadoopFormatIO285ElasticIT
> Task :sdks:java:io:hadoop-format:runHadoopFormatIO285IT
> Task :sdks:java:io:hadoop-format:runHadoopFormatIO285Test
> Task :sdks:java:io:hadoop-format:runHadoopFormatIO292ElasticIT
> Task :sdks:java:io:hadoop-format:runHadoopFormatIO292IT
> Task :sdks:java:io:hadoop-format:runHadoopFormatIO292Test
> Task :sdks:java:io:hadoop-format:runHadoopFormatIO321ElasticIT
> Task :sdks:java:io:hadoop-format:runHadoopFormatIO321IT
> Task :sdks:java:io:hadoop-format:runHadoopFormatIO321Test
> Task :sdks:java:io:hadoop-format:hadoopVersionsTest

FAILURE: Build completed with 3 failures.

1: Task failed with an exception.
-----------
* What went wrong:
Execution failed for task ':sdks:java:io:hadoop-file-system:hadoopVersion285Test'.
> There were failing tests. See the report at: file://<https://ci-beam.apache.org/job/beam_PostCommit_Java_Hadoop_Versions/ws/src/sdks/java/io/hadoop-file-system/build/reports/tests/hadoopVersion285Test/index.html>

* Try:
> Run with --stacktrace option to get the stack trace.
> Run with --info or --debug option to get more log output.
> Run with --scan to get full insights.
==============================================================================

2: Task failed with an exception.
-----------
* What went wrong:
Execution failed for task ':sdks:java:io:hadoop-file-system:hadoopVersion292Test'.
> There were failing tests. See the report at: file://<https://ci-beam.apache.org/job/beam_PostCommit_Java_Hadoop_Versions/ws/src/sdks/java/io/hadoop-file-system/build/reports/tests/hadoopVersion292Test/index.html>

* Try:
> Run with --stacktrace option to get the stack trace.
> Run with --info or --debug option to get more log output.
> Run with --scan to get full insights.
==============================================================================

3: Task failed with an exception.
-----------
* What went wrong:
Execution failed for task ':sdks:java:io:hadoop-file-system:hadoopVersion321Test'.
> There were failing tests. See the report at: file://<https://ci-beam.apache.org/job/beam_PostCommit_Java_Hadoop_Versions/ws/src/sdks/java/io/hadoop-file-system/build/reports/tests/hadoopVersion321Test/index.html>

* Try:
> Run with --stacktrace option to get the stack trace.
> Run with --info or --debug option to get more log output.
> Run with --scan to get full insights.
==============================================================================

* Get more help at https://help.gradle.org

BUILD FAILED in 17m 1s
180 actionable tasks: 99 executed, 79 from cache, 2 up-to-date

Publishing build scan...
https://gradle.com/s/ejkjto25wxbfy

Build step 'Invoke Gradle script' changed build result to FAILURE
Build step 'Invoke Gradle script' marked build as failure

---------------------------------------------------------------------
To unsubscribe, e-mail: builds-unsubscribe@beam.apache.org
For additional commands, e-mail: builds-help@beam.apache.org


Build failed in Jenkins: beam_PostCommit_Java_Hadoop_Versions #1261

Posted by Apache Jenkins Server <je...@builds.apache.org>.
See <https://ci-beam.apache.org/job/beam_PostCommit_Java_Hadoop_Versions/1261/display/redirect>

Changes:


------------------------------------------
[...truncated 74.64 KB...]
    java.lang.NullPointerException at HadoopFileSystemTest.java:93

org.apache.beam.sdk.io.hdfs.HadoopFileSystemTest > testMatch FAILED
    java.lang.NoSuchMethodError at HadoopFileSystemTest.java:85
    java.lang.NullPointerException at HadoopFileSystemTest.java:93

org.apache.beam.sdk.io.hdfs.HadoopFileSystemTest > testCopy FAILED
    java.lang.NoSuchMethodError at HadoopFileSystemTest.java:85
    java.lang.NullPointerException at HadoopFileSystemTest.java:93

org.apache.beam.sdk.io.hdfs.HadoopFileSystemTest > testMatchForNonExistentFile FAILED
    java.lang.NoSuchMethodError at HadoopFileSystemTest.java:85
    java.lang.NullPointerException at HadoopFileSystemTest.java:93

org.apache.beam.sdk.io.hdfs.HadoopFileSystemTest > testCreateAndReadFile FAILED
    java.lang.NoSuchMethodError at HadoopFileSystemTest.java:85
    java.lang.NullPointerException at HadoopFileSystemTest.java:93

org.apache.beam.sdk.io.hdfs.HadoopFileSystemTest > testMatchDirectory FAILED
    java.lang.NoSuchMethodError at HadoopFileSystemTest.java:85
    java.lang.NullPointerException at HadoopFileSystemTest.java:93

org.apache.beam.sdk.io.hdfs.HadoopFileSystemTest > testRenameRetryScenario FAILED
    java.lang.NoSuchMethodError at HadoopFileSystemTest.java:85
    java.lang.NullPointerException at HadoopFileSystemTest.java:93

org.apache.beam.sdk.io.hdfs.HadoopFileSystemTest > testRenameMissingTargetDir FAILED
    java.lang.NoSuchMethodError at HadoopFileSystemTest.java:85
    java.lang.NullPointerException at HadoopFileSystemTest.java:93

org.apache.beam.sdk.io.hdfs.HadoopFileSystemTest > testCreateAndReadFileWithShift FAILED
    java.lang.NoSuchMethodError at HadoopFileSystemTest.java:85
    java.lang.NullPointerException at HadoopFileSystemTest.java:93

org.apache.beam.sdk.io.hdfs.HadoopFileSystemTest > testCreateAndReadFileWithShiftToEnd FAILED
    java.lang.NoSuchMethodError at HadoopFileSystemTest.java:85
    java.lang.NullPointerException at HadoopFileSystemTest.java:93

org.apache.beam.sdk.io.hdfs.HadoopFileSystemTest > testCopySourceMissing FAILED
    java.lang.NoSuchMethodError at HadoopFileSystemTest.java:85
    java.lang.NullPointerException at HadoopFileSystemTest.java:93

org.apache.beam.sdk.io.hdfs.HadoopFileSystemTest > testRenameMissingSource FAILED
    java.lang.NoSuchMethodError at HadoopFileSystemTest.java:85
    java.lang.NullPointerException at HadoopFileSystemTest.java:93

org.apache.beam.sdk.io.hdfs.HadoopFileSystemTest > testMatchNewResource FAILED
    java.lang.NoSuchMethodError at HadoopFileSystemTest.java:85
    java.lang.NullPointerException at HadoopFileSystemTest.java:93

> Task :sdks:java:io:hadoop-format:runHadoopFormatIO2101Test

> Task :sdks:java:io:hadoop-file-system:hadoopVersion292Test FAILED

org.apache.beam.sdk.io.hdfs.HadoopFileSystemTest > testMatchForRecursiveGlob FAILED
    java.lang.NoSuchMethodError at HadoopFileSystemTest.java:85
    java.lang.NullPointerException at HadoopFileSystemTest.java:93

org.apache.beam.sdk.io.hdfs.HadoopFileSystemTest > testDelete FAILED
    java.lang.NoSuchMethodError at HadoopFileSystemTest.java:85
    java.lang.NullPointerException at HadoopFileSystemTest.java:93

org.apache.beam.sdk.io.hdfs.HadoopFileSystemTest > testRename FAILED
    java.lang.NoSuchMethodError at HadoopFileSystemTest.java:85
    java.lang.NullPointerException at HadoopFileSystemTest.java:93

org.apache.beam.sdk.io.hdfs.HadoopResourceIdTest > testGetFilename FAILED
    java.lang.NoSuchMethodError at HadoopResourceIdTest.java:50
    java.lang.NullPointerException at HadoopResourceIdTest.java:61

org.apache.beam.sdk.io.hdfs.HadoopResourceIdTest > testResourceIdTester FAILED
    java.lang.NoSuchMethodError at HadoopResourceIdTest.java:50
    java.lang.NullPointerException at HadoopResourceIdTest.java:61

34 tests completed, 20 failed, 1 skipped

> Task :sdks:java:io:hadoop-file-system:hadoopVersion321Test

org.apache.beam.sdk.io.hdfs.HadoopFileSystemRegistrarTest > testServiceLoader FAILED
    java.lang.NoClassDefFoundError at HadoopFileSystemRegistrarTest.java:55
        Caused by: java.lang.ClassNotFoundException at HadoopFileSystemRegistrarTest.java:55
    java.lang.NullPointerException at HadoopFileSystemRegistrarTest.java:61

org.apache.beam.sdk.io.hdfs.HadoopFileSystemTest > testDeleteNonExisting FAILED
    java.lang.NoClassDefFoundError at HadoopFileSystemTest.java:85
        Caused by: java.lang.ClassNotFoundException at HadoopFileSystemTest.java:85
    java.lang.NullPointerException at HadoopFileSystemTest.java:93

org.apache.beam.sdk.io.hdfs.HadoopFileSystemTest > testRenameExistingDestination FAILED
    java.lang.NoClassDefFoundError at HadoopFileSystemTest.java:85
        Caused by: java.lang.ClassNotFoundException at HadoopFileSystemTest.java:85
    java.lang.NullPointerException at HadoopFileSystemTest.java:93

org.apache.beam.sdk.io.hdfs.HadoopFileSystemTest > testMatch FAILED
    java.lang.NoClassDefFoundError at HadoopFileSystemTest.java:85
        Caused by: java.lang.ClassNotFoundException at HadoopFileSystemTest.java:85
    java.lang.NullPointerException at HadoopFileSystemTest.java:93

org.apache.beam.sdk.io.hdfs.HadoopFileSystemTest > testCopy FAILED
    java.lang.NoClassDefFoundError at HadoopFileSystemTest.java:85
        Caused by: java.lang.ClassNotFoundException at HadoopFileSystemTest.java:85
    java.lang.NullPointerException at HadoopFileSystemTest.java:93

org.apache.beam.sdk.io.hdfs.HadoopFileSystemTest > testMatchForNonExistentFile FAILED
    java.lang.NoClassDefFoundError at HadoopFileSystemTest.java:85
        Caused by: java.lang.ClassNotFoundException at HadoopFileSystemTest.java:85
    java.lang.NullPointerException at HadoopFileSystemTest.java:93

org.apache.beam.sdk.io.hdfs.HadoopFileSystemTest > testCreateAndReadFile FAILED
    java.lang.NoClassDefFoundError at HadoopFileSystemTest.java:85
        Caused by: java.lang.ClassNotFoundException at HadoopFileSystemTest.java:85
    java.lang.NullPointerException at HadoopFileSystemTest.java:93

org.apache.beam.sdk.io.hdfs.HadoopFileSystemTest > testMatchDirectory FAILED
    java.lang.NoClassDefFoundError at HadoopFileSystemTest.java:85
        Caused by: java.lang.ClassNotFoundException at HadoopFileSystemTest.java:85
    java.lang.NullPointerException at HadoopFileSystemTest.java:93

org.apache.beam.sdk.io.hdfs.HadoopFileSystemTest > testRenameRetryScenario FAILED
    java.lang.NoClassDefFoundError at HadoopFileSystemTest.java:85
        Caused by: java.lang.ClassNotFoundException at HadoopFileSystemTest.java:85
    java.lang.NullPointerException at HadoopFileSystemTest.java:93

org.apache.beam.sdk.io.hdfs.HadoopFileSystemTest > testRenameMissingTargetDir FAILED
    java.lang.NoClassDefFoundError at HadoopFileSystemTest.java:85
        Caused by: java.lang.ClassNotFoundException at HadoopFileSystemTest.java:85
    java.lang.NullPointerException at HadoopFileSystemTest.java:93

org.apache.beam.sdk.io.hdfs.HadoopFileSystemTest > testCreateAndReadFileWithShift FAILED
    java.lang.NoClassDefFoundError at HadoopFileSystemTest.java:85
        Caused by: java.lang.ClassNotFoundException at HadoopFileSystemTest.java:85
    java.lang.NullPointerException at HadoopFileSystemTest.java:93

org.apache.beam.sdk.io.hdfs.HadoopFileSystemTest > testCreateAndReadFileWithShiftToEnd FAILED
    java.lang.NoClassDefFoundError at HadoopFileSystemTest.java:85
        Caused by: java.lang.ClassNotFoundException at HadoopFileSystemTest.java:85
    java.lang.NullPointerException at HadoopFileSystemTest.java:93

org.apache.beam.sdk.io.hdfs.HadoopFileSystemTest > testCopySourceMissing FAILED
    java.lang.NoClassDefFoundError at HadoopFileSystemTest.java:85
        Caused by: java.lang.ClassNotFoundException at HadoopFileSystemTest.java:85
    java.lang.NullPointerException at HadoopFileSystemTest.java:93

org.apache.beam.sdk.io.hdfs.HadoopFileSystemTest > testRenameMissingSource FAILED
    java.lang.NoClassDefFoundError at HadoopFileSystemTest.java:85
        Caused by: java.lang.ClassNotFoundException at HadoopFileSystemTest.java:85
    java.lang.NullPointerException at HadoopFileSystemTest.java:93

org.apache.beam.sdk.io.hdfs.HadoopFileSystemTest > testMatchNewResource FAILED
    java.lang.NoClassDefFoundError at HadoopFileSystemTest.java:85
        Caused by: java.lang.ClassNotFoundException at HadoopFileSystemTest.java:85
    java.lang.NullPointerException at HadoopFileSystemTest.java:93

org.apache.beam.sdk.io.hdfs.HadoopFileSystemTest > testMatchForRecursiveGlob FAILED
    java.lang.NoClassDefFoundError at HadoopFileSystemTest.java:85
        Caused by: java.lang.ClassNotFoundException at HadoopFileSystemTest.java:85
    java.lang.NullPointerException at HadoopFileSystemTest.java:93

org.apache.beam.sdk.io.hdfs.HadoopFileSystemTest > testDelete FAILED
    java.lang.NoClassDefFoundError at HadoopFileSystemTest.java:85
        Caused by: java.lang.ClassNotFoundException at HadoopFileSystemTest.java:85
    java.lang.NullPointerException at HadoopFileSystemTest.java:93

org.apache.beam.sdk.io.hdfs.HadoopFileSystemTest > testRename FAILED
    java.lang.NoClassDefFoundError at HadoopFileSystemTest.java:85
        Caused by: java.lang.ClassNotFoundException at HadoopFileSystemTest.java:85
    java.lang.NullPointerException at HadoopFileSystemTest.java:93

org.apache.beam.sdk.io.hdfs.HadoopResourceIdTest > testGetFilename FAILED
    java.lang.NoClassDefFoundError at HadoopResourceIdTest.java:50
        Caused by: java.lang.ClassNotFoundException at HadoopResourceIdTest.java:50
    java.lang.NullPointerException at HadoopResourceIdTest.java:61

org.apache.beam.sdk.io.hdfs.HadoopResourceIdTest > testResourceIdTester FAILED
    java.lang.NoClassDefFoundError at HadoopResourceIdTest.java:50
        Caused by: java.lang.ClassNotFoundException at HadoopResourceIdTest.java:50
    java.lang.NullPointerException at HadoopResourceIdTest.java:61

34 tests completed, 20 failed, 1 skipped

> Task :sdks:java:io:hadoop-file-system:hadoopVersion321Test FAILED
> Task :runners:spark:2:hadoopVersion292Test
testBatchPipelineTimeoutState(isStreaming=false) two
testBatchPipelineTimeoutState(isStreaming=false) one

> Task :sdks:java:io:hadoop-format:runHadoopFormatIO285ElasticIT
> Task :runners:spark:2:hadoopVersion321Test
testBatchPipelineCanceledState(isStreaming=false) two
testBatchPipelineCanceledState(isStreaming=false) one

> Task :sdks:java:io:hadoop-format:runHadoopFormatIO285IT
> Task :sdks:java:io:hadoop-format:runHadoopFormatIO285Test
> Task :runners:spark:2:hadoopVersionsTest
> Task :sdks:java:io:hadoop-format:runHadoopFormatIO292ElasticIT
> Task :sdks:java:io:hadoop-format:runHadoopFormatIO292IT
> Task :sdks:java:io:hadoop-format:runHadoopFormatIO292Test
> Task :sdks:java:io:hadoop-format:runHadoopFormatIO321ElasticIT
> Task :sdks:java:io:hadoop-format:runHadoopFormatIO321IT
> Task :sdks:java:io:hadoop-format:runHadoopFormatIO321Test
> Task :sdks:java:io:hadoop-format:hadoopVersionsTest

FAILURE: Build completed with 3 failures.

1: Task failed with an exception.
-----------
* What went wrong:
Execution failed for task ':sdks:java:io:hadoop-file-system:hadoopVersion285Test'.
> There were failing tests. See the report at: file://<https://ci-beam.apache.org/job/beam_PostCommit_Java_Hadoop_Versions/ws/src/sdks/java/io/hadoop-file-system/build/reports/tests/hadoopVersion285Test/index.html>

* Try:
> Run with --stacktrace option to get the stack trace.
> Run with --info or --debug option to get more log output.
> Run with --scan to get full insights.
==============================================================================

2: Task failed with an exception.
-----------
* What went wrong:
Execution failed for task ':sdks:java:io:hadoop-file-system:hadoopVersion292Test'.
> There were failing tests. See the report at: file://<https://ci-beam.apache.org/job/beam_PostCommit_Java_Hadoop_Versions/ws/src/sdks/java/io/hadoop-file-system/build/reports/tests/hadoopVersion292Test/index.html>

* Try:
> Run with --stacktrace option to get the stack trace.
> Run with --info or --debug option to get more log output.
> Run with --scan to get full insights.
==============================================================================

3: Task failed with an exception.
-----------
* What went wrong:
Execution failed for task ':sdks:java:io:hadoop-file-system:hadoopVersion321Test'.
> There were failing tests. See the report at: file://<https://ci-beam.apache.org/job/beam_PostCommit_Java_Hadoop_Versions/ws/src/sdks/java/io/hadoop-file-system/build/reports/tests/hadoopVersion321Test/index.html>

* Try:
> Run with --stacktrace option to get the stack trace.
> Run with --info or --debug option to get more log output.
> Run with --scan to get full insights.
==============================================================================

* Get more help at https://help.gradle.org

BUILD FAILED in 17m 54s
180 actionable tasks: 110 executed, 68 from cache, 2 up-to-date

Publishing build scan...
https://gradle.com/s/6d5zd76ue6l7c

Build step 'Invoke Gradle script' changed build result to FAILURE
Build step 'Invoke Gradle script' marked build as failure

---------------------------------------------------------------------
To unsubscribe, e-mail: builds-unsubscribe@beam.apache.org
For additional commands, e-mail: builds-help@beam.apache.org