You are viewing a plain text version of this content. The canonical link for it is here.
Posted to notifications@ant.apache.org by Apache Jenkins Server <je...@builds.apache.org> on 2016/08/30 17:11:43 UTC
Build failed in Jenkins: Ant-Build-Matrix-1.9.x-Linux » JDK 9 b128 (early access build),Ubuntu #40
See <https://builds.apache.org/job/Ant-Build-Matrix-1.9.x-Linux/jdk=JDK%209%20b128%20(early%20access%20build),label=Ubuntu/40/changes>
Changes:
[bodewig] rmic doesn't allow -Xnew on JDK9
[bodewig] additional tests for javah
[bodewig] implement a forking implementation for javah
[bodewig] typos
[bodewig] add support for javac -h
[bodewig] fix the patterns used by touch and date selectors
[bodewig] line-ends
[bodewig] formatting
[bodewig] <get>'s retries attribute has a misleading name
[bodewig] update Xalan
------------------------------------------
Started by upstream project "Ant-Build-Matrix-1.9.x-Linux" build number 40
originally caused by:
Started by an SCM change
[EnvInject] - Loading node environment variables.
Building remotely on jenkins-test-87c (Ubuntu ubuntu jenkins-cloud-8GB jenkins-cloud-4GB cloud-slave) in workspace <https://builds.apache.org/job/Ant-Build-Matrix-1.9.x-Linux/jdk=JDK%209%20b128%20(early%20access%20build),label=Ubuntu/ws/>
Cloning the remote Git repository
Cloning repository https://git-wip-us.apache.org/repos/asf/ant.git
> git init <https://builds.apache.org/job/Ant-Build-Matrix-1.9.x-Linux/jdk=JDK%209%20b128%20(early%20access%20build),label=Ubuntu/ws/> # timeout=10
Fetching upstream changes from https://git-wip-us.apache.org/repos/asf/ant.git
> git --version # timeout=10
> git -c core.askpass=true fetch --tags --progress https://git-wip-us.apache.org/repos/asf/ant.git +refs/heads/*:refs/remotes/origin/*
> git config remote.origin.url https://git-wip-us.apache.org/repos/asf/ant.git # timeout=10
> git config --add remote.origin.fetch +refs/heads/*:refs/remotes/origin/* # timeout=10
> git config remote.origin.url https://git-wip-us.apache.org/repos/asf/ant.git # timeout=10
Cleaning workspace
> git rev-parse --verify HEAD # timeout=10
No valid HEAD. Skipping the resetting
> git clean -fdx # timeout=10
Fetching upstream changes from https://git-wip-us.apache.org/repos/asf/ant.git
> git -c core.askpass=true fetch --tags --progress https://git-wip-us.apache.org/repos/asf/ant.git +refs/heads/*:refs/remotes/origin/*
Checking out Revision bf3b31ac82fe844dfc2fabf865ad90a406767e90 (refs/remotes/origin/1.9.x)
> git config core.sparsecheckout # timeout=10
> git checkout -f bf3b31ac82fe844dfc2fabf865ad90a406767e90
> git rev-list 8d3744ee73e6e7cd4459799bccf7309788d1784d # timeout=10
[EnvInject] - Executing scripts and injecting environment variables after the SCM step.
[EnvInject] - Injecting as environment variables the properties content
LANG=en_US.utf8
[EnvInject] - Variables injected successfully.
[Ubuntu] $ /home/jenkins/tools/ant/latest/bin/ant -file launch-build.xml "-Djdk=JDK 9 b128 (early access build)" -Dlabel=Ubuntu
Buildfile: <https://builds.apache.org/job/Ant-Build-Matrix-1.9.x-Linux/jdk=JDK%209%20b128%20(early%20access%20build),label=Ubuntu/ws/launch-build.xml>
launch:
[echo] Launching <https://builds.apache.org/job/Ant-Build-Matrix-1.9.x-Linux/jdk=JDK%209%20b128%20(early%20access%20build),label=Ubuntu/ws/build.sh> allclean test -Dignore.tests.failed=true -Doptional.jars.whenmanifestonly=skip
[exec] ... Bootstrapping Ant Distribution
[exec] ... Compiling Ant Classes
[exec] Note: Some input files use or override a deprecated API.
[exec] Note: Recompile with -Xlint:deprecation for details.
[exec] Note: Some input files use unchecked or unsafe operations.
[exec] Note: Recompile with -Xlint:unchecked for details.
[exec] ... Copying Required Files
[exec] ... Building Ant Distribution
[exec] Buildfile: <https://builds.apache.org/job/Ant-Build-Matrix-1.9.x-Linux/jdk=JDK%209%20b128%20(early%20access%20build),label=Ubuntu/ws/build.xml>
[exec]
[exec] bootstrap:
[exec]
[exec] prepare:
[exec]
[exec] check_for_optional_packages:
[exec]
[exec] build:
[exec] Created dir: <https://builds.apache.org/job/Ant-Build-Matrix-1.9.x-Linux/jdk=JDK%209%20b128%20(early%20access%20build),label=Ubuntu/ws/build/lib>
[exec] Compiling 269 source files to <https://builds.apache.org/job/Ant-Build-Matrix-1.9.x-Linux/jdk=JDK%209%20b128%20(early%20access%20build),label=Ubuntu/ws/build/classes>
[exec] warning: [options] bootstrap class path not set in conjunction with -source 1.5
[exec] error: Source option 1.5 is no longer supported. Use 1.6 or later.
[exec] error: Target option 1.5 is no longer supported. Use 1.6 or later.
[exec]
[exec] BUILD FAILED
[exec] <https://builds.apache.org/job/Ant-Build-Matrix-1.9.x-Linux/jdk=JDK%209%20b128%20(early%20access%20build),label=Ubuntu/ws/build.xml>:1076: The following error occurred while executing this line:
[exec] <https://builds.apache.org/job/Ant-Build-Matrix-1.9.x-Linux/jdk=JDK%209%20b128%20(early%20access%20build),label=Ubuntu/ws/build.xml>:575: Compile failed; see the compiler error output for details.
[exec]
[exec] Total time: 1 second
[exec] ... Failed Building Ant Distribution !
[exec] Bootstrap FAILED
BUILD FAILED
<https://builds.apache.org/job/Ant-Build-Matrix-1.9.x-Linux/jdk=JDK%209%20b128%20(early%20access%20build),label=Ubuntu/ws/launch-build.xml>:36: exec returned: 1
Total time: 11 seconds
Build step 'Invoke Ant' marked build as failure
Recording test results
ERROR: Step ‘Publish JUnit test result report’ failed: No test report files were found. Configuration error?