You are viewing a plain text version of this content. The canonical link for it is here.
Posted to issues@hbase.apache.org by "Gavin (JIRA)" <ji...@apache.org> on 2018/08/01 06:21:50 UTC
[jira] [Issue Comment Deleted] (HBASE-19395) [branch-1]
TestEndToEndSplitTransaction.testMasterOpsWhileSplitting fails with NPE
[ https://issues.apache.org/jira/browse/HBASE-19395?page=com.atlassian.jira.plugin.system.issuetabpanels:all-tabpanel ]
Gavin updated HBASE-19395:
--------------------------
Comment: was deleted
(was: A comment with security level 'jira-users' was removed.)
> [branch-1] TestEndToEndSplitTransaction.testMasterOpsWhileSplitting fails with NPE
> ----------------------------------------------------------------------------------
>
> Key: HBASE-19395
> URL: https://issues.apache.org/jira/browse/HBASE-19395
> Project: HBase
> Issue Type: Bug
> Reporter: Guanghao Zhang
> Assignee: Andrew Purtell
> Priority: Trivial
> Fix For: 1.4.0
>
> Attachments: HBASE-19395-branch-1.patch
>
>
> [INFO] Running org.apache.hadoop.hbase.regionserver.TestEndToEndSplitTransaction
> [ERROR] Tests run: 3, Failures: 0, Errors: 1, Skipped: 0, Time elapsed: 50.388 s <<< FAILURE! - in org.apache.hadoop.hbase.regionserver.TestEndToEndSplitTransaction
> [ERROR] testMasterOpsWhileSplitting(org.apache.hadoop.hbase.regionserver.TestEndToEndSplitTransaction) Time elapsed: 8.903 s <<< ERROR!
> java.lang.NullPointerException
> at org.apache.hadoop.hbase.regionserver.TestEndToEndSplitTransaction.test(TestEndToEndSplitTransaction.java:239)
> at org.apache.hadoop.hbase.regionserver.TestEndToEndSplitTransaction.testMasterOpsWhileSplitting(TestEndToEndSplitTransaction.java:148)
--
This message was sent by Atlassian JIRA
(v7.6.3#76005)