You are viewing a plain text version of this content. The canonical link for it is here.
Posted to yarn-dev@hadoop.apache.org by Apache Jenkins Server <je...@builds.apache.org> on 2015/03/04 05:11:00 UTC

Failed: YARN-3264 PreCommit Build #6834

Jira: https://issues.apache.org/jira/browse/YARN-3264
Build: https://builds.apache.org/job/PreCommit-YARN-Build/6834/

###################################################################################
########################## LAST 60 LINES OF THE CONSOLE ###########################
[...truncated 23 lines...]

======================================================================
======================================================================
    Testing patch for YARN-3264.
======================================================================
======================================================================


HEAD is now at f2d7a67 HDFS-7682. {{DistributedFileSystem#getFileChecksum}} of a snapshotted file includes non-snapshotted content. Contributed by Charles Lamb.
Previous HEAD position was f2d7a67... HDFS-7682. {{DistributedFileSystem#getFileChecksum}} of a snapshotted file includes non-snapshotted content. Contributed by Charles Lamb.
Switched to branch 'trunk'
Your branch is behind 'origin/trunk' by 5 commits, and can be fast-forwarded.
  (use "git pull" to update your local branch)
First, rewinding head to replay your work on top of it...
Fast-forwarded trunk to f2d7a67a2c1d9dde10ed3171fdec65dff885afcc.
YARN-3264 patch is being downloaded at Wed Mar  4 04:10:51 UTC 2015 from
http://issues.apache.org/jira/secure/attachment/12702362/YARN-3264.002.patch
cp: cannot stat '/home/jenkins/buildSupport/lib/*': No such file or directory
The patch does not appear to apply with p0 to p2
PATCH APPLICATION FAILED




{color:red}-1 overall{color}.  Here are the results of testing the latest attachment 
  http://issues.apache.org/jira/secure/attachment/12702362/YARN-3264.002.patch
  against trunk revision f2d7a67.

    {color:red}-1 patch{color}.  The patch command could not apply the patch.

Console output: https://builds.apache.org/job/PreCommit-YARN-Build/6834//console

This message is automatically generated.


======================================================================
======================================================================
    Adding comment to Jira.
======================================================================
======================================================================


Comment added.
6b0258aeafc9659f5b849f9ffe935e1a2e73f2f3 logged out


======================================================================
======================================================================
    Finished build.
======================================================================
======================================================================


Build step 'Execute shell' marked build as failure
Archiving artifacts
[description-setter] Could not determine description.
Recording test results
Email was triggered for: Failure
Sending email for trigger: Failure



###################################################################################
############################## FAILED TESTS (if any) ##############################
No tests ran.

Failed: YARN-3267 PreCommit Build #6842

Posted by Apache Jenkins Server <je...@builds.apache.org>.
Jira: https://issues.apache.org/jira/browse/YARN-3267
Build: https://builds.apache.org/job/PreCommit-YARN-Build/6842/

###################################################################################
########################## LAST 60 LINES OF THE CONSOLE ###########################
[...truncated 3951 lines...]

{color:red}-1 overall{color}.  Here are the results of testing the latest attachment 
  http://issues.apache.org/jira/secure/attachment/12702573/YARN_3267_V1.patch
  against trunk revision 03cc229.

    {color:green}+1 @author{color}.  The patch does not contain any @author tags.

    {color:green}+1 tests included{color}.  The patch appears to include 5 new or modified test files.

    {color:green}+1 javac{color}.  The applied patch does not increase the total number of javac compiler warnings.

    {color:green}+1 javadoc{color}.  There were no new javadoc warning messages.

    {color:green}+1 eclipse:eclipse{color}.  The patch built with eclipse:eclipse.

    {color:green}+1 findbugs{color}.  The patch does not introduce any new Findbugs (version 2.0.3) warnings.

    {color:green}+1 release audit{color}.  The applied patch does not increase the total number of release audit warnings.

    {color:red}-1 core tests{color}.  The patch failed these unit tests in hadoop-mapreduce-project/hadoop-mapreduce-client/hadoop-mapreduce-client-app hadoop-mapreduce-project/hadoop-mapreduce-client/hadoop-mapreduce-client-jobclient hadoop-yarn-project/hadoop-yarn/hadoop-yarn-applications/hadoop-yarn-applications-distributedshell hadoop-yarn-project/hadoop-yarn/hadoop-yarn-server/hadoop-yarn-server-applicationhistoryservice:

                  org.apache.hadoop.yarn.server.timeline.TestLeveldbTimelineStore

Test results: https://builds.apache.org/job/PreCommit-YARN-Build/6842//testReport/
Console output: https://builds.apache.org/job/PreCommit-YARN-Build/6842//console

This message is automatically generated.


======================================================================
======================================================================
    Adding comment to Jira.
======================================================================
======================================================================


Comment added.
ce9c0ec35daff49233e56845494e15b607b7e462 logged out


======================================================================
======================================================================
    Finished build.
======================================================================
======================================================================


Build step 'Execute shell' marked build as failure
Archiving artifacts
Sending artifact delta relative to PreCommit-YARN-Build #6830
Archived 30 artifacts
Archive block size is 32768
Received 45 blocks and 7651000 bytes
Compression is 16.2%
Took 1.6 sec
[description-setter] Could not determine description.
Recording test results
Email was triggered for: Failure
Sending email for trigger: Failure



###################################################################################
############################## FAILED TESTS (if any) ##############################
2 tests failed.
FAILED:  org.apache.hadoop.yarn.server.timeline.TestLeveldbTimelineStore.testDeleteEntities

Error Message:
expected:<5> but was:<6>

Stack Trace:
java.lang.AssertionError: expected:<5> but was:<6>
	at org.junit.Assert.fail(Assert.java:88)
	at org.junit.Assert.failNotEquals(Assert.java:743)
	at org.junit.Assert.assertEquals(Assert.java:118)
	at org.junit.Assert.assertEquals(Assert.java:555)
	at org.junit.Assert.assertEquals(Assert.java:542)
	at org.apache.hadoop.yarn.server.timeline.TestLeveldbTimelineStore.testDeleteEntities(TestLeveldbTimelineStore.java:204)


FAILED:  org.apache.hadoop.yarn.server.timeline.TestLeveldbTimelineStore.testGetEntityTypes

Error Message:
expected:<6> but was:<7>

Stack Trace:
java.lang.AssertionError: expected:<6> but was:<7>
	at org.junit.Assert.fail(Assert.java:88)
	at org.junit.Assert.failNotEquals(Assert.java:743)
	at org.junit.Assert.assertEquals(Assert.java:118)
	at org.junit.Assert.assertEquals(Assert.java:555)
	at org.junit.Assert.assertEquals(Assert.java:542)
	at org.apache.hadoop.yarn.server.timeline.TestLeveldbTimelineStore.testGetEntityTypes(TestLeveldbTimelineStore.java:167)



Failed: YARN-2868 PreCommit Build #6841

Posted by Apache Jenkins Server <je...@builds.apache.org>.
Jira: https://issues.apache.org/jira/browse/YARN-2868
Build: https://builds.apache.org/job/PreCommit-YARN-Build/6841/

###################################################################################
########################## LAST 60 LINES OF THE CONSOLE ###########################
Started by remote host 127.0.0.1
Building remotely on H8 (Mapreduce Falcon Hadoop Pig Zookeeper Tez Hdfs) in workspace /home/jenkins/jenkins-slave/workspace/PreCommit-YARN-Build
 > git rev-parse --is-inside-work-tree # timeout=10
Fetching changes from the remote Git repository
 > git config remote.origin.url https://git-wip-us.apache.org/repos/asf/hadoop.git # timeout=10
Cleaning workspace
 > git rev-parse --verify HEAD # timeout=10
Resetting working tree
 > git reset --hard # timeout=10
 > git clean -fdx # timeout=10
Fetching upstream changes from https://git-wip-us.apache.org/repos/asf/hadoop.git
 > git --version # timeout=10
FATAL: Failed to fetch from https://git-wip-us.apache.org/repos/asf/hadoop.git
hudson.plugins.git.GitException: Failed to fetch from https://git-wip-us.apache.org/repos/asf/hadoop.git
	at hudson.plugins.git.GitSCM.fetchFrom(GitSCM.java:647)
	at hudson.plugins.git.GitSCM.retrieveChanges(GitSCM.java:889)
	at hudson.plugins.git.GitSCM.checkout(GitSCM.java:914)
	at hudson.model.AbstractProject.checkout(AbstractProject.java:1252)
	at hudson.model.AbstractBuild$AbstractBuildExecution.defaultCheckout(AbstractBuild.java:615)
	at jenkins.scm.SCMCheckoutStrategy.checkout(SCMCheckoutStrategy.java:86)
	at hudson.model.AbstractBuild$AbstractBuildExecution.run(AbstractBuild.java:524)
	at hudson.model.Run.execute(Run.java:1706)
	at hudson.model.FreeStyleBuild.run(FreeStyleBuild.java:43)
	at hudson.model.ResourceController.execute(ResourceController.java:88)
	at hudson.model.Executor.run(Executor.java:232)
Caused by: hudson.plugins.git.GitException: Failed to connect to https://git-wip-us.apache.org/repos/asf/hadoop.git (exception: org.apache.http.conn.ConnectTimeoutException: Connect to git-wip-us.apache.org:443 [git-wip-us.apache.org/140.211.11.23] failed: Connection timed out)
	at org.jenkinsci.plugins.gitclient.CliGitAPIImpl.checkCredentials(CliGitAPIImpl.java:2253)
	at org.jenkinsci.plugins.gitclient.CliGitAPIImpl.launchCommandWithCredentials(CliGitAPIImpl.java:1169)
	at org.jenkinsci.plugins.gitclient.CliGitAPIImpl.access$300(CliGitAPIImpl.java:85)
	at org.jenkinsci.plugins.gitclient.CliGitAPIImpl$1.execute(CliGitAPIImpl.java:280)
	at org.jenkinsci.plugins.gitclient.RemoteGitImpl$CommandInvocationHandler$1.call(RemoteGitImpl.java:153)
	at org.jenkinsci.plugins.gitclient.RemoteGitImpl$CommandInvocationHandler$1.call(RemoteGitImpl.java:146)
	at hudson.remoting.UserRequest.perform(UserRequest.java:118)
	at hudson.remoting.UserRequest.perform(UserRequest.java:48)
	at hudson.remoting.Request$2.run(Request.java:328)
	at hudson.remoting.InterceptingExecutorService$1.call(InterceptingExecutorService.java:72)
	at java.util.concurrent.FutureTask.run(FutureTask.java:262)
	at java.util.concurrent.ThreadPoolExecutor.runWorker(ThreadPoolExecutor.java:1145)
	at java.util.concurrent.ThreadPoolExecutor$Worker.run(ThreadPoolExecutor.java:615)
	at java.lang.Thread.run(Thread.java:745)



###################################################################################
############################## FAILED TESTS (if any) ##############################
No tests ran.

Failed: YARN-3242 PreCommit Build #6840

Posted by Apache Jenkins Server <je...@builds.apache.org>.
Jira: https://issues.apache.org/jira/browse/YARN-3242
Build: https://builds.apache.org/job/PreCommit-YARN-Build/6840/

###################################################################################
########################## LAST 60 LINES OF THE CONSOLE ###########################
Started by remote host 127.0.0.1
Building remotely on H5 (Mapreduce Falcon Hadoop Pig Zookeeper Tez Hdfs) in workspace /home/jenkins/jenkins-slave/workspace/PreCommit-YARN-Build
 > git rev-parse --is-inside-work-tree # timeout=10
Fetching changes from the remote Git repository
 > git config remote.origin.url https://git-wip-us.apache.org/repos/asf/hadoop.git # timeout=10
Cleaning workspace
 > git rev-parse --verify HEAD # timeout=10
Resetting working tree
 > git reset --hard # timeout=10
 > git clean -fdx # timeout=10
Fetching upstream changes from https://git-wip-us.apache.org/repos/asf/hadoop.git
 > git --version # timeout=10
FATAL: Failed to fetch from https://git-wip-us.apache.org/repos/asf/hadoop.git
hudson.plugins.git.GitException: Failed to fetch from https://git-wip-us.apache.org/repos/asf/hadoop.git
	at hudson.plugins.git.GitSCM.fetchFrom(GitSCM.java:647)
	at hudson.plugins.git.GitSCM.retrieveChanges(GitSCM.java:889)
	at hudson.plugins.git.GitSCM.checkout(GitSCM.java:914)
	at hudson.model.AbstractProject.checkout(AbstractProject.java:1252)
	at hudson.model.AbstractBuild$AbstractBuildExecution.defaultCheckout(AbstractBuild.java:615)
	at jenkins.scm.SCMCheckoutStrategy.checkout(SCMCheckoutStrategy.java:86)
	at hudson.model.AbstractBuild$AbstractBuildExecution.run(AbstractBuild.java:524)
	at hudson.model.Run.execute(Run.java:1706)
	at hudson.model.FreeStyleBuild.run(FreeStyleBuild.java:43)
	at hudson.model.ResourceController.execute(ResourceController.java:88)
	at hudson.model.Executor.run(Executor.java:232)
Caused by: hudson.plugins.git.GitException: Failed to connect to https://git-wip-us.apache.org/repos/asf/hadoop.git (exception: org.apache.http.conn.ConnectTimeoutException: Connect to git-wip-us.apache.org:443 [git-wip-us.apache.org/140.211.11.23] failed: Connection timed out)
	at org.jenkinsci.plugins.gitclient.CliGitAPIImpl.checkCredentials(CliGitAPIImpl.java:2253)
	at org.jenkinsci.plugins.gitclient.CliGitAPIImpl.launchCommandWithCredentials(CliGitAPIImpl.java:1169)
	at org.jenkinsci.plugins.gitclient.CliGitAPIImpl.access$300(CliGitAPIImpl.java:85)
	at org.jenkinsci.plugins.gitclient.CliGitAPIImpl$1.execute(CliGitAPIImpl.java:280)
	at org.jenkinsci.plugins.gitclient.RemoteGitImpl$CommandInvocationHandler$1.call(RemoteGitImpl.java:153)
	at org.jenkinsci.plugins.gitclient.RemoteGitImpl$CommandInvocationHandler$1.call(RemoteGitImpl.java:146)
	at hudson.remoting.UserRequest.perform(UserRequest.java:118)
	at hudson.remoting.UserRequest.perform(UserRequest.java:48)
	at hudson.remoting.Request$2.run(Request.java:328)
	at hudson.remoting.InterceptingExecutorService$1.call(InterceptingExecutorService.java:72)
	at java.util.concurrent.FutureTask.run(FutureTask.java:262)
	at java.util.concurrent.ThreadPoolExecutor.runWorker(ThreadPoolExecutor.java:1145)
	at java.util.concurrent.ThreadPoolExecutor$Worker.run(ThreadPoolExecutor.java:615)
	at java.lang.Thread.run(Thread.java:745)



###################################################################################
############################## FAILED TESTS (if any) ##############################
No tests ran.

Failed: YARN-3136 PreCommit Build #6839

Posted by Apache Jenkins Server <je...@builds.apache.org>.
Jira: https://issues.apache.org/jira/browse/YARN-3136
Build: https://builds.apache.org/job/PreCommit-YARN-Build/6839/

###################################################################################
########################## LAST 60 LINES OF THE CONSOLE ###########################
[...truncated 3475 lines...]
  against trunk revision 3560180.

    {color:green}+1 @author{color}.  The patch does not contain any @author tags.

    {color:red}-1 tests included{color}.  The patch doesn't appear to include any new or modified tests.
                        Please justify why no new tests are needed for this patch.
                        Also please list what manual steps were performed to verify this patch.

    {color:green}+1 javac{color}.  The applied patch does not increase the total number of javac compiler warnings.

    {color:green}+1 javadoc{color}.  There were no new javadoc warning messages.

    {color:green}+1 eclipse:eclipse{color}.  The patch built with eclipse:eclipse.

    {color:red}-1 findbugs{color}.  The patch appears to introduce 8 new Findbugs (version 2.0.3) warnings.

    {color:green}+1 release audit{color}.  The applied patch does not increase the total number of release audit warnings.

    {color:red}-1 core tests{color}.  The patch failed these unit tests in hadoop-yarn-project/hadoop-yarn/hadoop-yarn-server/hadoop-yarn-server-resourcemanager:

                  org.apache.hadoop.yarn.server.resourcemanager.TestRMRestart

Test results: https://builds.apache.org/job/PreCommit-YARN-Build/6839//testReport/
Findbugs warnings: https://builds.apache.org/job/PreCommit-YARN-Build/6839//artifact/patchprocess/newPatchFindbugsWarningshadoop-yarn-server-resourcemanager.html
Console output: https://builds.apache.org/job/PreCommit-YARN-Build/6839//console

This message is automatically generated.


======================================================================
======================================================================
    Adding comment to Jira.
======================================================================
======================================================================


Comment added.
8184b0579555c454f99c974c38d02f7a1b0314ab logged out


======================================================================
======================================================================
    Finished build.
======================================================================
======================================================================


Build step 'Execute shell' marked build as failure
Archiving artifacts
Sending artifact delta relative to PreCommit-YARN-Build #6830
Archived 15 artifacts
Archive block size is 32768
Received 40 blocks and 7810103 bytes
Compression is 14.4%
Took 1.6 sec
[description-setter] Could not determine description.
Recording test results
Email was triggered for: Failure
Sending email for trigger: Failure



###################################################################################
############################## FAILED TESTS (if any) ##############################
1 tests failed.
REGRESSION:  org.apache.hadoop.yarn.server.resourcemanager.TestRMRestart.testRMRestartGetApplicationList[1]

Error Message:

rMAppManager.logApplicationSummary(
    isA(org.apache.hadoop.yarn.api.records.ApplicationId)
);
Wanted 3 times:
-> at org.apache.hadoop.yarn.server.resourcemanager.TestRMRestart.testRMRestartGetApplicationList(TestRMRestart.java:969)
But was 2 times:
-> at org.apache.hadoop.yarn.server.resourcemanager.RMAppManager.handle(RMAppManager.java:66)


Stack Trace:
org.mockito.exceptions.verification.TooLittleActualInvocations: 
rMAppManager.logApplicationSummary(
    isA(org.apache.hadoop.yarn.api.records.ApplicationId)
);
Wanted 3 times:
-> at org.apache.hadoop.yarn.server.resourcemanager.TestRMRestart.testRMRestartGetApplicationList(TestRMRestart.java:969)
But was 2 times:
-> at org.apache.hadoop.yarn.server.resourcemanager.RMAppManager.handle(RMAppManager.java:66)

	at org.apache.hadoop.yarn.server.resourcemanager.TestRMRestart.testRMRestartGetApplicationList(TestRMRestart.java:969)



Failed: YARN-3136 PreCommit Build #6838

Posted by Apache Jenkins Server <je...@builds.apache.org>.
Jira: https://issues.apache.org/jira/browse/YARN-3136
Build: https://builds.apache.org/job/PreCommit-YARN-Build/6838/

###################################################################################
########################## LAST 60 LINES OF THE CONSOLE ###########################
[...truncated 3452 lines...]
{color:red}-1 overall{color}.  Here are the results of testing the latest attachment 
  http://issues.apache.org/jira/secure/attachment/12699495/0003-YARN-3136.patch
  against trunk revision 3560180.

    {color:green}+1 @author{color}.  The patch does not contain any @author tags.

    {color:red}-1 tests included{color}.  The patch doesn't appear to include any new or modified tests.
                        Please justify why no new tests are needed for this patch.
                        Also please list what manual steps were performed to verify this patch.

    {color:green}+1 javac{color}.  The applied patch does not increase the total number of javac compiler warnings.

    {color:green}+1 javadoc{color}.  There were no new javadoc warning messages.

    {color:green}+1 eclipse:eclipse{color}.  The patch built with eclipse:eclipse.

    {color:red}-1 findbugs{color}.  The patch appears to introduce 8 new Findbugs (version 2.0.3) warnings.

    {color:green}+1 release audit{color}.  The applied patch does not increase the total number of release audit warnings.

    {color:green}+1 core tests{color}.  The patch passed unit tests in hadoop-yarn-project/hadoop-yarn/hadoop-yarn-server/hadoop-yarn-server-resourcemanager.

Test results: https://builds.apache.org/job/PreCommit-YARN-Build/6838//testReport/
Findbugs warnings: https://builds.apache.org/job/PreCommit-YARN-Build/6838//artifact/patchprocess/newPatchFindbugsWarningshadoop-yarn-server-resourcemanager.html
Console output: https://builds.apache.org/job/PreCommit-YARN-Build/6838//console

This message is automatically generated.


======================================================================
======================================================================
    Adding comment to Jira.
======================================================================
======================================================================


Comment added.
326a8d6000459449ecda8c67b3ddc550e96f125f logged out


======================================================================
======================================================================
    Finished build.
======================================================================
======================================================================


Build step 'Execute shell' marked build as failure
Archiving artifacts
Sending artifact delta relative to PreCommit-YARN-Build #6830
Archived 15 artifacts
Archive block size is 32768
Received 51 blocks and 7449449 bytes
Compression is 18.3%
Took 1.6 sec
[description-setter] Could not determine description.
Recording test results
Email was triggered for: Failure
Sending email for trigger: Failure



###################################################################################
############################## FAILED TESTS (if any) ##############################
All tests passed

Failed: YARN-2693 PreCommit Build #6837

Posted by Apache Jenkins Server <je...@builds.apache.org>.
Jira: https://issues.apache.org/jira/browse/YARN-2693
Build: https://builds.apache.org/job/PreCommit-YARN-Build/6837/

###################################################################################
########################## LAST 60 LINES OF THE CONSOLE ###########################
[...truncated 3541 lines...]
  http://issues.apache.org/jira/secure/attachment/12702487/0006-YARN-2693.patch
  against trunk revision 3560180.

    {color:green}+1 @author{color}.  The patch does not contain any @author tags.

    {color:green}+1 tests included{color}.  The patch appears to include 3 new or modified test files.

      {color:red}-1 javac{color}.  The applied patch generated 1152 javac compiler warnings (more than the trunk's current 1151 warnings).

    {color:green}+1 javadoc{color}.  There were no new javadoc warning messages.

    {color:green}+1 eclipse:eclipse{color}.  The patch built with eclipse:eclipse.

    {color:red}-1 findbugs{color}.  The patch appears to introduce 7 new Findbugs (version 2.0.3) warnings.

    {color:green}+1 release audit{color}.  The applied patch does not increase the total number of release audit warnings.

    {color:red}-1 core tests{color}.  The patch failed these unit tests in hadoop-yarn-project/hadoop-yarn/hadoop-yarn-api hadoop-yarn-project/hadoop-yarn/hadoop-yarn-server/hadoop-yarn-server-resourcemanager:

                  org.apache.hadoop.yarn.server.resourcemanager.applicationpriority.TestApplicationPriorityManager

Test results: https://builds.apache.org/job/PreCommit-YARN-Build/6837//testReport/
Findbugs warnings: https://builds.apache.org/job/PreCommit-YARN-Build/6837//artifact/patchprocess/newPatchFindbugsWarningshadoop-yarn-server-resourcemanager.html
Javac warnings: https://builds.apache.org/job/PreCommit-YARN-Build/6837//artifact/patchprocess/diffJavacWarnings.txt
Console output: https://builds.apache.org/job/PreCommit-YARN-Build/6837//console

This message is automatically generated.


======================================================================
======================================================================
    Adding comment to Jira.
======================================================================
======================================================================


Comment added.
495afc3a1aed19262d5b9f8eb1af89d025d50fd2 logged out


======================================================================
======================================================================
    Finished build.
======================================================================
======================================================================


Build step 'Execute shell' marked build as failure
Archiving artifacts
Sending artifact delta relative to PreCommit-YARN-Build #6830
Archived 21 artifacts
Archive block size is 32768
Received 49 blocks and 7849725 bytes
Compression is 17.0%
Took 1.7 sec
[description-setter] Could not determine description.
Recording test results
Email was triggered for: Failure
Sending email for trigger: Failure



###################################################################################
############################## FAILED TESTS (if any) ##############################
1 tests failed.
FAILED:  org.apache.hadoop.yarn.server.resourcemanager.applicationpriority.TestApplicationPriorityManager.testRemovePrioritylabelAddedToQueue

Error Message:
Default Priority configured should beless than or equal to Max application priority '1

Stack Trace:
java.io.IOException: Default Priority configured should beless than or equal to Max application priority '1
	at org.apache.hadoop.yarn.server.resourcemanager.applicationpriority.ApplicationPriorityManager.setApplicationPriorityPerQueue(ApplicationPriorityManager.java:296)
	at org.apache.hadoop.yarn.server.resourcemanager.applicationpriority.TestApplicationPriorityManager.testRemovePrioritylabelAddedToQueue(TestApplicationPriorityManager.java:140)



Failed: YARN-3249 PreCommit Build #6836

Posted by Apache Jenkins Server <je...@builds.apache.org>.
Jira: https://issues.apache.org/jira/browse/YARN-3249
Build: https://builds.apache.org/job/PreCommit-YARN-Build/6836/

###################################################################################
########################## LAST 60 LINES OF THE CONSOLE ###########################
[...truncated 3502 lines...]
{color:red}-1 overall{color}.  Here are the results of testing the latest attachment 
  http://issues.apache.org/jira/secure/attachment/12702452/YARN-3249.6.patch
  against trunk revision 3560180.

    {color:green}+1 @author{color}.  The patch does not contain any @author tags.

    {color:red}-1 tests included{color}.  The patch doesn't appear to include any new or modified tests.
                        Please justify why no new tests are needed for this patch.
                        Also please list what manual steps were performed to verify this patch.

    {color:green}+1 javac{color}.  The applied patch does not increase the total number of javac compiler warnings.

    {color:green}+1 javadoc{color}.  There were no new javadoc warning messages.

    {color:green}+1 eclipse:eclipse{color}.  The patch built with eclipse:eclipse.

    {color:red}-1 findbugs{color}.  The patch appears to introduce 7 new Findbugs (version 2.0.3) warnings.

    {color:green}+1 release audit{color}.  The applied patch does not increase the total number of release audit warnings.

    {color:green}+1 core tests{color}.  The patch passed unit tests in hadoop-yarn-project/hadoop-yarn/hadoop-yarn-api hadoop-yarn-project/hadoop-yarn/hadoop-yarn-server/hadoop-yarn-server-resourcemanager.

Test results: https://builds.apache.org/job/PreCommit-YARN-Build/6836//testReport/
Findbugs warnings: https://builds.apache.org/job/PreCommit-YARN-Build/6836//artifact/patchprocess/newPatchFindbugsWarningshadoop-yarn-server-resourcemanager.html
Console output: https://builds.apache.org/job/PreCommit-YARN-Build/6836//console

This message is automatically generated.


======================================================================
======================================================================
    Adding comment to Jira.
======================================================================
======================================================================


Comment added.
0640471cbe99112ee2be4eb13b69469ae9e1867f logged out


======================================================================
======================================================================
    Finished build.
======================================================================
======================================================================


Build step 'Execute shell' marked build as failure
Archiving artifacts
Sending artifact delta relative to PreCommit-YARN-Build #6830
Archived 20 artifacts
Archive block size is 32768
Received 45 blocks and 7972499 bytes
Compression is 15.6%
Took 3.2 sec
[description-setter] Could not determine description.
Recording test results
Email was triggered for: Failure
Sending email for trigger: Failure



###################################################################################
############################## FAILED TESTS (if any) ##############################
All tests passed

Failed: YARN-3264 PreCommit Build #6835

Posted by Apache Jenkins Server <je...@builds.apache.org>.
Jira: https://issues.apache.org/jira/browse/YARN-3264
Build: https://builds.apache.org/job/PreCommit-YARN-Build/6835/

###################################################################################
########################## LAST 60 LINES OF THE CONSOLE ###########################
[...truncated 23 lines...]

======================================================================
======================================================================
    Testing patch for YARN-3264.
======================================================================
======================================================================


HEAD is now at 3560180 HDFS-7869. Inconsistency in the return information while performing rolling upgrade ( Contributed by J.Andreina )
Previous HEAD position was 3560180... HDFS-7869. Inconsistency in the return information while performing rolling upgrade ( Contributed by J.Andreina )
Switched to branch 'trunk'
Your branch is behind 'origin/trunk' by 7 commits, and can be fast-forwarded.
  (use "git pull" to update your local branch)
First, rewinding head to replay your work on top of it...
Fast-forwarded trunk to 3560180b6e9926aa3ee1357da59b28a4b4689a0d.
YARN-3264 patch is being downloaded at Wed Mar  4 09:44:16 UTC 2015 from
http://issues.apache.org/jira/secure/attachment/12702408/YARN-3264.003.patch
cp: cannot stat '/home/jenkins/buildSupport/lib/*': No such file or directory
The patch does not appear to apply with p0 to p2
PATCH APPLICATION FAILED




{color:red}-1 overall{color}.  Here are the results of testing the latest attachment 
  http://issues.apache.org/jira/secure/attachment/12702408/YARN-3264.003.patch
  against trunk revision 3560180.

    {color:red}-1 patch{color}.  The patch command could not apply the patch.

Console output: https://builds.apache.org/job/PreCommit-YARN-Build/6835//console

This message is automatically generated.


======================================================================
======================================================================
    Adding comment to Jira.
======================================================================
======================================================================


Comment added.
d9cea002ec31c25539d0031df530a3160f8ae1e0 logged out


======================================================================
======================================================================
    Finished build.
======================================================================
======================================================================


Build step 'Execute shell' marked build as failure
Archiving artifacts
[description-setter] Could not determine description.
Recording test results
Email was triggered for: Failure
Sending email for trigger: Failure



###################################################################################
############################## FAILED TESTS (if any) ##############################
No tests ran.