You are viewing a plain text version of this content. The canonical link for it is here.
Posted to builds@beam.apache.org by Apache Jenkins Server <je...@builds.apache.org> on 2022/08/27 00:28:40 UTC
Build failed in Jenkins: beam_PostCommit_Python_Examples_Direct #801
See <https://ci-beam.apache.org/job/beam_PostCommit_Python_Examples_Direct/801/display/redirect?page=changes>
Changes:
[noreply] Update wordcount_minimal.py by removing pipeline_args.extend (#22786)
[noreply] Add map state in the Go Sdk (#22897)
[noreply] [BEAM-12164] Feat: Added support to Cloud Spanner Change Streams
------------------------------------------
[...truncated 407.50 KB...]
INFO apache_beam.runners.portability.fn_api_runner.translations:translations.py:714 ==================== <function populate_data_channel_coders at 0x7f312b6915e0> ====================
INFO apache_beam.runners.worker.statecache:statecache.py:172 Creating state cache with size 100
INFO apache_beam.runners.portability.fn_api_runner.worker_handlers:worker_handlers.py:903 Created Worker handler <apache_beam.runners.portability.fn_api_runner.worker_handlers.EmbeddedWorkerHandler object at 0x7f314f6b3f10> for environment ref_Environment_default_environment_1 (beam:env:embedded_python:v1, b'')
INFO apache_beam.io.fileio:fileio.py:668 Moving temporary file /tmp/.tempea464d76-c27a-48a9-9d95-e2297b81e991/2984426674391695015_60d057ae-2ada-4ff4-ae48-12a0f33576cc to dir: /tmp as tmp4lx0o0i9.result-00000-of-00001. Res: FileResult(file_name='/tmp/.tempea464d76-c27a-48a9-9d95-e2297b81e991/2984426674391695015_60d057ae-2ada-4ff4-ae48-12a0f33576cc', shard_index=-1, total_shards=0, window=GlobalWindow, pane=None, destination=None)
PASSED [100%]
=============================== warnings summary ===============================
../../build/gradleenv/1398941892/lib/python3.8/site-packages/hdfs/config.py:15
<https://ci-beam.apache.org/job/beam_PostCommit_Python_Examples_Direct/ws/src/build/gradleenv/1398941892/lib/python3.8/site-packages/hdfs/config.py>:15: DeprecationWarning: the imp module is deprecated in favour of importlib; see the module's documentation for alternative uses
from imp import load_source
../../build/gradleenv/1398941892/lib/python3.8/site-packages/tenacity/_asyncio.py:42
<https://ci-beam.apache.org/job/beam_PostCommit_Python_Examples_Direct/ws/src/build/gradleenv/1398941892/lib/python3.8/site-packages/tenacity/_asyncio.py>:42: DeprecationWarning: "@coroutine" decorator is deprecated since Python 3.8, use "async def" instead
def call(self, fn, *args, **kwargs):
apache_beam/examples/complete/game/hourly_team_score_it_test.py::HourlyTeamScoreIT::test_hourly_team_score_output_checksum_on_small_input
<https://ci-beam.apache.org/job/beam_PostCommit_Python_Examples_Direct/ws/src/sdks/python/apache_beam/io/gcp/tests/utils.py>:63: PendingDeprecationWarning: Client.dataset is deprecated and will be removed in a future version. Use a string like 'my_project.my_dataset' or a cloud.google.bigquery.DatasetReference object, instead.
dataset_ref = client.dataset(unique_dataset_name, project=project)
apache_beam/examples/complete/game/hourly_team_score_it_test.py::HourlyTeamScoreIT::test_hourly_team_score_output_checksum_on_small_input
apache_beam/examples/cookbook/bigquery_tornadoes_it_test.py::BigqueryTornadoesIT::test_bigquery_tornadoes_it
apache_beam/examples/cookbook/filters_test.py::FiltersTest::test_filters_output_bigquery_matcher
<https://ci-beam.apache.org/job/beam_PostCommit_Python_Examples_Direct/ws/src/sdks/python/apache_beam/io/gcp/bigquery.py>:2285: BeamDeprecationWarning: options is deprecated since First stable release. References to <pipeline>.options will not be supported
is_streaming_pipeline = p.options.view_as(StandardOptions).streaming
apache_beam/examples/complete/game/hourly_team_score_it_test.py::HourlyTeamScoreIT::test_hourly_team_score_output_checksum_on_small_input
apache_beam/examples/cookbook/bigquery_tornadoes_it_test.py::BigqueryTornadoesIT::test_bigquery_tornadoes_it
apache_beam/examples/cookbook/filters_test.py::FiltersTest::test_filters_output_bigquery_matcher
<https://ci-beam.apache.org/job/beam_PostCommit_Python_Examples_Direct/ws/src/sdks/python/apache_beam/io/gcp/bigquery.py>:2291: BeamDeprecationWarning: options is deprecated since First stable release. References to <pipeline>.options will not be supported
experiments = p.options.view_as(DebugOptions).experiments or []
apache_beam/examples/complete/game/hourly_team_score_it_test.py::HourlyTeamScoreIT::test_hourly_team_score_output_checksum_on_small_input
apache_beam/examples/cookbook/bigquery_tornadoes_it_test.py::BigqueryTornadoesIT::test_bigquery_tornadoes_it
apache_beam/examples/cookbook/filters_test.py::FiltersTest::test_filters_output_bigquery_matcher
<https://ci-beam.apache.org/job/beam_PostCommit_Python_Examples_Direct/ws/src/sdks/python/apache_beam/io/gcp/bigquery_file_loads.py>:1129: BeamDeprecationWarning: options is deprecated since First stable release. References to <pipeline>.options will not be supported
temp_location = p.options.view_as(GoogleCloudOptions).temp_location
apache_beam/examples/complete/game/hourly_team_score_it_test.py::HourlyTeamScoreIT::test_hourly_team_score_output_checksum_on_small_input
apache_beam/examples/cookbook/bigquery_tornadoes_it_test.py::BigqueryTornadoesIT::test_bigquery_tornadoes_it
apache_beam/examples/cookbook/filters_test.py::FiltersTest::test_filters_output_bigquery_matcher
<https://ci-beam.apache.org/job/beam_PostCommit_Python_Examples_Direct/ws/src/sdks/python/apache_beam/io/gcp/bigquery_file_loads.py>:1131: BeamDeprecationWarning: options is deprecated since First stable release. References to <pipeline>.options will not be supported
p.options.view_as(GoogleCloudOptions).job_name or 'AUTOMATIC_JOB_NAME')
apache_beam/examples/cookbook/bigquery_side_input_it_test.py::BigQuerySideInputIT::test_bigquery_side_input_it
apache_beam/examples/cookbook/bigquery_side_input_it_test.py::BigQuerySideInputIT::test_bigquery_side_input_it
apache_beam/examples/cookbook/bigquery_tornadoes_it_test.py::BigqueryTornadoesIT::test_bigquery_tornadoes_it
apache_beam/examples/cookbook/filters_test.py::FiltersTest::test_filters_output_bigquery_matcher
apache_beam/examples/dataframe/flight_delays_it_test.py::FlightDelaysTest::test_flight_delays
<https://ci-beam.apache.org/job/beam_PostCommit_Python_Examples_Direct/ws/src/sdks/python/apache_beam/io/gcp/bigquery.py>:2774: BeamDeprecationWarning: options is deprecated since First stable release. References to <pipeline>.options will not be supported
temp_location = pcoll.pipeline.options.view_as(
apache_beam/examples/cookbook/bigquery_side_input_it_test.py::BigQuerySideInputIT::test_bigquery_side_input_it
apache_beam/examples/cookbook/bigquery_side_input_it_test.py::BigQuerySideInputIT::test_bigquery_side_input_it
apache_beam/examples/cookbook/bigquery_tornadoes_it_test.py::BigqueryTornadoesIT::test_bigquery_tornadoes_it
apache_beam/examples/cookbook/filters_test.py::FiltersTest::test_filters_output_bigquery_matcher
apache_beam/examples/dataframe/flight_delays_it_test.py::FlightDelaysTest::test_flight_delays
<https://ci-beam.apache.org/job/beam_PostCommit_Python_Examples_Direct/ws/src/sdks/python/apache_beam/io/gcp/bigquery.py>:2776: BeamDeprecationWarning: options is deprecated since First stable release. References to <pipeline>.options will not be supported
job_name = pcoll.pipeline.options.view_as(GoogleCloudOptions).job_name
apache_beam/examples/cookbook/bigquery_side_input_it_test.py::BigQuerySideInputIT::test_bigquery_side_input_it
apache_beam/examples/cookbook/bigquery_side_input_it_test.py::BigQuerySideInputIT::test_bigquery_side_input_it
apache_beam/examples/cookbook/bigquery_tornadoes_it_test.py::BigqueryTornadoesIT::test_bigquery_tornadoes_it
apache_beam/examples/cookbook/filters_test.py::FiltersTest::test_filters_output_bigquery_matcher
apache_beam/examples/dataframe/flight_delays_it_test.py::FlightDelaysTest::test_flight_delays
<https://ci-beam.apache.org/job/beam_PostCommit_Python_Examples_Direct/ws/src/sdks/python/apache_beam/io/gcp/bigquery.py>:2800: BeamDeprecationWarning: options is deprecated since First stable release. References to <pipeline>.options will not be supported
pipeline_options=pcoll.pipeline.options,
apache_beam/examples/cookbook/bigquery_tornadoes_it_test.py::BigqueryTornadoesIT::test_bigquery_tornadoes_it
apache_beam/examples/cookbook/filters_test.py::FiltersTest::test_filters_output_bigquery_matcher
<https://ci-beam.apache.org/job/beam_PostCommit_Python_Examples_Direct/ws/src/sdks/python/apache_beam/io/gcp/bigquery.py>:2281: BeamDeprecationWarning: options is deprecated since First stable release. References to <pipeline>.options will not be supported
self.table_reference.projectId = pcoll.pipeline.options.view_as(
apache_beam/examples/cookbook/bigquery_tornadoes_it_test.py::BigqueryTornadoesIT::test_bigquery_tornadoes_it
apache_beam/examples/cookbook/filters_test.py::FiltersTest::test_filters_output_bigquery_matcher
<https://ci-beam.apache.org/job/beam_PostCommit_Python_Examples_Direct/ws/src/sdks/python/apache_beam/io/gcp/tests/utils.py>:100: PendingDeprecationWarning: Client.dataset is deprecated and will be removed in a future version. Use a string like 'my_project.my_dataset' or a cloud.google.bigquery.DatasetReference object, instead.
table_ref = client.dataset(dataset_id).table(table_id)
apache_beam/examples/dataframe/flight_delays_it_test.py: 46 warnings
<https://ci-beam.apache.org/job/beam_PostCommit_Python_Examples_Direct/ws/src/sdks/python/apache_beam/examples/dataframe/flight_delays.py>:47: FutureWarning: Dropping of nuisance columns in DataFrame reductions (with 'numeric_only=None') is deprecated; in a future version this will raise TypeError. Select only valid columns before calling the reduction.
return airline_df[at_top_airports].mean()
apache_beam/examples/dataframe/flight_delays_it_test.py::FlightDelaysTest::test_flight_delays
apache_beam/examples/dataframe/wordcount_test.py::WordCountTest::test_basics
<https://ci-beam.apache.org/job/beam_PostCommit_Python_Examples_Direct/ws/src/sdks/python/apache_beam/dataframe/io.py>:629: FutureWarning: WriteToFiles is experimental.
return pcoll | fileio.WriteToFiles(
apache_beam/examples/dataframe/flight_delays_it_test.py::FlightDelaysTest::test_flight_delays
apache_beam/examples/dataframe/wordcount_test.py::WordCountTest::test_basics
<https://ci-beam.apache.org/job/beam_PostCommit_Python_Examples_Direct/ws/src/sdks/python/apache_beam/io/fileio.py>:581: BeamDeprecationWarning: options is deprecated since First stable release. References to <pipeline>.options will not be supported
p.options.view_as(GoogleCloudOptions).temp_location or
-- Docs: https://docs.pytest.org/en/stable/how-to/capture-warnings.html
- generated xml file: <https://ci-beam.apache.org/job/beam_PostCommit_Python_Examples_Direct/ws/src/sdks/python/pytest_postCommitExamples-direct-py38.xml> -
=== 22 passed, 3 skipped, 6529 deselected, 84 warnings in 286.68s (0:04:46) ====
> Task :sdks:python:test-suites:direct:py37:examples
INFO root:bigquery_tools.py:637 Job status: DONE
INFO apache_beam.io.gcp.bigquery_tools:bigquery_tools.py:569 Started BigQuery job: <JobReference
jobId: 'beam_bq_job_EXPORT_BQ_EXPORT_JOB_fb7fe2c1-2_1661560094_139'
location: 'US'
projectId: 'apache-beam-testing'>
bq show -j --format=prettyjson --project_id=apache-beam-testing beam_bq_job_EXPORT_BQ_EXPORT_JOB_fb7fe2c1-2_1661560094_139
INFO root:bigquery_tools.py:637 Job status: RUNNING
INFO root:bigquery_tools.py:637 Job status: DONE
INFO apache_beam.io.gcp.gcsio:gcsio.py:612 Finished listing 1 files in 0.05898642539978027 seconds.
INFO apache_beam.io.gcp.gcsio:gcsio.py:612 Finished listing 1 files in 0.03801298141479492 seconds.
INFO apache_beam.io.fileio:fileio.py:673 Moving temporary file gs://temp-storage-for-end-to-end-tests/temp-it/.temp99b1f4ec-6ff1-465f-ab4c-a8b326a82618/8286699734829367346_e6ea5d20-5ebd-4ceb-899b-c839bc6aad27 to dir: gs://temp-storage-for-end-to-end-tests/temp-it/flight_delays_it-d78bbf02-3f32-4188-9128-04c6ee27fd96 as output.csv-2012-12-25T00:00:00-2012-12-26T00:00:00-00000-of-00001. Res: FileResult(file_name='gs://temp-storage-for-end-to-end-tests/temp-it/.temp99b1f4ec-6ff1-465f-ab4c-a8b326a82618/8286699734829367346_e6ea5d20-5ebd-4ceb-899b-c839bc6aad27', shard_index=-1, total_shards=0, window=[1356393600.0, 1356480000.0), pane=None, destination=None)
INFO apache_beam.io.fileio:fileio.py:673 Moving temporary file gs://temp-storage-for-end-to-end-tests/temp-it/.temp99b1f4ec-6ff1-465f-ab4c-a8b326a82618/8861104276858470350_a7686cae-8b0d-4232-bc81-470a0229db4f to dir: gs://temp-storage-for-end-to-end-tests/temp-it/flight_delays_it-d78bbf02-3f32-4188-9128-04c6ee27fd96 as output.csv-2012-12-24T00:00:00-2012-12-25T00:00:00-00000-of-00001. Res: FileResult(file_name='gs://temp-storage-for-end-to-end-tests/temp-it/.temp99b1f4ec-6ff1-465f-ab4c-a8b326a82618/8861104276858470350_a7686cae-8b0d-4232-bc81-470a0229db4f', shard_index=-1, total_shards=0, window=[1356307200.0, 1356393600.0), pane=None, destination=None)
INFO apache_beam.io.fileio:fileio.py:673 Moving temporary file gs://temp-storage-for-end-to-end-tests/temp-it/.temp99b1f4ec-6ff1-465f-ab4c-a8b326a82618/4890718509110427598_4ce4c0f2-30fe-4f3a-9d16-8373d363a34f to dir: gs://temp-storage-for-end-to-end-tests/temp-it/flight_delays_it-d78bbf02-3f32-4188-9128-04c6ee27fd96 as output.csv-2012-12-23T00:00:00-2012-12-24T00:00:00-00000-of-00001. Res: FileResult(file_name='gs://temp-storage-for-end-to-end-tests/temp-it/.temp99b1f4ec-6ff1-465f-ab4c-a8b326a82618/4890718509110427598_4ce4c0f2-30fe-4f3a-9d16-8373d363a34f', shard_index=-1, total_shards=0, window=[1356220800.0, 1356307200.0), pane=None, destination=None)
INFO apache_beam.io.gcp.gcsio:gcsio.py:612 Finished listing 1 files in 0.04438304901123047 seconds.
INFO apache_beam.io.gcp.gcsio:gcsio.py:612 Finished listing 1 files in 0.04593777656555176 seconds.
INFO apache_beam.io.gcp.gcsio:gcsio.py:612 Finished listing 1 files in 0.043865203857421875 seconds.
INFO apache_beam.io.gcp.gcsio:gcsio.py:612 Finished listing 3 files in 0.044167280197143555 seconds.
PASSED [ 95%]
apache_beam/examples/dataframe/wordcount_test.py::WordCountTest::test_basics
-------------------------------- live log call ---------------------------------
INFO root:pipeline.py:188 Missing pipeline option (runner). Executing pipeline using the default runner: DirectRunner.
INFO root:transforms.py:182 Computing dataframe stage <ComputeStage(PTransform) label=[[ComputedExpression[set_column_DataFrame_140474846329040], ComputedExpression[set_index_DataFrame_140474840209168], ComputedExpression[pre_combine_sum_DataFrame_140474882071952]]:140474882844368]> for Stage[inputs={PlaceholderExpression[placeholder_DataFrame_140475503032016]}, partitioning=Arbitrary, ops=[ComputedExpression[set_column_DataFrame_140474846329040], ComputedExpression[set_index_DataFrame_140474840209168], ComputedExpression[pre_combine_sum_DataFrame_140474882071952]], outputs={ComputedExpression[pre_combine_sum_DataFrame_140474882071952], PlaceholderExpression[placeholder_DataFrame_140475503032016]}]
INFO root:transforms.py:182 Computing dataframe stage <ComputeStage(PTransform) label=[[ComputedExpression[post_combine_sum_DataFrame_140474846701072]]:140474882845200]> for Stage[inputs={ComputedExpression[pre_combine_sum_DataFrame_140474882071952]}, partitioning=Index, ops=[ComputedExpression[post_combine_sum_DataFrame_140474846701072]], outputs={ComputedExpression[post_combine_sum_DataFrame_140474846701072]}]
INFO apache_beam.io.fileio:fileio.py:586 Added temporary directory /tmp/.temp2a86deb8-098b-4c1e-a219-da9f7355aa0e
INFO root:environments.py:376 Default Python SDK image for environment is apache/beam_python3.7_sdk:2.42.0.dev
INFO apache_beam.runners.portability.fn_api_runner.translations:translations.py:714 ==================== <function annotate_downstream_side_inputs at 0x7fc2f0a7a830> ====================
INFO apache_beam.runners.portability.fn_api_runner.translations:translations.py:714 ==================== <function fix_side_input_pcoll_coders at 0x7fc2f0a7a950> ====================
INFO apache_beam.runners.portability.fn_api_runner.translations:translations.py:714 ==================== <function pack_combiners at 0x7fc2f0a7ae60> ====================
INFO apache_beam.runners.portability.fn_api_runner.translations:translations.py:714 ==================== <function lift_combiners at 0x7fc2f0a7aef0> ====================
INFO apache_beam.runners.portability.fn_api_runner.translations:translations.py:714 ==================== <function expand_sdf at 0x7fc2f0a810e0> ====================
INFO apache_beam.runners.portability.fn_api_runner.translations:translations.py:714 ==================== <function expand_gbk at 0x7fc2f0a81170> ====================
INFO apache_beam.runners.portability.fn_api_runner.translations:translations.py:714 ==================== <function sink_flattens at 0x7fc2f0a81290> ====================
INFO apache_beam.runners.portability.fn_api_runner.translations:translations.py:714 ==================== <function greedily_fuse at 0x7fc2f0a81320> ====================
INFO apache_beam.runners.portability.fn_api_runner.translations:translations.py:714 ==================== <function read_to_impulse at 0x7fc2f0a813b0> ====================
INFO apache_beam.runners.portability.fn_api_runner.translations:translations.py:714 ==================== <function impulse_to_input at 0x7fc2f0a81440> ====================
INFO apache_beam.runners.portability.fn_api_runner.translations:translations.py:714 ==================== <function sort_stages at 0x7fc2f0a81680> ====================
INFO apache_beam.runners.portability.fn_api_runner.translations:translations.py:714 ==================== <function add_impulse_to_dangling_transforms at 0x7fc2f0a817a0> ====================
INFO apache_beam.runners.portability.fn_api_runner.translations:translations.py:714 ==================== <function setup_timer_mapping at 0x7fc2f0a815f0> ====================
INFO apache_beam.runners.portability.fn_api_runner.translations:translations.py:714 ==================== <function populate_data_channel_coders at 0x7fc2f0a81710> ====================
INFO apache_beam.runners.worker.statecache:statecache.py:172 Creating state cache with size 100
INFO apache_beam.runners.portability.fn_api_runner.worker_handlers:worker_handlers.py:908 Created Worker handler <apache_beam.runners.portability.fn_api_runner.worker_handlers.EmbeddedWorkerHandler object at 0x7fc2dad98650> for environment ref_Environment_default_environment_1 (beam:env:embedded_python:v1, b'')
INFO apache_beam.io.fileio:fileio.py:673 Moving temporary file /tmp/.temp2a86deb8-098b-4c1e-a219-da9f7355aa0e/4064248483911912470_8c4e423e-116f-4286-b3d4-62cf7abbb8aa to dir: /tmp as tmpsarag7o1.result-00000-of-00001. Res: FileResult(file_name='/tmp/.temp2a86deb8-098b-4c1e-a219-da9f7355aa0e/4064248483911912470_8c4e423e-116f-4286-b3d4-62cf7abbb8aa', shard_index=-1, total_shards=0, window=GlobalWindow, pane=None, destination=None)
PASSED [100%]
=============================== warnings summary ===============================
../../build/gradleenv/1398941891/lib/python3.7/site-packages/hdfs/config.py:15
<https://ci-beam.apache.org/job/beam_PostCommit_Python_Examples_Direct/ws/src/build/gradleenv/1398941891/lib/python3.7/site-packages/hdfs/config.py>:15: DeprecationWarning: the imp module is deprecated in favour of importlib; see the module's documentation for alternative uses
from imp import load_source
apache_beam/examples/complete/game/hourly_team_score_it_test.py::HourlyTeamScoreIT::test_hourly_team_score_output_checksum_on_small_input
<https://ci-beam.apache.org/job/beam_PostCommit_Python_Examples_Direct/ws/src/sdks/python/apache_beam/io/gcp/tests/utils.py>:63: PendingDeprecationWarning: Client.dataset is deprecated and will be removed in a future version. Use a string like 'my_project.my_dataset' or a cloud.google.bigquery.DatasetReference object, instead.
dataset_ref = client.dataset(unique_dataset_name, project=project)
apache_beam/examples/complete/game/hourly_team_score_it_test.py::HourlyTeamScoreIT::test_hourly_team_score_output_checksum_on_small_input
apache_beam/examples/cookbook/bigquery_tornadoes_it_test.py::BigqueryTornadoesIT::test_bigquery_tornadoes_it
apache_beam/examples/cookbook/filters_test.py::FiltersTest::test_filters_output_bigquery_matcher
<https://ci-beam.apache.org/job/beam_PostCommit_Python_Examples_Direct/ws/src/sdks/python/apache_beam/io/gcp/bigquery.py>:2285: BeamDeprecationWarning: options is deprecated since First stable release. References to <pipeline>.options will not be supported
is_streaming_pipeline = p.options.view_as(StandardOptions).streaming
apache_beam/examples/complete/game/hourly_team_score_it_test.py::HourlyTeamScoreIT::test_hourly_team_score_output_checksum_on_small_input
apache_beam/examples/cookbook/bigquery_tornadoes_it_test.py::BigqueryTornadoesIT::test_bigquery_tornadoes_it
apache_beam/examples/cookbook/filters_test.py::FiltersTest::test_filters_output_bigquery_matcher
<https://ci-beam.apache.org/job/beam_PostCommit_Python_Examples_Direct/ws/src/sdks/python/apache_beam/io/gcp/bigquery.py>:2291: BeamDeprecationWarning: options is deprecated since First stable release. References to <pipeline>.options will not be supported
experiments = p.options.view_as(DebugOptions).experiments or []
apache_beam/examples/complete/game/hourly_team_score_it_test.py::HourlyTeamScoreIT::test_hourly_team_score_output_checksum_on_small_input
apache_beam/examples/cookbook/bigquery_tornadoes_it_test.py::BigqueryTornadoesIT::test_bigquery_tornadoes_it
apache_beam/examples/cookbook/filters_test.py::FiltersTest::test_filters_output_bigquery_matcher
<https://ci-beam.apache.org/job/beam_PostCommit_Python_Examples_Direct/ws/src/sdks/python/apache_beam/io/gcp/bigquery_file_loads.py>:1129: BeamDeprecationWarning: options is deprecated since First stable release. References to <pipeline>.options will not be supported
temp_location = p.options.view_as(GoogleCloudOptions).temp_location
apache_beam/examples/complete/game/hourly_team_score_it_test.py::HourlyTeamScoreIT::test_hourly_team_score_output_checksum_on_small_input
apache_beam/examples/cookbook/bigquery_tornadoes_it_test.py::BigqueryTornadoesIT::test_bigquery_tornadoes_it
apache_beam/examples/cookbook/filters_test.py::FiltersTest::test_filters_output_bigquery_matcher
<https://ci-beam.apache.org/job/beam_PostCommit_Python_Examples_Direct/ws/src/sdks/python/apache_beam/io/gcp/bigquery_file_loads.py>:1131: BeamDeprecationWarning: options is deprecated since First stable release. References to <pipeline>.options will not be supported
p.options.view_as(GoogleCloudOptions).job_name or 'AUTOMATIC_JOB_NAME')
apache_beam/examples/cookbook/bigquery_side_input_it_test.py::BigQuerySideInputIT::test_bigquery_side_input_it
apache_beam/examples/cookbook/bigquery_side_input_it_test.py::BigQuerySideInputIT::test_bigquery_side_input_it
apache_beam/examples/cookbook/bigquery_tornadoes_it_test.py::BigqueryTornadoesIT::test_bigquery_tornadoes_it
apache_beam/examples/cookbook/filters_test.py::FiltersTest::test_filters_output_bigquery_matcher
apache_beam/examples/dataframe/flight_delays_it_test.py::FlightDelaysTest::test_flight_delays
<https://ci-beam.apache.org/job/beam_PostCommit_Python_Examples_Direct/ws/src/sdks/python/apache_beam/io/gcp/bigquery.py>:2774: BeamDeprecationWarning: options is deprecated since First stable release. References to <pipeline>.options will not be supported
temp_location = pcoll.pipeline.options.view_as(
apache_beam/examples/cookbook/bigquery_side_input_it_test.py::BigQuerySideInputIT::test_bigquery_side_input_it
apache_beam/examples/cookbook/bigquery_side_input_it_test.py::BigQuerySideInputIT::test_bigquery_side_input_it
apache_beam/examples/cookbook/bigquery_tornadoes_it_test.py::BigqueryTornadoesIT::test_bigquery_tornadoes_it
apache_beam/examples/cookbook/filters_test.py::FiltersTest::test_filters_output_bigquery_matcher
apache_beam/examples/dataframe/flight_delays_it_test.py::FlightDelaysTest::test_flight_delays
<https://ci-beam.apache.org/job/beam_PostCommit_Python_Examples_Direct/ws/src/sdks/python/apache_beam/io/gcp/bigquery.py>:2776: BeamDeprecationWarning: options is deprecated since First stable release. References to <pipeline>.options will not be supported
job_name = pcoll.pipeline.options.view_as(GoogleCloudOptions).job_name
apache_beam/examples/cookbook/bigquery_side_input_it_test.py::BigQuerySideInputIT::test_bigquery_side_input_it
apache_beam/examples/cookbook/bigquery_side_input_it_test.py::BigQuerySideInputIT::test_bigquery_side_input_it
apache_beam/examples/cookbook/bigquery_tornadoes_it_test.py::BigqueryTornadoesIT::test_bigquery_tornadoes_it
apache_beam/examples/cookbook/filters_test.py::FiltersTest::test_filters_output_bigquery_matcher
apache_beam/examples/dataframe/flight_delays_it_test.py::FlightDelaysTest::test_flight_delays
<https://ci-beam.apache.org/job/beam_PostCommit_Python_Examples_Direct/ws/src/sdks/python/apache_beam/io/gcp/bigquery.py>:2807: BeamDeprecationWarning: options is deprecated since First stable release. References to <pipeline>.options will not be supported
| _PassThroughThenCleanup(files_to_remove_pcoll))
apache_beam/examples/cookbook/bigquery_tornadoes_it_test.py::BigqueryTornadoesIT::test_bigquery_tornadoes_it
apache_beam/examples/cookbook/filters_test.py::FiltersTest::test_filters_output_bigquery_matcher
<https://ci-beam.apache.org/job/beam_PostCommit_Python_Examples_Direct/ws/src/sdks/python/apache_beam/io/gcp/bigquery.py>:2281: BeamDeprecationWarning: options is deprecated since First stable release. References to <pipeline>.options will not be supported
self.table_reference.projectId = pcoll.pipeline.options.view_as(
apache_beam/examples/cookbook/bigquery_tornadoes_it_test.py::BigqueryTornadoesIT::test_bigquery_tornadoes_it
apache_beam/examples/cookbook/filters_test.py::FiltersTest::test_filters_output_bigquery_matcher
<https://ci-beam.apache.org/job/beam_PostCommit_Python_Examples_Direct/ws/src/sdks/python/apache_beam/io/gcp/tests/utils.py>:100: PendingDeprecationWarning: Client.dataset is deprecated and will be removed in a future version. Use a string like 'my_project.my_dataset' or a cloud.google.bigquery.DatasetReference object, instead.
table_ref = client.dataset(dataset_id).table(table_id)
apache_beam/examples/dataframe/flight_delays_it_test.py::FlightDelaysTest::test_flight_delays
<https://ci-beam.apache.org/job/beam_PostCommit_Python_Examples_Direct/ws/src/sdks/python/apache_beam/examples/dataframe/flight_delays.py>:47: FutureWarning: Dropping of nuisance columns in DataFrame reductions (with 'numeric_only=None') is deprecated; in a future version this will raise TypeError. Select only valid columns before calling the reduction.
return airline_df[at_top_airports].mean()
apache_beam/examples/dataframe/flight_delays_it_test.py::FlightDelaysTest::test_flight_delays
apache_beam/examples/dataframe/wordcount_test.py::WordCountTest::test_basics
<https://ci-beam.apache.org/job/beam_PostCommit_Python_Examples_Direct/ws/src/sdks/python/apache_beam/dataframe/io.py>:632: FutureWarning: WriteToFiles is experimental.
sink=lambda _: _WriteToPandasFileSink(
apache_beam/examples/dataframe/flight_delays_it_test.py::FlightDelaysTest::test_flight_delays
apache_beam/examples/dataframe/wordcount_test.py::WordCountTest::test_basics
<https://ci-beam.apache.org/job/beam_PostCommit_Python_Examples_Direct/ws/src/sdks/python/apache_beam/io/fileio.py>:581: BeamDeprecationWarning: options is deprecated since First stable release. References to <pipeline>.options will not be supported
p.options.view_as(GoogleCloudOptions).temp_location or
-- Docs: https://docs.pytest.org/en/stable/how-to/capture-warnings.html
- generated xml file: <https://ci-beam.apache.org/job/beam_PostCommit_Python_Examples_Direct/ws/src/sdks/python/pytest_postCommitExamples-direct-py37.xml> -
=== 22 passed, 3 skipped, 6529 deselected, 38 warnings in 293.88s (0:04:53) ====
FAILURE: Build failed with an exception.
* Where:
Script '<https://ci-beam.apache.org/job/beam_PostCommit_Python_Examples_Direct/ws/src/sdks/python/test-suites/direct/common.gradle'> line: 92
* What went wrong:
Execution failed for task ':sdks:python:test-suites:direct:py39:examples'.
> Process 'command 'sh'' finished with non-zero exit value 1
* Try:
> Run with --stacktrace option to get the stack trace.
> Run with --info or --debug option to get more log output.
> Run with --scan to get full insights.
* Get more help at https://help.gradle.org
BUILD FAILED in 6m 10s
21 actionable tasks: 15 executed, 4 from cache, 2 up-to-date
Publishing build scan...
https://gradle.com/s/sgxs5joxxzz4u
Build step 'Invoke Gradle script' changed build result to FAILURE
Build step 'Invoke Gradle script' marked build as failure
---------------------------------------------------------------------
To unsubscribe, e-mail: builds-unsubscribe@beam.apache.org
For additional commands, e-mail: builds-help@beam.apache.org
Jenkins build is back to normal : beam_PostCommit_Python_Examples_Direct #802
Posted by Apache Jenkins Server <je...@builds.apache.org>.
See <https://ci-beam.apache.org/job/beam_PostCommit_Python_Examples_Direct/802/display/redirect>
---------------------------------------------------------------------
To unsubscribe, e-mail: builds-unsubscribe@beam.apache.org
For additional commands, e-mail: builds-help@beam.apache.org