You are viewing a plain text version of this content. The canonical link for it is here.
Posted to commits@karaf.apache.org by Apache Jenkins Server <je...@builds.apache.org> on 2013/08/17 05:00:49 UTC
Build failed in Jenkins: Karaf-2.2.x » Apache Karaf :: Util #1124
See <https://builds.apache.org/job/Karaf-2.2.x/org.apache.karaf$org.apache.karaf.util/1124/>
------------------------------------------
[INFO] ------------------------------------------------------------------------
[INFO] Building Apache Karaf :: Util
[INFO] task-segment: [clean, install, deploy]
[INFO] ------------------------------------------------------------------------
[INFO] [clean:clean {execution: default-clean}]
[INFO] [bundle:cleanVersions {execution: cleanVersions}]
[WARNING] The parameter expression: 'project.build.resources' used in mojo: 'process' has been deprecated. Use 'project.resources' instead.
[INFO] [remote-resources:process {execution: default}]
[INFO] [antrun:run {execution: copy-notice}]
[INFO] Executing tasks
main:
[copy] Copying 1 file to <https://builds.apache.org/job/Karaf-2.2.x/org.apache.karaf$org.apache.karaf.util/ws/target/maven-shared-archive-resources/META-INF>
[INFO] Executed tasks
[debug] execute contextualize
[INFO] [resources:resources {execution: default-resources}]
[INFO] Using 'UTF-8' encoding to copy filtered resources.
[INFO] skip non existing resourceDirectory <https://builds.apache.org/job/Karaf-2.2.x/org.apache.karaf$org.apache.karaf.util/ws/src/main/resources>
[INFO] Copying 3 resources
[INFO] [compiler:compile {execution: default-compile}]
[INFO] Compiling 6 source files to <https://builds.apache.org/job/Karaf-2.2.x/org.apache.karaf$org.apache.karaf.util/ws/target/classes>
[JENKINS] Archiving <https://builds.apache.org/job/Karaf-2.2.x/org.apache.karaf$org.apache.karaf.util/ws/pom.xml> to /home/hudson/hudson/jobs/Karaf-2.2.x/modules/org.apache.karaf$org.apache.karaf.util/builds/2013-08-17_02-52-17/archive/org.apache.karaf/org.apache.karaf.util/2.2.12-SNAPSHOT/org.apache.karaf.util-2.2.12-SNAPSHOT.pom
[INFO] ------------------------------------------------------------------------
[ERROR] BUILD ERROR
[INFO] ------------------------------------------------------------------------
[INFO] Fatal error compiling
Embedded error: tools.jar not found: /usr/lib/jvm/java-6-openjdk-amd64/jre/../lib/tools.jar
[INFO] ------------------------------------------------------------------------
[INFO] Trace
org.apache.maven.lifecycle.LifecycleExecutionException: Fatal error compiling
at org.apache.maven.lifecycle.DefaultLifecycleExecutor.executeGoals(DefaultLifecycleExecutor.java:719)
at org.apache.maven.lifecycle.DefaultLifecycleExecutor.executeGoalWithLifecycle(DefaultLifecycleExecutor.java:556)
at org.apache.maven.lifecycle.DefaultLifecycleExecutor.executeGoal(DefaultLifecycleExecutor.java:535)
at org.apache.maven.lifecycle.DefaultLifecycleExecutor.executeGoalAndHandleFailures(DefaultLifecycleExecutor.java:387)
at org.apache.maven.lifecycle.DefaultLifecycleExecutor.executeTaskSegments(DefaultLifecycleExecutor.java:348)
at org.apache.maven.lifecycle.DefaultLifecycleExecutor.execute(DefaultLifecycleExecutor.java:180)
at org.apache.maven.lifecycle.LifecycleExecutorInterceptor.execute(LifecycleExecutorInterceptor.java:65)
at org.apache.maven.DefaultMaven.doExecute(DefaultMaven.java:328)
at org.apache.maven.DefaultMaven.execute(DefaultMaven.java:138)
at org.apache.maven.cli.MavenCli.main(MavenCli.java:362)
at sun.reflect.NativeMethodAccessorImpl.invoke0(Native Method)
at sun.reflect.NativeMethodAccessorImpl.invoke(NativeMethodAccessorImpl.java:57)
at sun.reflect.DelegatingMethodAccessorImpl.invoke(DelegatingMethodAccessorImpl.java:43)
at java.lang.reflect.Method.invoke(Method.java:616)
at org.codehaus.classworlds.Launcher.launchEnhanced(Launcher.java:315)
at org.codehaus.classworlds.Launcher.launch(Launcher.java:255)
at hudson.maven.agent.Main.launch(Main.java:204)
at hudson.maven.MavenBuilder.call(MavenBuilder.java:154)
at hudson.maven.Maven2Builder.call(Maven2Builder.java:79)
at hudson.maven.Maven2Builder.call(Maven2Builder.java:55)
at hudson.remoting.UserRequest.perform(UserRequest.java:118)
at hudson.remoting.UserRequest.perform(UserRequest.java:48)
at hudson.remoting.Request$2.run(Request.java:326)
at hudson.remoting.InterceptingExecutorService$1.call(InterceptingExecutorService.java:72)
at java.util.concurrent.FutureTask$Sync.innerRun(FutureTask.java:334)
at java.util.concurrent.FutureTask.run(FutureTask.java:166)
at java.util.concurrent.ThreadPoolExecutor.runWorker(ThreadPoolExecutor.java:1146)
at java.util.concurrent.ThreadPoolExecutor$Worker.run(ThreadPoolExecutor.java:615)
at java.lang.Thread.run(Thread.java:679)
Caused by: org.apache.maven.plugin.MojoExecutionException: Fatal error compiling
at org.apache.maven.plugin.AbstractCompilerMojo.execute(AbstractCompilerMojo.java:683)
at org.apache.maven.plugin.CompilerMojo.execute(CompilerMojo.java:128)
at org.apache.maven.plugin.DefaultPluginManager.executeMojo(DefaultPluginManager.java:490)
at hudson.maven.agent.PluginManagerInterceptor.executeMojo(PluginManagerInterceptor.java:182)
at org.apache.maven.lifecycle.DefaultLifecycleExecutor.executeGoals(DefaultLifecycleExecutor.java:694)
... 28 more
Caused by: org.codehaus.plexus.compiler.CompilerException: tools.jar not found: /usr/lib/jvm/java-6-openjdk-amd64/jre/../lib/tools.jar
at org.codehaus.plexus.compiler.javac.JavacCompiler.createJavacClass(JavacCompiler.java:987)
at org.codehaus.plexus.compiler.javac.JavacCompiler.getJavacClass(JavacCompiler.java:944)
at org.codehaus.plexus.compiler.javac.JavacCompiler.compileInProcess(JavacCompiler.java:520)
at org.codehaus.plexus.compiler.javac.JavacCompiler.compile(JavacCompiler.java:167)
at org.apache.maven.plugin.AbstractCompilerMojo.execute(AbstractCompilerMojo.java:678)
... 32 more
[INFO] ------------------------------------------------------------------------
[INFO] Total time: 22 seconds
[INFO] Finished at: Sat Aug 17 02:53:14 UTC 2013
[INFO] Final Memory: 83M/595M
[INFO] ------------------------------------------------------------------------
Jenkins build is back to normal : Karaf-2.2.x » Apache Karaf :: Util #1128
Posted by Apache Jenkins Server <je...@builds.apache.org>.
See <https://builds.apache.org/job/Karaf-2.2.x/org.apache.karaf$org.apache.karaf.util/1128/>
Build failed in Jenkins: Karaf-2.2.x » Apache Karaf :: Util #1127
Posted by Apache Jenkins Server <je...@builds.apache.org>.
See <https://builds.apache.org/job/Karaf-2.2.x/org.apache.karaf$org.apache.karaf.util/1127/>
------------------------------------------
[INFO] ------------------------------------------------------------------------
[INFO] Building Apache Karaf :: Util
[INFO] task-segment: [clean, install, deploy]
[INFO] ------------------------------------------------------------------------
[INFO] [clean:clean {execution: default-clean}]
[INFO] [bundle:cleanVersions {execution: cleanVersions}]
[WARNING] The parameter expression: 'project.build.resources' used in mojo: 'process' has been deprecated. Use 'project.resources' instead.
[INFO] [remote-resources:process {execution: default}]
[INFO] [antrun:run {execution: copy-notice}]
[INFO] Executing tasks
main:
[copy] Copying 1 file to <https://builds.apache.org/job/Karaf-2.2.x/org.apache.karaf$org.apache.karaf.util/ws/target/maven-shared-archive-resources/META-INF>
[INFO] Executed tasks
[debug] execute contextualize
[INFO] [resources:resources {execution: default-resources}]
[INFO] Using 'UTF-8' encoding to copy filtered resources.
[INFO] skip non existing resourceDirectory <https://builds.apache.org/job/Karaf-2.2.x/org.apache.karaf$org.apache.karaf.util/ws/src/main/resources>
[INFO] Copying 3 resources
[INFO] [compiler:compile {execution: default-compile}]
[INFO] Compiling 6 source files to <https://builds.apache.org/job/Karaf-2.2.x/org.apache.karaf$org.apache.karaf.util/ws/target/classes>
[JENKINS] Archiving <https://builds.apache.org/job/Karaf-2.2.x/org.apache.karaf$org.apache.karaf.util/ws/pom.xml> to /home/hudson/hudson/jobs/Karaf-2.2.x/modules/org.apache.karaf$org.apache.karaf.util/builds/2013-08-20_02-51-44/archive/org.apache.karaf/org.apache.karaf.util/2.2.12-SNAPSHOT/org.apache.karaf.util-2.2.12-SNAPSHOT.pom
[INFO] ------------------------------------------------------------------------
[ERROR] BUILD ERROR
[INFO] ------------------------------------------------------------------------
[INFO] Fatal error compiling
Embedded error: tools.jar not found: /usr/lib/jvm/java-6-openjdk-amd64/jre/../lib/tools.jar
[INFO] ------------------------------------------------------------------------
[INFO] Trace
org.apache.maven.lifecycle.LifecycleExecutionException: Fatal error compiling
at org.apache.maven.lifecycle.DefaultLifecycleExecutor.executeGoals(DefaultLifecycleExecutor.java:719)
at org.apache.maven.lifecycle.DefaultLifecycleExecutor.executeGoalWithLifecycle(DefaultLifecycleExecutor.java:556)
at org.apache.maven.lifecycle.DefaultLifecycleExecutor.executeGoal(DefaultLifecycleExecutor.java:535)
at org.apache.maven.lifecycle.DefaultLifecycleExecutor.executeGoalAndHandleFailures(DefaultLifecycleExecutor.java:387)
at org.apache.maven.lifecycle.DefaultLifecycleExecutor.executeTaskSegments(DefaultLifecycleExecutor.java:348)
at org.apache.maven.lifecycle.DefaultLifecycleExecutor.execute(DefaultLifecycleExecutor.java:180)
at org.apache.maven.lifecycle.LifecycleExecutorInterceptor.execute(LifecycleExecutorInterceptor.java:65)
at org.apache.maven.DefaultMaven.doExecute(DefaultMaven.java:328)
at org.apache.maven.DefaultMaven.execute(DefaultMaven.java:138)
at org.apache.maven.cli.MavenCli.main(MavenCli.java:362)
at sun.reflect.NativeMethodAccessorImpl.invoke0(Native Method)
at sun.reflect.NativeMethodAccessorImpl.invoke(NativeMethodAccessorImpl.java:57)
at sun.reflect.DelegatingMethodAccessorImpl.invoke(DelegatingMethodAccessorImpl.java:43)
at java.lang.reflect.Method.invoke(Method.java:616)
at org.codehaus.classworlds.Launcher.launchEnhanced(Launcher.java:315)
at org.codehaus.classworlds.Launcher.launch(Launcher.java:255)
at hudson.maven.agent.Main.launch(Main.java:204)
at hudson.maven.MavenBuilder.call(MavenBuilder.java:154)
at hudson.maven.Maven2Builder.call(Maven2Builder.java:79)
at hudson.maven.Maven2Builder.call(Maven2Builder.java:55)
at hudson.remoting.UserRequest.perform(UserRequest.java:118)
at hudson.remoting.UserRequest.perform(UserRequest.java:48)
at hudson.remoting.Request$2.run(Request.java:326)
at hudson.remoting.InterceptingExecutorService$1.call(InterceptingExecutorService.java:72)
at java.util.concurrent.FutureTask$Sync.innerRun(FutureTask.java:334)
at java.util.concurrent.FutureTask.run(FutureTask.java:166)
at java.util.concurrent.ThreadPoolExecutor.runWorker(ThreadPoolExecutor.java:1146)
at java.util.concurrent.ThreadPoolExecutor$Worker.run(ThreadPoolExecutor.java:615)
at java.lang.Thread.run(Thread.java:679)
Caused by: org.apache.maven.plugin.MojoExecutionException: Fatal error compiling
at org.apache.maven.plugin.AbstractCompilerMojo.execute(AbstractCompilerMojo.java:683)
at org.apache.maven.plugin.CompilerMojo.execute(CompilerMojo.java:128)
at org.apache.maven.plugin.DefaultPluginManager.executeMojo(DefaultPluginManager.java:490)
at hudson.maven.agent.PluginManagerInterceptor.executeMojo(PluginManagerInterceptor.java:182)
at org.apache.maven.lifecycle.DefaultLifecycleExecutor.executeGoals(DefaultLifecycleExecutor.java:694)
... 28 more
Caused by: org.codehaus.plexus.compiler.CompilerException: tools.jar not found: /usr/lib/jvm/java-6-openjdk-amd64/jre/../lib/tools.jar
at org.codehaus.plexus.compiler.javac.JavacCompiler.createJavacClass(JavacCompiler.java:987)
at org.codehaus.plexus.compiler.javac.JavacCompiler.getJavacClass(JavacCompiler.java:944)
at org.codehaus.plexus.compiler.javac.JavacCompiler.compileInProcess(JavacCompiler.java:520)
at org.codehaus.plexus.compiler.javac.JavacCompiler.compile(JavacCompiler.java:167)
at org.apache.maven.plugin.AbstractCompilerMojo.execute(AbstractCompilerMojo.java:678)
... 32 more
[INFO] ------------------------------------------------------------------------
[INFO] Total time: 25 seconds
[INFO] Finished at: Tue Aug 20 02:52:42 UTC 2013
[INFO] Final Memory: 85M/601M
[INFO] ------------------------------------------------------------------------
Build failed in Jenkins: Karaf-2.2.x » Apache Karaf :: Util #1126
Posted by Apache Jenkins Server <je...@builds.apache.org>.
See <https://builds.apache.org/job/Karaf-2.2.x/org.apache.karaf$org.apache.karaf.util/1126/>
------------------------------------------
[INFO] ------------------------------------------------------------------------
[INFO] Building Apache Karaf :: Util
[INFO] task-segment: [clean, install, deploy]
[INFO] ------------------------------------------------------------------------
[INFO] [clean:clean {execution: default-clean}]
[INFO] [bundle:cleanVersions {execution: cleanVersions}]
[WARNING] The parameter expression: 'project.build.resources' used in mojo: 'process' has been deprecated. Use 'project.resources' instead.
[INFO] [remote-resources:process {execution: default}]
[INFO] [antrun:run {execution: copy-notice}]
[INFO] Executing tasks
main:
[copy] Copying 1 file to <https://builds.apache.org/job/Karaf-2.2.x/org.apache.karaf$org.apache.karaf.util/ws/target/maven-shared-archive-resources/META-INF>
[INFO] Executed tasks
[debug] execute contextualize
[INFO] [resources:resources {execution: default-resources}]
[INFO] Using 'UTF-8' encoding to copy filtered resources.
[INFO] skip non existing resourceDirectory <https://builds.apache.org/job/Karaf-2.2.x/org.apache.karaf$org.apache.karaf.util/ws/src/main/resources>
[INFO] Copying 3 resources
[INFO] [compiler:compile {execution: default-compile}]
[INFO] Compiling 6 source files to <https://builds.apache.org/job/Karaf-2.2.x/org.apache.karaf$org.apache.karaf.util/ws/target/classes>
[JENKINS] Archiving <https://builds.apache.org/job/Karaf-2.2.x/org.apache.karaf$org.apache.karaf.util/ws/pom.xml> to /home/hudson/hudson/jobs/Karaf-2.2.x/modules/org.apache.karaf$org.apache.karaf.util/builds/2013-08-19_02-52-00/archive/org.apache.karaf/org.apache.karaf.util/2.2.12-SNAPSHOT/org.apache.karaf.util-2.2.12-SNAPSHOT.pom
[INFO] ------------------------------------------------------------------------
[ERROR] BUILD ERROR
[INFO] ------------------------------------------------------------------------
[INFO] Fatal error compiling
Embedded error: tools.jar not found: /usr/lib/jvm/java-6-openjdk-amd64/jre/../lib/tools.jar
[INFO] ------------------------------------------------------------------------
[INFO] Trace
org.apache.maven.lifecycle.LifecycleExecutionException: Fatal error compiling
at org.apache.maven.lifecycle.DefaultLifecycleExecutor.executeGoals(DefaultLifecycleExecutor.java:719)
at org.apache.maven.lifecycle.DefaultLifecycleExecutor.executeGoalWithLifecycle(DefaultLifecycleExecutor.java:556)
at org.apache.maven.lifecycle.DefaultLifecycleExecutor.executeGoal(DefaultLifecycleExecutor.java:535)
at org.apache.maven.lifecycle.DefaultLifecycleExecutor.executeGoalAndHandleFailures(DefaultLifecycleExecutor.java:387)
at org.apache.maven.lifecycle.DefaultLifecycleExecutor.executeTaskSegments(DefaultLifecycleExecutor.java:348)
at org.apache.maven.lifecycle.DefaultLifecycleExecutor.execute(DefaultLifecycleExecutor.java:180)
at org.apache.maven.lifecycle.LifecycleExecutorInterceptor.execute(LifecycleExecutorInterceptor.java:65)
at org.apache.maven.DefaultMaven.doExecute(DefaultMaven.java:328)
at org.apache.maven.DefaultMaven.execute(DefaultMaven.java:138)
at org.apache.maven.cli.MavenCli.main(MavenCli.java:362)
at sun.reflect.NativeMethodAccessorImpl.invoke0(Native Method)
at sun.reflect.NativeMethodAccessorImpl.invoke(NativeMethodAccessorImpl.java:57)
at sun.reflect.DelegatingMethodAccessorImpl.invoke(DelegatingMethodAccessorImpl.java:43)
at java.lang.reflect.Method.invoke(Method.java:616)
at org.codehaus.classworlds.Launcher.launchEnhanced(Launcher.java:315)
at org.codehaus.classworlds.Launcher.launch(Launcher.java:255)
at hudson.maven.agent.Main.launch(Main.java:204)
at hudson.maven.MavenBuilder.call(MavenBuilder.java:154)
at hudson.maven.Maven2Builder.call(Maven2Builder.java:79)
at hudson.maven.Maven2Builder.call(Maven2Builder.java:55)
at hudson.remoting.UserRequest.perform(UserRequest.java:118)
at hudson.remoting.UserRequest.perform(UserRequest.java:48)
at hudson.remoting.Request$2.run(Request.java:326)
at hudson.remoting.InterceptingExecutorService$1.call(InterceptingExecutorService.java:72)
at java.util.concurrent.FutureTask$Sync.innerRun(FutureTask.java:334)
at java.util.concurrent.FutureTask.run(FutureTask.java:166)
at java.util.concurrent.ThreadPoolExecutor.runWorker(ThreadPoolExecutor.java:1146)
at java.util.concurrent.ThreadPoolExecutor$Worker.run(ThreadPoolExecutor.java:615)
at java.lang.Thread.run(Thread.java:679)
Caused by: org.apache.maven.plugin.MojoExecutionException: Fatal error compiling
at org.apache.maven.plugin.AbstractCompilerMojo.execute(AbstractCompilerMojo.java:683)
at org.apache.maven.plugin.CompilerMojo.execute(CompilerMojo.java:128)
at org.apache.maven.plugin.DefaultPluginManager.executeMojo(DefaultPluginManager.java:490)
at hudson.maven.agent.PluginManagerInterceptor.executeMojo(PluginManagerInterceptor.java:182)
at org.apache.maven.lifecycle.DefaultLifecycleExecutor.executeGoals(DefaultLifecycleExecutor.java:694)
... 28 more
Caused by: org.codehaus.plexus.compiler.CompilerException: tools.jar not found: /usr/lib/jvm/java-6-openjdk-amd64/jre/../lib/tools.jar
at org.codehaus.plexus.compiler.javac.JavacCompiler.createJavacClass(JavacCompiler.java:987)
at org.codehaus.plexus.compiler.javac.JavacCompiler.getJavacClass(JavacCompiler.java:944)
at org.codehaus.plexus.compiler.javac.JavacCompiler.compileInProcess(JavacCompiler.java:520)
at org.codehaus.plexus.compiler.javac.JavacCompiler.compile(JavacCompiler.java:167)
at org.apache.maven.plugin.AbstractCompilerMojo.execute(AbstractCompilerMojo.java:678)
... 32 more
[INFO] ------------------------------------------------------------------------
[INFO] Total time: 26 seconds
[INFO] Finished at: Mon Aug 19 02:53:00 UTC 2013
[INFO] Final Memory: 83M/595M
[INFO] ------------------------------------------------------------------------
Build failed in Jenkins: Karaf-2.2.x » Apache Karaf :: Util #1125
Posted by Apache Jenkins Server <je...@builds.apache.org>.
See <https://builds.apache.org/job/Karaf-2.2.x/org.apache.karaf$org.apache.karaf.util/1125/>
------------------------------------------
[INFO] ------------------------------------------------------------------------
[INFO] Building Apache Karaf :: Util
[INFO] task-segment: [clean, install, deploy]
[INFO] ------------------------------------------------------------------------
[INFO] [clean:clean {execution: default-clean}]
[INFO] [bundle:cleanVersions {execution: cleanVersions}]
[WARNING] The parameter expression: 'project.build.resources' used in mojo: 'process' has been deprecated. Use 'project.resources' instead.
[INFO] [remote-resources:process {execution: default}]
[INFO] [antrun:run {execution: copy-notice}]
[INFO] Executing tasks
main:
[copy] Copying 1 file to <https://builds.apache.org/job/Karaf-2.2.x/org.apache.karaf$org.apache.karaf.util/ws/target/maven-shared-archive-resources/META-INF>
[INFO] Executed tasks
[debug] execute contextualize
[INFO] [resources:resources {execution: default-resources}]
[INFO] Using 'UTF-8' encoding to copy filtered resources.
[INFO] skip non existing resourceDirectory <https://builds.apache.org/job/Karaf-2.2.x/org.apache.karaf$org.apache.karaf.util/ws/src/main/resources>
[INFO] Copying 3 resources
[INFO] [compiler:compile {execution: default-compile}]
[INFO] Compiling 6 source files to <https://builds.apache.org/job/Karaf-2.2.x/org.apache.karaf$org.apache.karaf.util/ws/target/classes>
[JENKINS] Archiving <https://builds.apache.org/job/Karaf-2.2.x/org.apache.karaf$org.apache.karaf.util/ws/pom.xml> to /home/hudson/hudson/jobs/Karaf-2.2.x/modules/org.apache.karaf$org.apache.karaf.util/builds/2013-08-18_02-52-03/archive/org.apache.karaf/org.apache.karaf.util/2.2.12-SNAPSHOT/org.apache.karaf.util-2.2.12-SNAPSHOT.pom
[INFO] ------------------------------------------------------------------------
[ERROR] BUILD ERROR
[INFO] ------------------------------------------------------------------------
[INFO] Fatal error compiling
Embedded error: tools.jar not found: /usr/lib/jvm/java-6-openjdk-amd64/jre/../lib/tools.jar
[INFO] ------------------------------------------------------------------------
[INFO] Trace
org.apache.maven.lifecycle.LifecycleExecutionException: Fatal error compiling
at org.apache.maven.lifecycle.DefaultLifecycleExecutor.executeGoals(DefaultLifecycleExecutor.java:719)
at org.apache.maven.lifecycle.DefaultLifecycleExecutor.executeGoalWithLifecycle(DefaultLifecycleExecutor.java:556)
at org.apache.maven.lifecycle.DefaultLifecycleExecutor.executeGoal(DefaultLifecycleExecutor.java:535)
at org.apache.maven.lifecycle.DefaultLifecycleExecutor.executeGoalAndHandleFailures(DefaultLifecycleExecutor.java:387)
at org.apache.maven.lifecycle.DefaultLifecycleExecutor.executeTaskSegments(DefaultLifecycleExecutor.java:348)
at org.apache.maven.lifecycle.DefaultLifecycleExecutor.execute(DefaultLifecycleExecutor.java:180)
at org.apache.maven.lifecycle.LifecycleExecutorInterceptor.execute(LifecycleExecutorInterceptor.java:65)
at org.apache.maven.DefaultMaven.doExecute(DefaultMaven.java:328)
at org.apache.maven.DefaultMaven.execute(DefaultMaven.java:138)
at org.apache.maven.cli.MavenCli.main(MavenCli.java:362)
at sun.reflect.NativeMethodAccessorImpl.invoke0(Native Method)
at sun.reflect.NativeMethodAccessorImpl.invoke(NativeMethodAccessorImpl.java:57)
at sun.reflect.DelegatingMethodAccessorImpl.invoke(DelegatingMethodAccessorImpl.java:43)
at java.lang.reflect.Method.invoke(Method.java:616)
at org.codehaus.classworlds.Launcher.launchEnhanced(Launcher.java:315)
at org.codehaus.classworlds.Launcher.launch(Launcher.java:255)
at hudson.maven.agent.Main.launch(Main.java:204)
at hudson.maven.MavenBuilder.call(MavenBuilder.java:154)
at hudson.maven.Maven2Builder.call(Maven2Builder.java:79)
at hudson.maven.Maven2Builder.call(Maven2Builder.java:55)
at hudson.remoting.UserRequest.perform(UserRequest.java:118)
at hudson.remoting.UserRequest.perform(UserRequest.java:48)
at hudson.remoting.Request$2.run(Request.java:326)
at hudson.remoting.InterceptingExecutorService$1.call(InterceptingExecutorService.java:72)
at java.util.concurrent.FutureTask$Sync.innerRun(FutureTask.java:334)
at java.util.concurrent.FutureTask.run(FutureTask.java:166)
at java.util.concurrent.ThreadPoolExecutor.runWorker(ThreadPoolExecutor.java:1146)
at java.util.concurrent.ThreadPoolExecutor$Worker.run(ThreadPoolExecutor.java:615)
at java.lang.Thread.run(Thread.java:679)
Caused by: org.apache.maven.plugin.MojoExecutionException: Fatal error compiling
at org.apache.maven.plugin.AbstractCompilerMojo.execute(AbstractCompilerMojo.java:683)
at org.apache.maven.plugin.CompilerMojo.execute(CompilerMojo.java:128)
at org.apache.maven.plugin.DefaultPluginManager.executeMojo(DefaultPluginManager.java:490)
at hudson.maven.agent.PluginManagerInterceptor.executeMojo(PluginManagerInterceptor.java:182)
at org.apache.maven.lifecycle.DefaultLifecycleExecutor.executeGoals(DefaultLifecycleExecutor.java:694)
... 28 more
Caused by: org.codehaus.plexus.compiler.CompilerException: tools.jar not found: /usr/lib/jvm/java-6-openjdk-amd64/jre/../lib/tools.jar
at org.codehaus.plexus.compiler.javac.JavacCompiler.createJavacClass(JavacCompiler.java:987)
at org.codehaus.plexus.compiler.javac.JavacCompiler.getJavacClass(JavacCompiler.java:944)
at org.codehaus.plexus.compiler.javac.JavacCompiler.compileInProcess(JavacCompiler.java:520)
at org.codehaus.plexus.compiler.javac.JavacCompiler.compile(JavacCompiler.java:167)
at org.apache.maven.plugin.AbstractCompilerMojo.execute(AbstractCompilerMojo.java:678)
... 32 more
[INFO] ------------------------------------------------------------------------
[INFO] Total time: 23 seconds
[INFO] Finished at: Sun Aug 18 02:52:56 UTC 2013
[INFO] Final Memory: 83M/595M
[INFO] ------------------------------------------------------------------------