You are viewing a plain text version of this content. The canonical link for it is here.
Posted to oak-dev@jackrabbit.apache.org by Apache Jenkins Server <je...@builds.apache.org> on 2018/07/17 21:43:14 UTC

BUILD FAILURE: Jackrabbit Oak - Build # 1549 - Still Failing

The Apache Jenkins build system has built Jackrabbit Oak (build #1549)

Status: Still Failing

Check console output at https://builds.apache.org/job/Jackrabbit%20Oak/1549/ to view the results.

Changes:
[reschke] OAK-7641: various internal APIs missing in package export filter

[reschke] fix svn:eol-style

 

Test results:
All tests passed

BUILD FAILURE: Jackrabbit Oak - Build # 1556 - Still Failing

Posted by Apache Jenkins Server <je...@builds.apache.org>.
The Apache Jenkins build system has built Jackrabbit Oak (build #1556)

Status: Still Failing

Check console output at https://builds.apache.org/job/Jackrabbit%20Oak/1556/ to view the results.

Changes:
No changes
 

Test results:
No tests ran.

BUILD FAILURE: Jackrabbit Oak - Build # 1555 - Still Failing

Posted by Apache Jenkins Server <je...@builds.apache.org>.
The Apache Jenkins build system has built Jackrabbit Oak (build #1555)

Status: Still Failing

Check console output at https://builds.apache.org/job/Jackrabbit%20Oak/1555/ to view the results.

Changes:
[amitj] OAK-7646: UploadStagingCacheTest#testConcurrentSameAddRequest fails intermittently

- Changed MeterStats#mark() to MeterStats#mark(1) which curiously fixes the issue.
- Added a slight delay in starting the 2nd thread

 

Test results:
All tests passed

BUILD FAILURE: Jackrabbit Oak - Build # 1554 - Still Failing

Posted by Apache Jenkins Server <je...@builds.apache.org>.
The Apache Jenkins build system has built Jackrabbit Oak (build #1554)

Status: Still Failing

Check console output at https://builds.apache.org/job/Jackrabbit%20Oak/1554/ to view the results.

Changes:
[mreutegg] OAK-7647: Replace usage of deprecated junit.framework.Assert

 

Test results:
All tests passed

BUILD FAILURE: Jackrabbit Oak - Build # 1553 - Still Failing

Posted by Apache Jenkins Server <je...@builds.apache.org>.
The Apache Jenkins build system has built Jackrabbit Oak (build #1553)

Status: Still Failing

Check console output at https://builds.apache.org/job/Jackrabbit%20Oak/1553/ to view the results.

Changes:
No changes
 

Test results:
All tests passed

BUILD FAILURE: Jackrabbit Oak - Build # 1552 - Still Failing

Posted by Apache Jenkins Server <je...@builds.apache.org>.
The Apache Jenkins build system has built Jackrabbit Oak (build #1552)

Status: Still Failing

Check console output at https://builds.apache.org/job/Jackrabbit%20Oak/1552/ to view the results.

Changes:
No changes
 

Test results:
No tests ran.

BUILD FAILURE: Jackrabbit Oak - Build # 1551 - Still Failing

Posted by Apache Jenkins Server <je...@builds.apache.org>.
The Apache Jenkins build system has built Jackrabbit Oak (build #1551)

Status: Still Failing

Check console output at https://builds.apache.org/job/Jackrabbit%20Oak/1551/ to view the results.

Changes:
[reschke] OAK-7511: get rid of JSR 305 dependency - use jetbrains nullability annotations instead - remove JSR305 dependency

[reschke] OAK-7511: get rid of JSR 305 dependency - use jetbrains nullability annotations instead - oak-upgrade

[reschke] OAK-7511: get rid of JSR 305 dependency - use jetbrains nullability annotations instead - oak-store-spi

[reschke] OAK-7511: get rid of JSR 305 dependency - use jetbrains nullability annotations instead - oak-store-document

[reschke] OAK-7511: get rid of JSR 305 dependency - use jetbrains nullability annotations instead - oak-store-composite

[reschke] OAK-7511: get rid of JSR 305 dependency - use jetbrains nullability annotations instead - oak-solr-core

[reschke] OAK-7511: get rid of JSR 305 dependency - use jetbrains nullability annotations instead - oak-segment-tar

[reschke] OAK-7511: get rid of JSR 305 dependency - use jetbrains nullability annotations instead - oak-security-spi

[reschke] OAK-7511: get rid of JSR 305 dependency - use jetbrains nullability annotations instead - oak-search-mt

[reschke] OAK-7511: get rid of JSR 305 dependency - use jetbrains nullability annotations instead - oak-search

[reschke] OAK-7511: get rid of JSR 305 dependency - use jetbrains nullability annotations instead - oak-run-commons

[reschke] OAK-7511: get rid of JSR 305 dependency - use jetbrains nullability annotations instead - oak-run

[reschke] OAK-7511: get rid of JSR 305 dependency - use jetbrains nullability annotations instead - oak-query-spi

[reschke] OAK-7511: get rid of JSR 305 dependency - use jetbrains nullability annotations instead - oak-pojosr

[reschke] OAK-7511: get rid of JSR 305 dependency - use jetbrains nullability annotations instead - oak-lucene

[reschke] OAK-7511: get rid of JSR 305 dependency - use jetbrains nullability annotations instead - oak-jcr

[reschke] OAK-7511: get rid of JSR 305 dependency - use jetbrains nullability annotations instead - oak-it

[reschke] OAK-7511: get rid of JSR 305 dependency - use jetbrains nullability annotations instead - oak-http

[reschke] OAK-7511: get rid of JSR 305 dependency - use jetbrains nullability annotations instead - oak-exercise

[reschke] OAK-7511: get rid of JSR 305 dependency - use jetbrains nullability annotations instead - oak-core-spi

[reschke] OAK-7511: get rid of JSR 305 dependency - use jetbrains nullability annotations instead - oak-core

[reschke] OAK-7511: get rid of JSR 305 dependency - use jetbrains nullability annotations instead - oak-commons

[reschke] OAK-7511: get rid of JSR 305 dependency - use jetbrains nullability annotations instead - oak-blob-plugins

[reschke] OAK-7511: get rid of JSR 305 dependency - use jetbrains nullability annotations instead - oak-blob

[reschke] OAK-7511: get rid of JSR 305 dependency - use jetbrains nullability annotations instead - oak-benchmarks

[reschke] OAK-7511: get rid of JSR 305 dependency - use jetbrains nullability annotations instead - oak-authorization-cug

[reschke] OAK-7511: get rid of JSR 305 dependency - use jetbrains nullability annotations instead - oak-auth-ldap

[reschke] OAK-7511: get rid of JSR 305 dependency - use jetbrains nullability annotations instead - oak-auth-external

[reschke] OAK-7511: get rid of JSR 305 dependency - use jetbrains nullability annotations instead - oak-api

[reschke] OAK-7511: get rid of JSR 305 dependency - use jetbrains nullability annotations instead - add jetbrains annotations to parent pom

[davide] [maven-release-plugin] prepare for next development iteration

[davide] [maven-release-plugin] prepare release jackrabbit-oak-1.9.6

[davide] Apache Jackrabbit Oak 1.9.6

release notes

 

Test results:
All tests passed

BUILD FAILURE: Jackrabbit Oak - Build # 1550 - Still Failing

Posted by Apache Jenkins Server <je...@builds.apache.org>.
The Apache Jenkins build system has built Jackrabbit Oak (build #1550)

Status: Still Failing

Check console output at https://builds.apache.org/job/Jackrabbit%20Oak/1550/ to view the results.

Changes:
[adulceanu] OAK-7643 - repository.home not correctly set after converting oak-segment-tar to OSGi R6 annotations
Temporarily reverting "OAK-6770 - Convert oak-segment-tar to OSGi R6 annotations"
This reverts commit r1835837.

 

Test results:
1 tests failed.
FAILED:  org.apache.jackrabbit.oak.plugins.blob.UploadStagingCacheTest.testConcurrentSameAddRequest

Error Message:
expected:<2> but was:<1>

Stack Trace:
java.lang.AssertionError: expected:<2> but was:<1>
	at org.apache.jackrabbit.oak.plugins.blob.UploadStagingCacheTest.assertCacheStats(UploadStagingCacheTest.java:843)
	at org.apache.jackrabbit.oak.plugins.blob.UploadStagingCacheTest.testConcurrentSameAddRequest(UploadStagingCacheTest.java:456)