You are viewing a plain text version of this content. The canonical link for it is here.
Posted to dev@kafka.apache.org by Apache Jenkins Server <je...@builds.apache.org> on 2023/10/25 14:45:53 UTC

Jenkins build is unstable: Kafka » Kafka Branch Builder » trunk #2327

See <https://ci-builds.apache.org/job/Kafka/job/kafka/job/trunk/2327/display/redirect>


Jenkins build is still unstable: Kafka » Kafka Branch Builder » trunk #2352

Posted by Apache Jenkins Server <je...@builds.apache.org>.
See <https://ci-builds.apache.org/job/Kafka/job/kafka/job/trunk/2352/display/redirect>


Jenkins build is still unstable: Kafka » Kafka Branch Builder » trunk #2351

Posted by Apache Jenkins Server <je...@builds.apache.org>.
See <https://ci-builds.apache.org/job/Kafka/job/kafka/job/trunk/2351/display/redirect>


Jenkins build is unstable: Kafka » Kafka Branch Builder » trunk #2350

Posted by Apache Jenkins Server <je...@builds.apache.org>.
See <https://ci-builds.apache.org/job/Kafka/job/kafka/job/trunk/2350/display/redirect>


Build failed in Jenkins: Kafka » Kafka Branch Builder » trunk #2349

Posted by Apache Jenkins Server <je...@builds.apache.org>.
See <https://ci-builds.apache.org/job/Kafka/job/kafka/job/trunk/2349/display/redirect>

Changes:


------------------------------------------
[...truncated 437410 lines...]

Gradle Test Run :streams:test > Gradle Test Executor 88 > DefaultTaskExecutorTest > shouldProcessTasks() STARTED

Gradle Test Run :streams:test > Gradle Test Executor 88 > DefaultTaskExecutorTest > shouldProcessTasks() PASSED

Gradle Test Run :streams:test > Gradle Test Executor 88 > DefaultTaskExecutorTest > shouldPunctuateStreamTime() STARTED

Gradle Test Run :streams:test > Gradle Test Executor 88 > DefaultTaskExecutorTest > shouldPunctuateStreamTime() PASSED

Gradle Test Run :streams:test > Gradle Test Executor 88 > DefaultTaskExecutorTest > shouldShutdownTaskExecutor() STARTED

Gradle Test Run :streams:test > Gradle Test Executor 88 > DefaultTaskExecutorTest > shouldShutdownTaskExecutor() PASSED

Gradle Test Run :streams:test > Gradle Test Executor 88 > DefaultTaskExecutorTest > shouldAwaitProcessableTasksIfNoneAssignable() STARTED

Gradle Test Run :streams:test > Gradle Test Executor 88 > DefaultTaskExecutorTest > shouldAwaitProcessableTasksIfNoneAssignable() PASSED

Gradle Test Run :streams:test > Gradle Test Executor 88 > DefaultTaskExecutorTest > shouldRespectPunctuationDisabledByTaskExecutionMetadata() STARTED

Gradle Test Run :streams:test > Gradle Test Executor 88 > DefaultTaskExecutorTest > shouldRespectPunctuationDisabledByTaskExecutionMetadata() PASSED

Gradle Test Run :streams:test > Gradle Test Executor 88 > DefaultTaskExecutorTest > shouldSetTaskTimeoutOnTimeoutException() STARTED

Gradle Test Run :streams:test > Gradle Test Executor 88 > DefaultTaskExecutorTest > shouldSetTaskTimeoutOnTimeoutException() PASSED

Gradle Test Run :streams:test > Gradle Test Executor 88 > DefaultTaskExecutorTest > shouldPunctuateSystemTime() STARTED

Gradle Test Run :streams:test > Gradle Test Executor 88 > DefaultTaskExecutorTest > shouldPunctuateSystemTime() PASSED

Gradle Test Run :streams:test > Gradle Test Executor 88 > DefaultTaskExecutorTest > shouldUnassignTaskWhenNotProgressing() STARTED

Gradle Test Run :streams:test > Gradle Test Executor 88 > DefaultTaskExecutorTest > shouldUnassignTaskWhenNotProgressing() PASSED

Gradle Test Run :streams:test > Gradle Test Executor 88 > DefaultTaskExecutorTest > shouldNotFlushOnException() STARTED

Gradle Test Run :streams:test > Gradle Test Executor 88 > DefaultTaskExecutorTest > shouldNotFlushOnException() PASSED

Gradle Test Run :streams:test > Gradle Test Executor 88 > DefaultTaskExecutorTest > shouldRespectProcessingDisabledByTaskExecutionMetadata() STARTED

Gradle Test Run :streams:test > Gradle Test Executor 88 > DefaultTaskExecutorTest > shouldRespectProcessingDisabledByTaskExecutionMetadata() PASSED

Gradle Test Run :streams:test > Gradle Test Executor 88 > DefaultTaskManagerTest > shouldLockAnEmptySetOfTasks() STARTED

Gradle Test Run :streams:test > Gradle Test Executor 88 > DefaultTaskManagerTest > shouldLockAnEmptySetOfTasks() PASSED

Gradle Test Run :streams:test > Gradle Test Executor 88 > DefaultTaskManagerTest > shouldAssignTasksThatCanBeSystemTimePunctuated() STARTED

Gradle Test Run :streams:test > Gradle Test Executor 88 > DefaultTaskManagerTest > shouldAssignTasksThatCanBeSystemTimePunctuated() PASSED

Gradle Test Run :streams:test > Gradle Test Executor 88 > DefaultTaskManagerTest > shouldNotUnassignNotOwnedTask() STARTED

Gradle Test Run :streams:test > Gradle Test Executor 88 > DefaultTaskManagerTest > shouldNotUnassignNotOwnedTask() PASSED

Gradle Test Run :streams:test > Gradle Test Executor 88 > DefaultTaskManagerTest > shouldNotSetUncaughtExceptionsTwice() STARTED

Gradle Test Run :streams:test > Gradle Test Executor 88 > DefaultTaskManagerTest > shouldNotSetUncaughtExceptionsTwice() PASSED

Gradle Test Run :streams:test > Gradle Test Executor 88 > DefaultTaskManagerTest > shouldReturnFromAwaitOnAdding() STARTED

Gradle Test Run :streams:test > Gradle Test Executor 88 > DefaultTaskManagerTest > shouldReturnFromAwaitOnAdding() PASSED

Gradle Test Run :streams:test > Gradle Test Executor 88 > DefaultTaskManagerTest > shouldShutdownTaskExecutors() STARTED

Gradle Test Run :streams:test > Gradle Test Executor 88 > DefaultTaskManagerTest > shouldShutdownTaskExecutors() PASSED

Gradle Test Run :streams:test > Gradle Test Executor 88 > DefaultTaskManagerTest > shouldNotAssignTasksForPunctuationIfPunctuationDisabled() STARTED

Gradle Test Run :streams:test > Gradle Test Executor 88 > DefaultTaskManagerTest > shouldNotAssignTasksForPunctuationIfPunctuationDisabled() PASSED

Gradle Test Run :streams:test > Gradle Test Executor 88 > DefaultTaskManagerTest > shouldReturnFromAwaitOnSignalProcessableTasks() STARTED

Gradle Test Run :streams:test > Gradle Test Executor 88 > DefaultTaskManagerTest > shouldReturnFromAwaitOnSignalProcessableTasks() PASSED

Gradle Test Run :streams:test > Gradle Test Executor 88 > DefaultTaskManagerTest > shouldAddTask() STARTED

Gradle Test Run :streams:test > Gradle Test Executor 88 > DefaultTaskManagerTest > shouldAddTask() PASSED

Gradle Test Run :streams:test > Gradle Test Executor 88 > DefaultTaskManagerTest > shouldReturnFromAwaitOnUnassignment() STARTED

Gradle Test Run :streams:test > Gradle Test Executor 88 > DefaultTaskManagerTest > shouldReturnFromAwaitOnUnassignment() PASSED

Gradle Test Run :streams:test > Gradle Test Executor 88 > DefaultTaskManagerTest > shouldNotAssignAnyLockedTask() STARTED

Gradle Test Run :streams:test > Gradle Test Executor 88 > DefaultTaskManagerTest > shouldNotAssignAnyLockedTask() PASSED

Gradle Test Run :streams:test > Gradle Test Executor 88 > DefaultTaskManagerTest > shouldRemoveTask() STARTED

Gradle Test Run :streams:test > Gradle Test Executor 88 > DefaultTaskManagerTest > shouldRemoveTask() PASSED

Gradle Test Run :streams:test > Gradle Test Executor 88 > DefaultTaskManagerTest > shouldNotRemoveAssignedTask() STARTED

Gradle Test Run :streams:test > Gradle Test Executor 88 > DefaultTaskManagerTest > shouldNotRemoveAssignedTask() PASSED

Gradle Test Run :streams:test > Gradle Test Executor 88 > DefaultTaskManagerTest > shouldBlockOnAwait() STARTED

Gradle Test Run :streams:test > Gradle Test Executor 88 > DefaultTaskManagerTest > shouldBlockOnAwait() PASSED

Gradle Test Run :streams:test > Gradle Test Executor 88 > DefaultTaskManagerTest > shouldReturnFromAwaitOnInterruption() STARTED

Gradle Test Run :streams:test > Gradle Test Executor 88 > DefaultTaskManagerTest > shouldReturnFromAwaitOnInterruption() PASSED

Gradle Test Run :streams:test > Gradle Test Executor 88 > DefaultTaskManagerTest > shouldAssignTaskThatCanBeProcessed() STARTED

Gradle Test Run :streams:test > Gradle Test Executor 88 > DefaultTaskManagerTest > shouldAssignTaskThatCanBeProcessed() PASSED

Gradle Test Run :streams:test > Gradle Test Executor 88 > DefaultTaskManagerTest > shouldStartTaskExecutors() STARTED

Gradle Test Run :streams:test > Gradle Test Executor 88 > DefaultTaskManagerTest > shouldStartTaskExecutors() PASSED

Gradle Test Run :streams:test > Gradle Test Executor 88 > DefaultTaskManagerTest > shouldLockATaskThatWasVoluntarilyReleased() STARTED

Gradle Test Run :streams:test > Gradle Test Executor 88 > DefaultTaskManagerTest > shouldLockATaskThatWasVoluntarilyReleased() PASSED

Gradle Test Run :streams:test > Gradle Test Executor 88 > DefaultTaskManagerTest > shouldNotRemoveUnlockedTask() STARTED

Gradle Test Run :streams:test > Gradle Test Executor 88 > DefaultTaskManagerTest > shouldNotRemoveUnlockedTask() PASSED

Gradle Test Run :streams:test > Gradle Test Executor 88 > DefaultTaskManagerTest > shouldReturnAndClearExceptionsOnDrainExceptions() STARTED

Gradle Test Run :streams:test > Gradle Test Executor 88 > DefaultTaskManagerTest > shouldReturnAndClearExceptionsOnDrainExceptions() PASSED

Gradle Test Run :streams:test > Gradle Test Executor 88 > DefaultTaskManagerTest > shouldUnassignTask() STARTED

Gradle Test Run :streams:test > Gradle Test Executor 88 > DefaultTaskManagerTest > shouldUnassignTask() PASSED

Gradle Test Run :streams:test > Gradle Test Executor 88 > DefaultTaskManagerTest > shouldNotAssignTasksIfUncaughtExceptionPresent() STARTED

Gradle Test Run :streams:test > Gradle Test Executor 88 > DefaultTaskManagerTest > shouldNotAssignTasksIfUncaughtExceptionPresent() PASSED

Gradle Test Run :streams:test > Gradle Test Executor 88 > DefaultTaskManagerTest > shouldReturnFromAwaitOnUnlocking() STARTED

Gradle Test Run :streams:test > Gradle Test Executor 88 > DefaultTaskManagerTest > shouldReturnFromAwaitOnUnlocking() PASSED

Gradle Test Run :streams:test > Gradle Test Executor 88 > DefaultTaskManagerTest > shouldNotAssignTasksForProcessingIfProcessingDisabled() STARTED

Gradle Test Run :streams:test > Gradle Test Executor 88 > DefaultTaskManagerTest > shouldNotAssignTasksForProcessingIfProcessingDisabled() PASSED

Gradle Test Run :streams:test > Gradle Test Executor 88 > DefaultTaskManagerTest > shouldNotSetUncaughtExceptionsForUnassignedTasks() STARTED

Gradle Test Run :streams:test > Gradle Test Executor 88 > DefaultTaskManagerTest > shouldNotSetUncaughtExceptionsForUnassignedTasks() PASSED

Gradle Test Run :streams:test > Gradle Test Executor 88 > DefaultTaskManagerTest > shouldNotAssignLockedTask() STARTED

Gradle Test Run :streams:test > Gradle Test Executor 88 > DefaultTaskManagerTest > shouldNotAssignLockedTask() PASSED

Gradle Test Run :streams:test > Gradle Test Executor 88 > DefaultTaskManagerTest > shouldUnassignLockingTask() STARTED

Gradle Test Run :streams:test > Gradle Test Executor 88 > DefaultTaskManagerTest > shouldUnassignLockingTask() PASSED

Gradle Test Run :streams:test > Gradle Test Executor 88 > DefaultTaskManagerTest > shouldAssignTasksThatCanBeStreamTimePunctuated() STARTED

Gradle Test Run :streams:test > Gradle Test Executor 88 > DefaultTaskManagerTest > shouldAssignTasksThatCanBeStreamTimePunctuated() PASSED

Gradle Test Run :streams:test > Gradle Test Executor 88 > RocksDBTimeOrderedKeyValueBytesStoreTest > shouldCreateEmptyWriteBatches() STARTED

Gradle Test Run :streams:test > Gradle Test Executor 88 > RocksDBTimeOrderedKeyValueBytesStoreTest > shouldCreateEmptyWriteBatches() PASSED

Gradle Test Run :streams:test > Gradle Test Executor 88 > RocksDBTimeOrderedKeyValueBytesStoreTest > shouldCreateWriteBatches() STARTED

Gradle Test Run :streams:test > Gradle Test Executor 88 > RocksDBTimeOrderedKeyValueBytesStoreTest > shouldCreateWriteBatches() PASSED

streams-2: SMOKE-TEST-CLIENT-CLOSED
streams-5: SMOKE-TEST-CLIENT-CLOSED
streams-1: SMOKE-TEST-CLIENT-CLOSED
streams-2: SMOKE-TEST-CLIENT-CLOSED
streams-5: SMOKE-TEST-CLIENT-CLOSED
streams-4: SMOKE-TEST-CLIENT-CLOSED
streams-2: SMOKE-TEST-CLIENT-CLOSED
streams-4: SMOKE-TEST-CLIENT-CLOSED
streams-7: SMOKE-TEST-CLIENT-CLOSED
streams-4: SMOKE-TEST-CLIENT-CLOSED
streams-0: SMOKE-TEST-CLIENT-CLOSED
streams-1: SMOKE-TEST-CLIENT-CLOSED
streams-3: SMOKE-TEST-CLIENT-CLOSED
streams-0: SMOKE-TEST-CLIENT-CLOSED
streams-6: SMOKE-TEST-CLIENT-CLOSED
streams-3: SMOKE-TEST-CLIENT-CLOSED
streams-0: SMOKE-TEST-CLIENT-CLOSED
streams-3: SMOKE-TEST-CLIENT-CLOSED
streams-6: SMOKE-TEST-CLIENT-CLOSED
streams-1: SMOKE-TEST-CLIENT-CLOSED

> Task :streams:test

Gradle Test Run :streams:test > Gradle Test Executor 100 > ThreadCacheTest > cacheOverheadsSmallValues STARTED

Gradle Test Run :streams:test > Gradle Test Executor 100 > ThreadCacheTest > cacheOverheadsSmallValues PASSED

Gradle Test Run :streams:test > Gradle Test Executor 101 > EosV2UpgradeIntegrationTest > [false] > shouldUpgradeFromEosAlphaToEosV2[false] STARTED

Gradle Test Run :streams:test > Gradle Test Executor 100 > KTableKTableForeignKeyInnerJoinCustomPartitionerIntegrationTest > shouldThrowIllegalArgumentExceptionWhenCustomPartitionerReturnsMultiplePartitions() STARTED

Gradle Test Run :streams:test > Gradle Test Executor 100 > KTableKTableForeignKeyInnerJoinCustomPartitionerIntegrationTest > shouldThrowIllegalArgumentExceptionWhenCustomPartitionerReturnsMultiplePartitions() PASSED

Gradle Test Run :streams:test > Gradle Test Executor 101 > EosV2UpgradeIntegrationTest > [false] > shouldUpgradeFromEosAlphaToEosV2[false] PASSED

Gradle Test Run :streams:test > Gradle Test Executor 101 > EosV2UpgradeIntegrationTest > [true] > shouldUpgradeFromEosAlphaToEosV2[true] STARTED

Gradle Test Run :streams:test > Gradle Test Executor 101 > EosV2UpgradeIntegrationTest > [true] > shouldUpgradeFromEosAlphaToEosV2[true] PASSED

7340 tests completed, 3 failed, 22 skipped
There were failing tests. See the report at: file:///home/jenkins/workspace/Kafka_kafka_trunk/streams/build/reports/tests/test/index.html

Deprecated Gradle features were used in this build, making it incompatible with Gradle 9.0.

You can use '--warning-mode all' to show the individual deprecation warnings and determine if they come from your own scripts or plugins.

For more on this, please refer to https://docs.gradle.org/8.3/userguide/command_line_interface.html#sec:command_line_warnings in the Gradle documentation.

BUILD SUCCESSFUL in 4h 12m 15s
303 actionable tasks: 111 executed, 192 up-to-date

Publishing build scan...
https://ge.apache.org/s/s2av73nw7hi2g


See the profiling report at: file:///home/jenkins/workspace/Kafka_kafka_trunk/build/reports/profile/profile-2023-11-01-04-33-54.html
A fine-grained performance profile is available: use the --scan option.
[Pipeline] junit
Recording test results
[Checks API] No suitable checks publisher found.
[Pipeline] echo
Skipping Kafka Streams archetype test for Java 11
[Pipeline] }
[Pipeline] // withEnv
[Pipeline] }
[Pipeline] // withEnv
[Pipeline] }
[Pipeline] // withEnv
[Pipeline] }
[Pipeline] // node
[Pipeline] }
[Pipeline] // timestamps
[Pipeline] }
[Pipeline] // timeout
[Pipeline] }
[Pipeline] // stage
[Pipeline] }
[Pipeline] // parallel
[Pipeline] }
[Pipeline] // stage
[Pipeline] stage
[Pipeline] { (Declarative: Post Actions)
[Pipeline] script
[Pipeline] {
[Pipeline] node
Running on builds56 in /home/jenkins/jenkins-agent/workspace/Kafka_kafka_trunk
[Pipeline] {
[Pipeline] step

Build failed in Jenkins: Kafka » Kafka Branch Builder » trunk #2348

Posted by Apache Jenkins Server <je...@builds.apache.org>.
See <https://ci-builds.apache.org/job/Kafka/job/kafka/job/trunk/2348/display/redirect>

Changes:


------------------------------------------
[...truncated 323152 lines...]
Gradle Test Run :streams:test > Gradle Test Executor 90 > DefaultTaskExecutorTest > shouldSetTaskTimeoutOnTimeoutException() PASSED

Gradle Test Run :streams:test > Gradle Test Executor 90 > DefaultTaskExecutorTest > shouldPunctuateSystemTime() STARTED

Gradle Test Run :streams:test > Gradle Test Executor 90 > DefaultTaskExecutorTest > shouldPunctuateSystemTime() PASSED

Gradle Test Run :streams:test > Gradle Test Executor 90 > DefaultTaskExecutorTest > shouldUnassignTaskWhenNotProgressing() STARTED

Gradle Test Run :streams:test > Gradle Test Executor 90 > DefaultTaskExecutorTest > shouldUnassignTaskWhenNotProgressing() PASSED

Gradle Test Run :streams:test > Gradle Test Executor 90 > DefaultTaskExecutorTest > shouldNotFlushOnException() STARTED

Gradle Test Run :streams:test > Gradle Test Executor 90 > DefaultTaskExecutorTest > shouldNotFlushOnException() PASSED

Gradle Test Run :streams:test > Gradle Test Executor 90 > DefaultTaskExecutorTest > shouldRespectProcessingDisabledByTaskExecutionMetadata() STARTED

Gradle Test Run :streams:test > Gradle Test Executor 90 > DefaultTaskExecutorTest > shouldRespectProcessingDisabledByTaskExecutionMetadata() PASSED

Gradle Test Run :streams:test > Gradle Test Executor 90 > DefaultTaskManagerTest > shouldLockAnEmptySetOfTasks() STARTED

Gradle Test Run :streams:test > Gradle Test Executor 90 > DefaultTaskManagerTest > shouldLockAnEmptySetOfTasks() PASSED

Gradle Test Run :streams:test > Gradle Test Executor 90 > DefaultTaskManagerTest > shouldAssignTasksThatCanBeSystemTimePunctuated() STARTED

Gradle Test Run :streams:test > Gradle Test Executor 90 > DefaultTaskManagerTest > shouldAssignTasksThatCanBeSystemTimePunctuated() PASSED

Gradle Test Run :streams:test > Gradle Test Executor 90 > DefaultTaskManagerTest > shouldNotUnassignNotOwnedTask() STARTED

Gradle Test Run :streams:test > Gradle Test Executor 90 > DefaultTaskManagerTest > shouldNotUnassignNotOwnedTask() PASSED

Gradle Test Run :streams:test > Gradle Test Executor 90 > DefaultTaskManagerTest > shouldNotSetUncaughtExceptionsTwice() STARTED

Gradle Test Run :streams:test > Gradle Test Executor 90 > DefaultTaskManagerTest > shouldNotSetUncaughtExceptionsTwice() PASSED

Gradle Test Run :streams:test > Gradle Test Executor 90 > DefaultTaskManagerTest > shouldReturnFromAwaitOnAdding() STARTED

Gradle Test Run :streams:test > Gradle Test Executor 90 > DefaultTaskManagerTest > shouldReturnFromAwaitOnAdding() PASSED

Gradle Test Run :streams:test > Gradle Test Executor 90 > DefaultTaskManagerTest > shouldShutdownTaskExecutors() STARTED

Gradle Test Run :streams:test > Gradle Test Executor 90 > DefaultTaskManagerTest > shouldShutdownTaskExecutors() PASSED

Gradle Test Run :streams:test > Gradle Test Executor 90 > DefaultTaskManagerTest > shouldNotAssignTasksForPunctuationIfPunctuationDisabled() STARTED

Gradle Test Run :streams:test > Gradle Test Executor 90 > DefaultTaskManagerTest > shouldNotAssignTasksForPunctuationIfPunctuationDisabled() PASSED

Gradle Test Run :streams:test > Gradle Test Executor 90 > DefaultTaskManagerTest > shouldReturnFromAwaitOnSignalProcessableTasks() STARTED

Gradle Test Run :streams:test > Gradle Test Executor 90 > DefaultTaskManagerTest > shouldReturnFromAwaitOnSignalProcessableTasks() PASSED

Gradle Test Run :streams:test > Gradle Test Executor 90 > DefaultTaskManagerTest > shouldAddTask() STARTED

Gradle Test Run :streams:test > Gradle Test Executor 90 > DefaultTaskManagerTest > shouldAddTask() PASSED

Gradle Test Run :streams:test > Gradle Test Executor 90 > DefaultTaskManagerTest > shouldReturnFromAwaitOnUnassignment() STARTED

Gradle Test Run :streams:test > Gradle Test Executor 90 > DefaultTaskManagerTest > shouldReturnFromAwaitOnUnassignment() PASSED

Gradle Test Run :streams:test > Gradle Test Executor 90 > DefaultTaskManagerTest > shouldNotAssignAnyLockedTask() STARTED

Gradle Test Run :streams:test > Gradle Test Executor 90 > DefaultTaskManagerTest > shouldNotAssignAnyLockedTask() PASSED

Gradle Test Run :streams:test > Gradle Test Executor 90 > DefaultTaskManagerTest > shouldRemoveTask() STARTED

Gradle Test Run :streams:test > Gradle Test Executor 90 > DefaultTaskManagerTest > shouldRemoveTask() PASSED

Gradle Test Run :streams:test > Gradle Test Executor 90 > DefaultTaskManagerTest > shouldNotRemoveAssignedTask() STARTED

Gradle Test Run :streams:test > Gradle Test Executor 90 > DefaultTaskManagerTest > shouldNotRemoveAssignedTask() PASSED

Gradle Test Run :streams:test > Gradle Test Executor 90 > DefaultTaskManagerTest > shouldBlockOnAwait() STARTED

Gradle Test Run :streams:test > Gradle Test Executor 90 > DefaultTaskManagerTest > shouldBlockOnAwait() PASSED

Gradle Test Run :streams:test > Gradle Test Executor 90 > DefaultTaskManagerTest > shouldReturnFromAwaitOnInterruption() STARTED

Gradle Test Run :streams:test > Gradle Test Executor 90 > DefaultTaskManagerTest > shouldReturnFromAwaitOnInterruption() PASSED

Gradle Test Run :streams:test > Gradle Test Executor 90 > DefaultTaskManagerTest > shouldAssignTaskThatCanBeProcessed() STARTED

Gradle Test Run :streams:test > Gradle Test Executor 90 > DefaultTaskManagerTest > shouldAssignTaskThatCanBeProcessed() PASSED

Gradle Test Run :streams:test > Gradle Test Executor 90 > DefaultTaskManagerTest > shouldStartTaskExecutors() STARTED

Gradle Test Run :streams:test > Gradle Test Executor 90 > DefaultTaskManagerTest > shouldStartTaskExecutors() PASSED

Gradle Test Run :streams:test > Gradle Test Executor 90 > DefaultTaskManagerTest > shouldLockATaskThatWasVoluntarilyReleased() STARTED

Gradle Test Run :streams:test > Gradle Test Executor 90 > DefaultTaskManagerTest > shouldLockATaskThatWasVoluntarilyReleased() PASSED

Gradle Test Run :streams:test > Gradle Test Executor 90 > DefaultTaskManagerTest > shouldNotRemoveUnlockedTask() STARTED

Gradle Test Run :streams:test > Gradle Test Executor 90 > DefaultTaskManagerTest > shouldNotRemoveUnlockedTask() PASSED

Gradle Test Run :streams:test > Gradle Test Executor 90 > DefaultTaskManagerTest > shouldReturnAndClearExceptionsOnDrainExceptions() STARTED

Gradle Test Run :streams:test > Gradle Test Executor 90 > DefaultTaskManagerTest > shouldReturnAndClearExceptionsOnDrainExceptions() PASSED

Gradle Test Run :streams:test > Gradle Test Executor 90 > DefaultTaskManagerTest > shouldUnassignTask() STARTED

Gradle Test Run :streams:test > Gradle Test Executor 90 > DefaultTaskManagerTest > shouldUnassignTask() PASSED

Gradle Test Run :streams:test > Gradle Test Executor 90 > DefaultTaskManagerTest > shouldNotAssignTasksIfUncaughtExceptionPresent() STARTED

Gradle Test Run :streams:test > Gradle Test Executor 90 > DefaultTaskManagerTest > shouldNotAssignTasksIfUncaughtExceptionPresent() PASSED

Gradle Test Run :streams:test > Gradle Test Executor 90 > DefaultTaskManagerTest > shouldReturnFromAwaitOnUnlocking() STARTED

Gradle Test Run :streams:test > Gradle Test Executor 90 > DefaultTaskManagerTest > shouldReturnFromAwaitOnUnlocking() PASSED

Gradle Test Run :streams:test > Gradle Test Executor 90 > DefaultTaskManagerTest > shouldNotAssignTasksForProcessingIfProcessingDisabled() STARTED

Gradle Test Run :streams:test > Gradle Test Executor 90 > DefaultTaskManagerTest > shouldNotAssignTasksForProcessingIfProcessingDisabled() PASSED

Gradle Test Run :streams:test > Gradle Test Executor 90 > DefaultTaskManagerTest > shouldNotSetUncaughtExceptionsForUnassignedTasks() STARTED

Gradle Test Run :streams:test > Gradle Test Executor 90 > DefaultTaskManagerTest > shouldNotSetUncaughtExceptionsForUnassignedTasks() PASSED

Gradle Test Run :streams:test > Gradle Test Executor 90 > DefaultTaskManagerTest > shouldNotAssignLockedTask() STARTED

Gradle Test Run :streams:test > Gradle Test Executor 90 > DefaultTaskManagerTest > shouldNotAssignLockedTask() PASSED

Gradle Test Run :streams:test > Gradle Test Executor 90 > DefaultTaskManagerTest > shouldUnassignLockingTask() STARTED

Gradle Test Run :streams:test > Gradle Test Executor 90 > DefaultTaskManagerTest > shouldUnassignLockingTask() PASSED

Gradle Test Run :streams:test > Gradle Test Executor 90 > DefaultTaskManagerTest > shouldAssignTasksThatCanBeStreamTimePunctuated() STARTED

Gradle Test Run :streams:test > Gradle Test Executor 90 > DefaultTaskManagerTest > shouldAssignTasksThatCanBeStreamTimePunctuated() PASSED

Gradle Test Run :streams:test > Gradle Test Executor 90 > RocksDBTimeOrderedKeyValueBytesStoreTest > shouldCreateEmptyWriteBatches() STARTED

Gradle Test Run :streams:test > Gradle Test Executor 90 > RocksDBTimeOrderedKeyValueBytesStoreTest > shouldCreateEmptyWriteBatches() PASSED

Gradle Test Run :streams:test > Gradle Test Executor 90 > RocksDBTimeOrderedKeyValueBytesStoreTest > shouldCreateWriteBatches() STARTED

Gradle Test Run :streams:test > Gradle Test Executor 90 > RocksDBTimeOrderedKeyValueBytesStoreTest > shouldCreateWriteBatches() PASSED

streams-1: SMOKE-TEST-CLIENT-CLOSED
streams-1: SMOKE-TEST-CLIENT-CLOSED
streams-2: SMOKE-TEST-CLIENT-CLOSED
streams-1: SMOKE-TEST-CLIENT-CLOSED
streams-0: SMOKE-TEST-CLIENT-CLOSED
streams-11: SMOKE-TEST-CLIENT-CLOSED
streams-4: SMOKE-TEST-CLIENT-CLOSED
streams-6: SMOKE-TEST-CLIENT-CLOSED
streams-7: SMOKE-TEST-CLIENT-CLOSED
streams-5: SMOKE-TEST-CLIENT-CLOSED
streams-3: SMOKE-TEST-CLIENT-CLOSED
streams-3: SMOKE-TEST-CLIENT-CLOSED
streams-2: SMOKE-TEST-CLIENT-CLOSED
streams-0: SMOKE-TEST-CLIENT-CLOSED
streams-10: SMOKE-TEST-CLIENT-CLOSED
streams-9: SMOKE-TEST-CLIENT-CLOSED
streams-7: SMOKE-TEST-CLIENT-CLOSED
streams-6: SMOKE-TEST-CLIENT-CLOSED
streams-5: SMOKE-TEST-CLIENT-CLOSED
streams-5: SMOKE-TEST-CLIENT-CLOSED
streams-4: SMOKE-TEST-CLIENT-CLOSED
streams-6: SMOKE-TEST-CLIENT-CLOSED
streams-4: SMOKE-TEST-CLIENT-CLOSED
streams-7: SMOKE-TEST-CLIENT-CLOSED
streams-2: SMOKE-TEST-CLIENT-CLOSED
streams-8: SMOKE-TEST-CLIENT-CLOSED
streams-8: SMOKE-TEST-CLIENT-CLOSED
streams-0: SMOKE-TEST-CLIENT-CLOSED
streams-3: SMOKE-TEST-CLIENT-CLOSED

> Task :streams:test

Gradle Test Run :streams:test > Gradle Test Executor 104 > EosIntegrationTest > [at_least_once, processing threads = false] > shouldWriteLatestOffsetsToCheckpointOnShutdown[at_least_once, processing threads = false] STARTED

Gradle Test Run :streams:test > Gradle Test Executor 105 > NamedTopologyIntegrationTest > shouldAddAndRemoveNamedTopologiesBeforeStartingAndRouteQueriesToCorrectTopology() STARTED

Gradle Test Run :streams:test > Gradle Test Executor 104 > EosIntegrationTest > [at_least_once, processing threads = false] > shouldWriteLatestOffsetsToCheckpointOnShutdown[at_least_once, processing threads = false] PASSED

Gradle Test Run :streams:test > Gradle Test Executor 104 > EosIntegrationTest > [exactly_once, processing threads = false] > shouldWriteLatestOffsetsToCheckpointOnShutdown[exactly_once, processing threads = false] STARTED

Gradle Test Run :streams:test > Gradle Test Executor 104 > EosIntegrationTest > [exactly_once, processing threads = false] > shouldWriteLatestOffsetsToCheckpointOnShutdown[exactly_once, processing threads = false] PASSED

Gradle Test Run :streams:test > Gradle Test Executor 104 > EosIntegrationTest > [exactly_once_v2, processing threads = false] > shouldWriteLatestOffsetsToCheckpointOnShutdown[exactly_once_v2, processing threads = false] STARTED

Gradle Test Run :streams:test > Gradle Test Executor 105 > NamedTopologyIntegrationTest > shouldAddAndRemoveNamedTopologiesBeforeStartingAndRouteQueriesToCorrectTopology() PASSED

Gradle Test Run :streams:test > Gradle Test Executor 104 > EosIntegrationTest > [exactly_once_v2, processing threads = false] > shouldWriteLatestOffsetsToCheckpointOnShutdown[exactly_once_v2, processing threads = false] PASSED

Gradle Test Run :streams:test > Gradle Test Executor 104 > EosIntegrationTest > [at_least_once, processing threads = true] > shouldWriteLatestOffsetsToCheckpointOnShutdown[at_least_once, processing threads = true] STARTED

Gradle Test Run :streams:test > Gradle Test Executor 104 > EosIntegrationTest > [at_least_once, processing threads = true] > shouldWriteLatestOffsetsToCheckpointOnShutdown[at_least_once, processing threads = true] PASSED

Gradle Test Run :streams:test > Gradle Test Executor 104 > EosIntegrationTest > [exactly_once, processing threads = true] > shouldWriteLatestOffsetsToCheckpointOnShutdown[exactly_once, processing threads = true] STARTED

Gradle Test Run :streams:test > Gradle Test Executor 104 > EosIntegrationTest > [exactly_once, processing threads = true] > shouldWriteLatestOffsetsToCheckpointOnShutdown[exactly_once, processing threads = true] PASSED

Gradle Test Run :streams:test > Gradle Test Executor 104 > EosIntegrationTest > [exactly_once_v2, processing threads = true] > shouldWriteLatestOffsetsToCheckpointOnShutdown[exactly_once_v2, processing threads = true] STARTED

Gradle Test Run :streams:test > Gradle Test Executor 104 > EosIntegrationTest > [exactly_once_v2, processing threads = true] > shouldWriteLatestOffsetsToCheckpointOnShutdown[exactly_once_v2, processing threads = true] PASSED

7343 tests completed, 2 failed, 22 skipped
There were failing tests. See the report at: file:///home/jenkins/jenkins-agent/workspace/Kafka_kafka_trunk/streams/build/reports/tests/test/index.html

Deprecated Gradle features were used in this build, making it incompatible with Gradle 9.0.

You can use '--warning-mode all' to show the individual deprecation warnings and determine if they come from your own scripts or plugins.

For more on this, please refer to https://docs.gradle.org/8.3/userguide/command_line_interface.html#sec:command_line_warnings in the Gradle documentation.

BUILD SUCCESSFUL in 3h 16m 34s
303 actionable tasks: 111 executed, 192 up-to-date

Publishing build scan...
https://ge.apache.org/s/6zgz437fpcspi


See the profiling report at: file:///home/jenkins/jenkins-agent/workspace/Kafka_kafka_trunk/build/reports/profile/profile-2023-11-01-00-32-31.html
A fine-grained performance profile is available: use the --scan option.
[Pipeline] junit
Recording test results
[Checks API] No suitable checks publisher found.
[Pipeline] echo
Skipping Kafka Streams archetype test for Java 11
[Pipeline] }
[Pipeline] // withEnv
[Pipeline] }
[Pipeline] // withEnv
[Pipeline] }
[Pipeline] // withEnv
[Pipeline] }
[Pipeline] // node
[Pipeline] }
[Pipeline] // timestamps
[Pipeline] }
[Pipeline] // timeout
[Pipeline] }
[Pipeline] // stage
[Pipeline] }
[Pipeline] // parallel
[Pipeline] }
[Pipeline] // stage
[Pipeline] stage
[Pipeline] { (Declarative: Post Actions)
[Pipeline] script
[Pipeline] {
[Pipeline] node
Still waiting to schedule task
Waiting for next available executor on ‘ubuntu’
Running on builds29 in /home/jenkins/workspace/Kafka_kafka_trunk
[Pipeline] {
[Pipeline] step

Build failed in Jenkins: Kafka » Kafka Branch Builder » trunk #2347

Posted by Apache Jenkins Server <je...@builds.apache.org>.
See <https://ci-builds.apache.org/job/Kafka/job/kafka/job/trunk/2347/display/redirect>

Changes:


------------------------------------------
[...truncated 321056 lines...]

Gradle Test Run :streams:test > Gradle Test Executor 88 > DefaultTaskExecutorTest > shouldShutdownTaskExecutor() STARTED

Gradle Test Run :streams:test > Gradle Test Executor 88 > DefaultTaskExecutorTest > shouldShutdownTaskExecutor() PASSED

Gradle Test Run :streams:test > Gradle Test Executor 88 > DefaultTaskExecutorTest > shouldAwaitProcessableTasksIfNoneAssignable() STARTED

Gradle Test Run :streams:test > Gradle Test Executor 88 > DefaultTaskExecutorTest > shouldAwaitProcessableTasksIfNoneAssignable() PASSED

Gradle Test Run :streams:test > Gradle Test Executor 88 > DefaultTaskExecutorTest > shouldRespectPunctuationDisabledByTaskExecutionMetadata() STARTED

Gradle Test Run :streams:test > Gradle Test Executor 88 > DefaultTaskExecutorTest > shouldRespectPunctuationDisabledByTaskExecutionMetadata() PASSED

Gradle Test Run :streams:test > Gradle Test Executor 88 > DefaultTaskExecutorTest > shouldSetTaskTimeoutOnTimeoutException() STARTED

Gradle Test Run :streams:test > Gradle Test Executor 88 > DefaultTaskExecutorTest > shouldSetTaskTimeoutOnTimeoutException() PASSED

Gradle Test Run :streams:test > Gradle Test Executor 88 > DefaultTaskExecutorTest > shouldPunctuateSystemTime() STARTED

Gradle Test Run :streams:test > Gradle Test Executor 88 > DefaultTaskExecutorTest > shouldPunctuateSystemTime() PASSED

Gradle Test Run :streams:test > Gradle Test Executor 88 > DefaultTaskExecutorTest > shouldUnassignTaskWhenNotProgressing() STARTED

Gradle Test Run :streams:test > Gradle Test Executor 88 > DefaultTaskExecutorTest > shouldUnassignTaskWhenNotProgressing() PASSED

Gradle Test Run :streams:test > Gradle Test Executor 88 > DefaultTaskExecutorTest > shouldNotFlushOnException() STARTED

Gradle Test Run :streams:test > Gradle Test Executor 88 > DefaultTaskExecutorTest > shouldNotFlushOnException() PASSED

Gradle Test Run :streams:test > Gradle Test Executor 88 > DefaultTaskExecutorTest > shouldRespectProcessingDisabledByTaskExecutionMetadata() STARTED

Gradle Test Run :streams:test > Gradle Test Executor 88 > DefaultTaskExecutorTest > shouldRespectProcessingDisabledByTaskExecutionMetadata() PASSED

Gradle Test Run :streams:test > Gradle Test Executor 88 > DefaultTaskManagerTest > shouldLockAnEmptySetOfTasks() STARTED

Gradle Test Run :streams:test > Gradle Test Executor 88 > DefaultTaskManagerTest > shouldLockAnEmptySetOfTasks() PASSED

Gradle Test Run :streams:test > Gradle Test Executor 88 > DefaultTaskManagerTest > shouldAssignTasksThatCanBeSystemTimePunctuated() STARTED

Gradle Test Run :streams:test > Gradle Test Executor 88 > DefaultTaskManagerTest > shouldAssignTasksThatCanBeSystemTimePunctuated() PASSED

Gradle Test Run :streams:test > Gradle Test Executor 88 > DefaultTaskManagerTest > shouldNotUnassignNotOwnedTask() STARTED

Gradle Test Run :streams:test > Gradle Test Executor 88 > DefaultTaskManagerTest > shouldNotUnassignNotOwnedTask() PASSED

Gradle Test Run :streams:test > Gradle Test Executor 88 > DefaultTaskManagerTest > shouldNotSetUncaughtExceptionsTwice() STARTED

Gradle Test Run :streams:test > Gradle Test Executor 88 > DefaultTaskManagerTest > shouldNotSetUncaughtExceptionsTwice() PASSED

Gradle Test Run :streams:test > Gradle Test Executor 88 > DefaultTaskManagerTest > shouldReturnFromAwaitOnAdding() STARTED

Gradle Test Run :streams:test > Gradle Test Executor 88 > DefaultTaskManagerTest > shouldReturnFromAwaitOnAdding() PASSED

Gradle Test Run :streams:test > Gradle Test Executor 88 > DefaultTaskManagerTest > shouldShutdownTaskExecutors() STARTED

Gradle Test Run :streams:test > Gradle Test Executor 88 > DefaultTaskManagerTest > shouldShutdownTaskExecutors() PASSED

Gradle Test Run :streams:test > Gradle Test Executor 88 > DefaultTaskManagerTest > shouldNotAssignTasksForPunctuationIfPunctuationDisabled() STARTED

Gradle Test Run :streams:test > Gradle Test Executor 88 > DefaultTaskManagerTest > shouldNotAssignTasksForPunctuationIfPunctuationDisabled() PASSED

Gradle Test Run :streams:test > Gradle Test Executor 88 > DefaultTaskManagerTest > shouldReturnFromAwaitOnSignalProcessableTasks() STARTED

Gradle Test Run :streams:test > Gradle Test Executor 88 > DefaultTaskManagerTest > shouldReturnFromAwaitOnSignalProcessableTasks() PASSED

Gradle Test Run :streams:test > Gradle Test Executor 88 > DefaultTaskManagerTest > shouldAddTask() STARTED

Gradle Test Run :streams:test > Gradle Test Executor 88 > DefaultTaskManagerTest > shouldAddTask() PASSED

Gradle Test Run :streams:test > Gradle Test Executor 88 > DefaultTaskManagerTest > shouldReturnFromAwaitOnUnassignment() STARTED

Gradle Test Run :streams:test > Gradle Test Executor 88 > DefaultTaskManagerTest > shouldReturnFromAwaitOnUnassignment() PASSED

Gradle Test Run :streams:test > Gradle Test Executor 88 > DefaultTaskManagerTest > shouldNotAssignAnyLockedTask() STARTED

Gradle Test Run :streams:test > Gradle Test Executor 88 > DefaultTaskManagerTest > shouldNotAssignAnyLockedTask() PASSED

Gradle Test Run :streams:test > Gradle Test Executor 88 > DefaultTaskManagerTest > shouldRemoveTask() STARTED

Gradle Test Run :streams:test > Gradle Test Executor 88 > DefaultTaskManagerTest > shouldRemoveTask() PASSED

Gradle Test Run :streams:test > Gradle Test Executor 88 > DefaultTaskManagerTest > shouldNotRemoveAssignedTask() STARTED

Gradle Test Run :streams:test > Gradle Test Executor 88 > DefaultTaskManagerTest > shouldNotRemoveAssignedTask() PASSED

Gradle Test Run :streams:test > Gradle Test Executor 88 > DefaultTaskManagerTest > shouldBlockOnAwait() STARTED

Gradle Test Run :streams:test > Gradle Test Executor 88 > DefaultTaskManagerTest > shouldBlockOnAwait() PASSED

Gradle Test Run :streams:test > Gradle Test Executor 88 > DefaultTaskManagerTest > shouldReturnFromAwaitOnInterruption() STARTED

Gradle Test Run :streams:test > Gradle Test Executor 88 > DefaultTaskManagerTest > shouldReturnFromAwaitOnInterruption() PASSED

Gradle Test Run :streams:test > Gradle Test Executor 88 > DefaultTaskManagerTest > shouldAssignTaskThatCanBeProcessed() STARTED

Gradle Test Run :streams:test > Gradle Test Executor 88 > DefaultTaskManagerTest > shouldAssignTaskThatCanBeProcessed() PASSED

Gradle Test Run :streams:test > Gradle Test Executor 88 > DefaultTaskManagerTest > shouldStartTaskExecutors() STARTED

Gradle Test Run :streams:test > Gradle Test Executor 88 > DefaultTaskManagerTest > shouldStartTaskExecutors() PASSED

Gradle Test Run :streams:test > Gradle Test Executor 88 > DefaultTaskManagerTest > shouldLockATaskThatWasVoluntarilyReleased() STARTED

Gradle Test Run :streams:test > Gradle Test Executor 88 > DefaultTaskManagerTest > shouldLockATaskThatWasVoluntarilyReleased() PASSED

Gradle Test Run :streams:test > Gradle Test Executor 88 > DefaultTaskManagerTest > shouldNotRemoveUnlockedTask() STARTED

Gradle Test Run :streams:test > Gradle Test Executor 88 > DefaultTaskManagerTest > shouldNotRemoveUnlockedTask() PASSED

Gradle Test Run :streams:test > Gradle Test Executor 88 > DefaultTaskManagerTest > shouldReturnAndClearExceptionsOnDrainExceptions() STARTED

Gradle Test Run :streams:test > Gradle Test Executor 88 > DefaultTaskManagerTest > shouldReturnAndClearExceptionsOnDrainExceptions() PASSED

Gradle Test Run :streams:test > Gradle Test Executor 88 > DefaultTaskManagerTest > shouldUnassignTask() STARTED

Gradle Test Run :streams:test > Gradle Test Executor 88 > DefaultTaskManagerTest > shouldUnassignTask() PASSED

Gradle Test Run :streams:test > Gradle Test Executor 88 > DefaultTaskManagerTest > shouldNotAssignTasksIfUncaughtExceptionPresent() STARTED

Gradle Test Run :streams:test > Gradle Test Executor 88 > DefaultTaskManagerTest > shouldNotAssignTasksIfUncaughtExceptionPresent() PASSED

Gradle Test Run :streams:test > Gradle Test Executor 88 > DefaultTaskManagerTest > shouldReturnFromAwaitOnUnlocking() STARTED

Gradle Test Run :streams:test > Gradle Test Executor 88 > DefaultTaskManagerTest > shouldReturnFromAwaitOnUnlocking() PASSED

Gradle Test Run :streams:test > Gradle Test Executor 88 > DefaultTaskManagerTest > shouldNotAssignTasksForProcessingIfProcessingDisabled() STARTED

Gradle Test Run :streams:test > Gradle Test Executor 88 > DefaultTaskManagerTest > shouldNotAssignTasksForProcessingIfProcessingDisabled() PASSED

Gradle Test Run :streams:test > Gradle Test Executor 88 > DefaultTaskManagerTest > shouldNotSetUncaughtExceptionsForUnassignedTasks() STARTED

Gradle Test Run :streams:test > Gradle Test Executor 88 > DefaultTaskManagerTest > shouldNotSetUncaughtExceptionsForUnassignedTasks() PASSED

Gradle Test Run :streams:test > Gradle Test Executor 88 > DefaultTaskManagerTest > shouldNotAssignLockedTask() STARTED

Gradle Test Run :streams:test > Gradle Test Executor 88 > DefaultTaskManagerTest > shouldNotAssignLockedTask() PASSED

Gradle Test Run :streams:test > Gradle Test Executor 88 > DefaultTaskManagerTest > shouldUnassignLockingTask() STARTED

Gradle Test Run :streams:test > Gradle Test Executor 88 > DefaultTaskManagerTest > shouldUnassignLockingTask() PASSED

Gradle Test Run :streams:test > Gradle Test Executor 88 > DefaultTaskManagerTest > shouldAssignTasksThatCanBeStreamTimePunctuated() STARTED

Gradle Test Run :streams:test > Gradle Test Executor 88 > DefaultTaskManagerTest > shouldAssignTasksThatCanBeStreamTimePunctuated() PASSED

Gradle Test Run :streams:test > Gradle Test Executor 88 > RocksDBTimeOrderedKeyValueBytesStoreTest > shouldCreateEmptyWriteBatches() STARTED

Gradle Test Run :streams:test > Gradle Test Executor 88 > RocksDBTimeOrderedKeyValueBytesStoreTest > shouldCreateEmptyWriteBatches() PASSED

Gradle Test Run :streams:test > Gradle Test Executor 88 > RocksDBTimeOrderedKeyValueBytesStoreTest > shouldCreateWriteBatches() STARTED

Gradle Test Run :streams:test > Gradle Test Executor 88 > RocksDBTimeOrderedKeyValueBytesStoreTest > shouldCreateWriteBatches() PASSED

streams-0: SMOKE-TEST-CLIENT-CLOSED
streams-0: SMOKE-TEST-CLIENT-CLOSED
streams-5: SMOKE-TEST-CLIENT-CLOSED
streams-3: SMOKE-TEST-CLIENT-CLOSED
streams-6: SMOKE-TEST-CLIENT-CLOSED
streams-4: SMOKE-TEST-CLIENT-CLOSED
streams-1: SMOKE-TEST-CLIENT-CLOSED
streams-3: SMOKE-TEST-CLIENT-CLOSED
streams-1: SMOKE-TEST-CLIENT-CLOSED
streams-2: SMOKE-TEST-CLIENT-CLOSED
streams-4: SMOKE-TEST-CLIENT-CLOSED
streams-3: SMOKE-TEST-CLIENT-CLOSED
streams-2: SMOKE-TEST-CLIENT-CLOSED
streams-2: SMOKE-TEST-CLIENT-CLOSED
streams-1: SMOKE-TEST-CLIENT-CLOSED
streams-5: SMOKE-TEST-CLIENT-CLOSED
streams-0: SMOKE-TEST-CLIENT-CLOSED
streams-4: SMOKE-TEST-CLIENT-CLOSED
streams-5: SMOKE-TEST-CLIENT-CLOSED
streams-7: SMOKE-TEST-CLIENT-CLOSED

> Task :streams:test

Gradle Test Run :streams:test > Gradle Test Executor 100 > EosIntegrationTest > [at_least_once, processing threads = false] > shouldWriteLatestOffsetsToCheckpointOnShutdown[at_least_once, processing threads = false] STARTED

Gradle Test Run :streams:test > Gradle Test Executor 100 > EosIntegrationTest > [at_least_once, processing threads = false] > shouldWriteLatestOffsetsToCheckpointOnShutdown[at_least_once, processing threads = false] PASSED

Gradle Test Run :streams:test > Gradle Test Executor 100 > EosIntegrationTest > [exactly_once, processing threads = false] > shouldWriteLatestOffsetsToCheckpointOnShutdown[exactly_once, processing threads = false] STARTED

Gradle Test Run :streams:test > Gradle Test Executor 100 > EosIntegrationTest > [exactly_once, processing threads = false] > shouldWriteLatestOffsetsToCheckpointOnShutdown[exactly_once, processing threads = false] PASSED

Gradle Test Run :streams:test > Gradle Test Executor 100 > EosIntegrationTest > [exactly_once_v2, processing threads = false] > shouldWriteLatestOffsetsToCheckpointOnShutdown[exactly_once_v2, processing threads = false] STARTED

Gradle Test Run :streams:test > Gradle Test Executor 100 > EosIntegrationTest > [exactly_once_v2, processing threads = false] > shouldWriteLatestOffsetsToCheckpointOnShutdown[exactly_once_v2, processing threads = false] PASSED

Gradle Test Run :streams:test > Gradle Test Executor 100 > EosIntegrationTest > [at_least_once, processing threads = true] > shouldWriteLatestOffsetsToCheckpointOnShutdown[at_least_once, processing threads = true] STARTED

Gradle Test Run :streams:test > Gradle Test Executor 100 > EosIntegrationTest > [at_least_once, processing threads = true] > shouldWriteLatestOffsetsToCheckpointOnShutdown[at_least_once, processing threads = true] PASSED

Gradle Test Run :streams:test > Gradle Test Executor 100 > EosIntegrationTest > [exactly_once, processing threads = true] > shouldWriteLatestOffsetsToCheckpointOnShutdown[exactly_once, processing threads = true] STARTED

Gradle Test Run :streams:test > Gradle Test Executor 100 > EosIntegrationTest > [exactly_once, processing threads = true] > shouldWriteLatestOffsetsToCheckpointOnShutdown[exactly_once, processing threads = true] PASSED

Gradle Test Run :streams:test > Gradle Test Executor 100 > EosIntegrationTest > [exactly_once_v2, processing threads = true] > shouldWriteLatestOffsetsToCheckpointOnShutdown[exactly_once_v2, processing threads = true] STARTED

Gradle Test Run :streams:test > Gradle Test Executor 100 > EosIntegrationTest > [exactly_once_v2, processing threads = true] > shouldWriteLatestOffsetsToCheckpointOnShutdown[exactly_once_v2, processing threads = true] PASSED

7342 tests completed, 2 failed, 22 skipped
There were failing tests. See the report at: file:///home/jenkins/workspace/Kafka_kafka_trunk/streams/build/reports/tests/test/index.html

Deprecated Gradle features were used in this build, making it incompatible with Gradle 9.0.

You can use '--warning-mode all' to show the individual deprecation warnings and determine if they come from your own scripts or plugins.

For more on this, please refer to https://docs.gradle.org/8.3/userguide/command_line_interface.html#sec:command_line_warnings in the Gradle documentation.

BUILD SUCCESSFUL in 2h 53m 58s
303 actionable tasks: 111 executed, 192 up-to-date

Publishing build scan...
https://ge.apache.org/s/yawity7awegxe


See the profiling report at: file:///home/jenkins/workspace/Kafka_kafka_trunk/build/reports/profile/profile-2023-10-31-20-57-41.html
A fine-grained performance profile is available: use the --scan option.
[Pipeline] junit
Recording test results
[Checks API] No suitable checks publisher found.
[Pipeline] echo
Skipping Kafka Streams archetype test for Java 11
[Pipeline] }
[Pipeline] // withEnv
[Pipeline] }
[Pipeline] // withEnv
[Pipeline] }
[Pipeline] // withEnv
[Pipeline] }
[Pipeline] // node
[Pipeline] }
[Pipeline] // timestamps
[Pipeline] }
[Pipeline] // timeout
[Pipeline] }
[Pipeline] // stage
[Pipeline] }
[Pipeline] // parallel
[Pipeline] }
[Pipeline] // stage
[Pipeline] stage
[Pipeline] { (Declarative: Post Actions)
[Pipeline] script
[Pipeline] {
[Pipeline] node
Running on builds35 in /home/jenkins/workspace/Kafka_kafka_trunk
[Pipeline] {
[Pipeline] step

Build failed in Jenkins: Kafka » Kafka Branch Builder » trunk #2346

Posted by Apache Jenkins Server <je...@builds.apache.org>.
See <https://ci-builds.apache.org/job/Kafka/job/kafka/job/trunk/2346/display/redirect>

Changes:


------------------------------------------
[...truncated 307290 lines...]

Gradle Test Run :core:test > Gradle Test Executor 90 > BootstrapControllersIntegrationTest > testPutControllersInBootstrapBrokersConfig() SKIPPED

Gradle Test Run :core:test > Gradle Test Executor 90 > BootstrapControllersIntegrationTest > testUsingBootstrapControllersOnUnsupportedAdminApi() STARTED

Gradle Test Run :core:test > Gradle Test Executor 90 > BootstrapControllersIntegrationTest > testUsingBootstrapControllersOnUnsupportedAdminApi() PASSED

Gradle Test Run :core:test > Gradle Test Executor 90 > BootstrapControllersIntegrationTest > testDescribeCluster(boolean) > [1] false STARTED

Gradle Test Run :core:test > Gradle Test Executor 90 > BootstrapControllersIntegrationTest > testDescribeCluster(boolean) > [1] false PASSED

Gradle Test Run :core:test > Gradle Test Executor 90 > BootstrapControllersIntegrationTest > testDescribeCluster(boolean) > [2] true STARTED

Gradle Test Run :core:test > Gradle Test Executor 90 > BootstrapControllersIntegrationTest > testDescribeCluster(boolean) > [2] true PASSED

Gradle Test Run :core:test > Gradle Test Executor 90 > BootstrapControllersIntegrationTest > testDescribeFeatures(boolean) > [1] false STARTED

Gradle Test Run :core:test > Gradle Test Executor 90 > BootstrapControllersIntegrationTest > testDescribeFeatures(boolean) > [1] false PASSED

Gradle Test Run :core:test > Gradle Test Executor 90 > BootstrapControllersIntegrationTest > testDescribeFeatures(boolean) > [2] true STARTED

Gradle Test Run :core:test > Gradle Test Executor 90 > BootstrapControllersIntegrationTest > testDescribeFeatures(boolean) > [2] true PASSED

> Task :streams:test

Gradle Test Run :streams:test > Gradle Test Executor 88 > KTableKTableOuterJoinTest > testSendingOldValue PASSED

Gradle Test Run :streams:test > Gradle Test Executor 88 > KTableKTableOuterJoinTest > testJoin STARTED
> Task :core:compileTestScala
Cannot contact builds31: java.lang.InterruptedException
> Task :core:testClasses
> Task :streams:compileTestJava
> Task :streams:testClasses
> Task :streams:testJar
> Task :streams:testSrcJar
> Task :streams:publishMavenJavaPublicationToMavenLocal
> Task :streams:publishToMavenLocal

Deprecated Gradle features were used in this build, making it incompatible with Gradle 9.0.

You can use '--warning-mode all' to show the individual deprecation warnings and determine if they come from your own scripts or plugins.

For more on this, please refer to https://docs.gradle.org/8.3/userguide/command_line_interface.html#sec:command_line_warnings in the Gradle documentation.

BUILD SUCCESSFUL in 8m 40s
94 actionable tasks: 41 executed, 53 up-to-date

Publishing build scan...
https://ge.apache.org/s/eocqfg3efaup2

[Pipeline] sh
+ grep ^version= gradle.properties
+ cut -d= -f 2
[Pipeline] dir
Running in /home/jenkins/workspace/Kafka_kafka_trunk/streams/quickstart
[Pipeline] {
[Pipeline] sh
+ mvn clean install -Dgpg.skip
[INFO] Scanning for projects...
[INFO] ------------------------------------------------------------------------
[INFO] Reactor Build Order:
[INFO] 
[INFO] Kafka Streams :: Quickstart                                        [pom]
[INFO] streams-quickstart-java                                [maven-archetype]
[INFO] 
[INFO] ----------------< org.apache.kafka:streams-quickstart >-----------------
[INFO] Building Kafka Streams :: Quickstart 3.7.0-SNAPSHOT                [1/2]
[INFO]   from pom.xml
[INFO] --------------------------------[ pom ]---------------------------------
[INFO] 
[INFO] --- clean:3.0.0:clean (default-clean) @ streams-quickstart ---
[INFO] 
[INFO] --- remote-resources:1.5:process (process-resource-bundles) @ streams-quickstart ---
[INFO] 
[INFO] --- site:3.5.1:attach-descriptor (attach-descriptor) @ streams-quickstart ---
[INFO] 
[INFO] --- gpg:1.6:sign (sign-artifacts) @ streams-quickstart ---
[INFO] 
[INFO] --- install:2.5.2:install (default-install) @ streams-quickstart ---
[INFO] Installing /home/jenkins/workspace/Kafka_kafka_trunk/streams/quickstart/pom.xml to /home/jenkins/.m2/repository/org/apache/kafka/streams-quickstart/3.7.0-SNAPSHOT/streams-quickstart-3.7.0-SNAPSHOT.pom
[INFO] 
[INFO] --------------< org.apache.kafka:streams-quickstart-java >--------------
[INFO] Building streams-quickstart-java 3.7.0-SNAPSHOT                    [2/2]
[INFO]   from java/pom.xml
[INFO] --------------------------[ maven-archetype ]---------------------------
[INFO] 
[INFO] --- clean:3.0.0:clean (default-clean) @ streams-quickstart-java ---
[INFO] 
[INFO] --- remote-resources:1.5:process (process-resource-bundles) @ streams-quickstart-java ---
[INFO] 
[INFO] --- resources:2.7:resources (default-resources) @ streams-quickstart-java ---
[INFO] Using 'UTF-8' encoding to copy filtered resources.
[INFO] Copying 6 resources
[INFO] Copying 3 resources
[INFO] 
[INFO] --- resources:2.7:testResources (default-testResources) @ streams-quickstart-java ---
[INFO] Using 'UTF-8' encoding to copy filtered resources.
[INFO] Copying 2 resources
[INFO] Copying 3 resources
[INFO] 
[INFO] --- archetype:2.2:jar (default-jar) @ streams-quickstart-java ---
[INFO] Building archetype jar: /home/jenkins/workspace/Kafka_kafka_trunk/streams/quickstart/java/target/streams-quickstart-java-3.7.0-SNAPSHOT
[INFO] 
[INFO] --- site:3.5.1:attach-descriptor (attach-descriptor) @ streams-quickstart-java ---
[INFO] 
[INFO] --- archetype:2.2:integration-test (default-integration-test) @ streams-quickstart-java ---
[WARNING]  Parameter 'skip' (user property 'archetype.test.skip') is read-only, must not be used in configuration
[INFO] 
[INFO] --- gpg:1.6:sign (sign-artifacts) @ streams-quickstart-java ---
[INFO] 
[INFO] --- install:2.5.2:install (default-install) @ streams-quickstart-java ---
[INFO] Installing /home/jenkins/workspace/Kafka_kafka_trunk/streams/quickstart/java/target/streams-quickstart-java-3.7.0-SNAPSHOT.jar to /home/jenkins/.m2/repository/org/apache/kafka/streams-quickstart-java/3.7.0-SNAPSHOT/streams-quickstart-java-3.7.0-SNAPSHOT.jar
[INFO] Installing /home/jenkins/workspace/Kafka_kafka_trunk/streams/quickstart/java/pom.xml to /home/jenkins/.m2/repository/org/apache/kafka/streams-quickstart-java/3.7.0-SNAPSHOT/streams-quickstart-java-3.7.0-SNAPSHOT.pom
[INFO] 
[INFO] --- archetype:2.2:update-local-catalog (default-update-local-catalog) @ streams-quickstart-java ---
[INFO] ------------------------------------------------------------------------
[INFO] Reactor Summary for Kafka Streams :: Quickstart 3.7.0-SNAPSHOT:
[INFO] 
[INFO] Kafka Streams :: Quickstart ........................ SUCCESS [  5.474 s]
[INFO] streams-quickstart-java ............................ SUCCESS [  4.468 s]
[INFO] ------------------------------------------------------------------------
[INFO] BUILD SUCCESS
[INFO] ------------------------------------------------------------------------
[INFO] Total time:  10.544 s
[INFO] Finished at: 2023-10-31T19:49:37Z
[INFO] ------------------------------------------------------------------------
[Pipeline] dir
Running in /home/jenkins/workspace/Kafka_kafka_trunk/streams/quickstart/test-streams-archetype
[Pipeline] {
[Pipeline] sh
+ echo Y+ 
mvn archetype:generate -DarchetypeCatalog=local -DarchetypeGroupId=org.apache.kafka -DarchetypeArtifactId=streams-quickstart-java -DarchetypeVersion=3.7.0-SNAPSHOT -DgroupId=streams.examples -DartifactId=streams.examples -Dversion=0.1 -Dpackage=myapps
[INFO] Scanning for projects...
[INFO] 
[INFO] ------------------< org.apache.maven:standalone-pom >-------------------
[INFO] Building Maven Stub Project (No POM) 1
[INFO] --------------------------------[ pom ]---------------------------------
[INFO] 
[INFO] >>> archetype:3.2.1:generate (default-cli) > generate-sources @ standalone-pom >>>
[INFO] 
[INFO] <<< archetype:3.2.1:generate (default-cli) < generate-sources @ standalone-pom <<<
[INFO] 
[INFO] 
[INFO] --- archetype:3.2.1:generate (default-cli) @ standalone-pom ---
[INFO] Generating project in Interactive mode
[WARNING] Archetype not found in any catalog. Falling back to central repository.
[WARNING] Add a repository with id 'archetype' in your settings.xml if archetype's repository is elsewhere.
[INFO] Using property: groupId = streams.examples
[INFO] Using property: artifactId = streams.examples
[INFO] Using property: version = 0.1
[INFO] Using property: package = myapps
Confirm properties configuration:
groupId: streams.examples
artifactId: streams.examples
version: 0.1
package: myapps
 Y: : [INFO] ----------------------------------------------------------------------------
[INFO] Using following parameters for creating project from Archetype: streams-quickstart-java:3.7.0-SNAPSHOT
[INFO] ----------------------------------------------------------------------------
[INFO] Parameter: groupId, Value: streams.examples
[INFO] Parameter: artifactId, Value: streams.examples
[INFO] Parameter: version, Value: 0.1
[INFO] Parameter: package, Value: myapps
[INFO] Parameter: packageInPathFormat, Value: myapps
[INFO] Parameter: package, Value: myapps
[INFO] Parameter: version, Value: 0.1
[INFO] Parameter: groupId, Value: streams.examples
[INFO] Parameter: artifactId, Value: streams.examples
[INFO] Project created from Archetype in dir: /home/jenkins/workspace/Kafka_kafka_trunk/streams/quickstart/test-streams-archetype/streams.examples
[INFO] ------------------------------------------------------------------------
[INFO] BUILD SUCCESS
[INFO] ------------------------------------------------------------------------
[INFO] Total time:  2.903 s
[INFO] Finished at: 2023-10-31T19:49:45Z
[INFO] ------------------------------------------------------------------------
[Pipeline] dir
Running in /home/jenkins/workspace/Kafka_kafka_trunk/streams/quickstart/test-streams-archetype/streams.examples
[Pipeline] {
[Pipeline] sh
+ mvn compile
[INFO] Scanning for projects...
[INFO] 
[INFO] -----------------< streams.examples:streams.examples >------------------
[INFO] Building Kafka Streams Quickstart :: Java 0.1
[INFO]   from pom.xml
[INFO] --------------------------------[ jar ]---------------------------------
[INFO] 
[INFO] --- resources:3.3.1:resources (default-resources) @ streams.examples ---
[INFO] Copying 1 resource from src/main/resources to target/classes
[INFO] 
[INFO] --- compiler:3.1:compile (default-compile) @ streams.examples ---
[INFO] Changes detected - recompiling the module!
[INFO] Compiling 3 source files to /home/jenkins/workspace/Kafka_kafka_trunk/streams/quickstart/test-streams-archetype/streams.examples/target/classes
[INFO] ------------------------------------------------------------------------
[INFO] BUILD SUCCESS
[INFO] ------------------------------------------------------------------------
[INFO] Total time:  4.404 s
[INFO] Finished at: 2023-10-31T19:49:55Z
[INFO] ------------------------------------------------------------------------
[Pipeline] }
[Pipeline] // dir
[Pipeline] }
[Pipeline] // dir
[Pipeline] }
[Pipeline] // dir
[Pipeline] }
[Pipeline] // withEnv
[Pipeline] }
[Pipeline] // withEnv
[Pipeline] }
[Pipeline] // withEnv
[Pipeline] }
[Pipeline] // node
[Pipeline] }
[Pipeline] // timestamps
[Pipeline] }
[Pipeline] // timeout
[Pipeline] }
[Pipeline] // stage
[Pipeline] }
wrapper script does not seem to be touching the log file in /home/jenkins/workspace/Kafka_kafka_trunk@tmp/durable-68473dce
(JENKINS-48300: if on an extremely laggy filesystem, consider -Dorg.jenkinsci.plugins.durabletask.BourneShellScript.HEARTBEAT_CHECK_INTERVAL=86400)
[Pipeline] }
[Pipeline] // withEnv
[Pipeline] }
[Pipeline] // withEnv
[Pipeline] }
[Pipeline] // withEnv
[Pipeline] }
[Pipeline] // node
[Pipeline] }
[Pipeline] // timestamps
[Pipeline] }
[Pipeline] // timeout
[Pipeline] }
[Pipeline] // stage
[Pipeline] }
Failed in branch JDK 11 and Scala 2.13
[Pipeline] // parallel
[Pipeline] }
[Pipeline] // stage
[Pipeline] stage
[Pipeline] { (Declarative: Post Actions)
[Pipeline] script
[Pipeline] {
[Pipeline] node
Running on builds56 in /home/jenkins/jenkins-agent/workspace/Kafka_kafka_trunk
[Pipeline] {
[Pipeline] step

Build failed in Jenkins: Kafka » Kafka Branch Builder » trunk #2345

Posted by Apache Jenkins Server <je...@builds.apache.org>.
See <https://ci-builds.apache.org/job/Kafka/job/kafka/job/trunk/2345/display/redirect>

Changes:


------------------------------------------
[...truncated 321601 lines...]

Gradle Test Run :streams:test > Gradle Test Executor 88 > RocksDBMetricsRecorderTest > shouldNotRecordStatisticsBasedMetricsIfStatisticsIsNull() PASSED

Gradle Test Run :streams:test > Gradle Test Executor 88 > RocksDBMetricsRecorderTest > shouldSetStatsLevelToExceptDetailedTimersWhenValueProvidersWithStatisticsAreAdded() STARTED

Gradle Test Run :streams:test > Gradle Test Executor 88 > RocksDBMetricsRecorderTest > shouldSetStatsLevelToExceptDetailedTimersWhenValueProvidersWithStatisticsAreAdded() PASSED

Gradle Test Run :streams:test > Gradle Test Executor 88 > RocksDBMetricsRecorderTest > shouldRecordStatisticsBasedMetrics() STARTED

Gradle Test Run :streams:test > Gradle Test Executor 88 > RocksDBMetricsRecorderTest > shouldRecordStatisticsBasedMetrics() PASSED

Gradle Test Run :streams:test > Gradle Test Executor 88 > RocksDBMetricsRecorderTest > shouldThrowIfMetricRecorderIsReInitialisedWithDifferentStreamsMetrics() STARTED

Gradle Test Run :streams:test > Gradle Test Executor 88 > RocksDBMetricsRecorderTest > shouldThrowIfMetricRecorderIsReInitialisedWithDifferentStreamsMetrics() PASSED

Gradle Test Run :streams:test > Gradle Test Executor 88 > RocksDBMetricsRecorderTest > shouldInitMetricsRecorder() STARTED

Gradle Test Run :streams:test > Gradle Test Executor 88 > RocksDBMetricsRecorderTest > shouldInitMetricsRecorder() PASSED

Gradle Test Run :streams:test > Gradle Test Executor 88 > RocksDBMetricsRecorderTest > shouldThrowIfMetricRecorderIsReInitialisedWithDifferentTask() STARTED

Gradle Test Run :streams:test > Gradle Test Executor 88 > RocksDBMetricsRecorderTest > shouldThrowIfMetricRecorderIsReInitialisedWithDifferentTask() PASSED

Gradle Test Run :streams:test > Gradle Test Executor 88 > RocksDBMetricsRecorderTest > shouldCorrectlyHandleAvgRecordingsWithZeroSumAndCount() STARTED

Gradle Test Run :streams:test > Gradle Test Executor 88 > RocksDBMetricsRecorderTest > shouldCorrectlyHandleAvgRecordingsWithZeroSumAndCount() PASSED

Gradle Test Run :streams:test > Gradle Test Executor 88 > RocksDBMetricsRecorderTest > shouldThrowIfStatisticsToAddIsNullButExistingStatisticsAreNotNull() STARTED

Gradle Test Run :streams:test > Gradle Test Executor 88 > RocksDBMetricsRecorderTest > shouldThrowIfStatisticsToAddIsNullButExistingStatisticsAreNotNull() PASSED

Gradle Test Run :streams:test > Gradle Test Executor 88 > RocksDBMetricsRecorderTest > shouldNotAddItselfToRecordingTriggerWhenNotEmpty() STARTED

Gradle Test Run :streams:test > Gradle Test Executor 88 > RocksDBMetricsRecorderTest > shouldNotAddItselfToRecordingTriggerWhenNotEmpty() PASSED

Gradle Test Run :streams:test > Gradle Test Executor 103 > KStreamRepartitionIntegrationTest > [Optimization = all] > shouldGoThroughRebalancingCorrectly[Optimization = all] STARTED

Gradle Test Run :streams:test > Gradle Test Executor 102 > SlidingWindowedKStreamIntegrationTest > [ON_WINDOW_UPDATE_cache:true] > shouldRestoreAfterJoinRestart[ON_WINDOW_UPDATE_cache:true] STARTED

> Task :core:test

Gradle Test Run :core:test > Gradle Test Executor 91 > ZkMigrationIntegrationTest > testMigrateTopicDeletions(ClusterInstance) > [1] Type=ZK, MetadataVersion=3.4-IV0, Security=PLAINTEXT SKIPPED

Gradle Test Run :core:test > Gradle Test Executor 91 > ZkMigrationIntegrationTest > testMigrateTopicDeletions(ClusterInstance) > [2] Type=ZK, MetadataVersion=3.5-IV2, Security=PLAINTEXT STARTED

> Task :streams:test

Gradle Test Run :streams:test > Gradle Test Executor 102 > SlidingWindowedKStreamIntegrationTest > [ON_WINDOW_UPDATE_cache:true] > shouldRestoreAfterJoinRestart[ON_WINDOW_UPDATE_cache:true] PASSED

Gradle Test Run :streams:test > Gradle Test Executor 102 > SlidingWindowedKStreamIntegrationTest > [ON_WINDOW_UPDATE_cache:false] > shouldRestoreAfterJoinRestart[ON_WINDOW_UPDATE_cache:false] STARTED

Gradle Test Run :streams:test > Gradle Test Executor 103 > KStreamRepartitionIntegrationTest > [Optimization = all] > shouldGoThroughRebalancingCorrectly[Optimization = all] PASSED

Gradle Test Run :streams:test > Gradle Test Executor 103 > KStreamRepartitionIntegrationTest > [Optimization = none] > shouldGoThroughRebalancingCorrectly[Optimization = none] STARTED

> Task :core:test

Gradle Test Run :core:test > Gradle Test Executor 91 > ZkMigrationIntegrationTest > testMigrateTopicDeletions(ClusterInstance) > [2] Type=ZK, MetadataVersion=3.5-IV2, Security=PLAINTEXT SKIPPED

Gradle Test Run :core:test > Gradle Test Executor 91 > ZkMigrationIntegrationTest > testMigrateTopicDeletions(ClusterInstance) > [3] Type=ZK, MetadataVersion=3.6-IV2, Security=PLAINTEXT STARTED

> Task :streams:test

Gradle Test Run :streams:test > Gradle Test Executor 102 > SlidingWindowedKStreamIntegrationTest > [ON_WINDOW_UPDATE_cache:false] > shouldRestoreAfterJoinRestart[ON_WINDOW_UPDATE_cache:false] PASSED

Gradle Test Run :streams:test > Gradle Test Executor 102 > SlidingWindowedKStreamIntegrationTest > [ON_WINDOW_CLOSE_cache:true] > shouldRestoreAfterJoinRestart[ON_WINDOW_CLOSE_cache:true] STARTED

Gradle Test Run :streams:test > Gradle Test Executor 103 > KStreamRepartitionIntegrationTest > [Optimization = none] > shouldGoThroughRebalancingCorrectly[Optimization = none] PASSED

> Task :core:test

Gradle Test Run :core:test > Gradle Test Executor 91 > ZkMigrationIntegrationTest > testMigrateTopicDeletions(ClusterInstance) > [3] Type=ZK, MetadataVersion=3.6-IV2, Security=PLAINTEXT SKIPPED

Gradle Test Run :core:test > Gradle Test Executor 91 > ZkMigrationIntegrationTest > testMigrateTopicDeletions(ClusterInstance) > [4] Type=ZK, MetadataVersion=3.7-IV0, Security=PLAINTEXT STARTED

> Task :streams:test

Gradle Test Run :streams:test > Gradle Test Executor 102 > SlidingWindowedKStreamIntegrationTest > [ON_WINDOW_CLOSE_cache:true] > shouldRestoreAfterJoinRestart[ON_WINDOW_CLOSE_cache:true] PASSED

Gradle Test Run :streams:test > Gradle Test Executor 102 > SlidingWindowedKStreamIntegrationTest > [ON_WINDOW_CLOSE_cache:false] > shouldRestoreAfterJoinRestart[ON_WINDOW_CLOSE_cache:false] STARTED

> Task :core:test

Gradle Test Run :core:test > Gradle Test Executor 91 > ZkMigrationIntegrationTest > testMigrateTopicDeletions(ClusterInstance) > [4] Type=ZK, MetadataVersion=3.7-IV0, Security=PLAINTEXT SKIPPED

Gradle Test Run :core:test > Gradle Test Executor 91 > ZkMigrationIntegrationTest > testMigrateTopicDeletions(ClusterInstance) > [5] Type=ZK, MetadataVersion=3.7-IV1, Security=PLAINTEXT STARTED

> Task :streams:test

Gradle Test Run :streams:test > Gradle Test Executor 102 > SlidingWindowedKStreamIntegrationTest > [ON_WINDOW_CLOSE_cache:false] > shouldRestoreAfterJoinRestart[ON_WINDOW_CLOSE_cache:false] PASSED

7337 tests completed, 2 failed, 22 skipped
There were failing tests. See the report at: file:///home/jenkins/workspace/Kafka_kafka_trunk/streams/build/reports/tests/test/index.html

> Task :core:test

Gradle Test Run :core:test > Gradle Test Executor 91 > ZkMigrationIntegrationTest > testMigrateTopicDeletions(ClusterInstance) > [5] Type=ZK, MetadataVersion=3.7-IV1, Security=PLAINTEXT SKIPPED

Gradle Test Run :core:test > Gradle Test Executor 91 > ZkMigrationIntegrationTest > testDualWriteScram(ClusterInstance) > [1] Type=ZK, Name=testDualWriteScram, MetadataVersion=3.5-IV2, Security=PLAINTEXT STARTED

Gradle Test Run :core:test > Gradle Test Executor 91 > ZkMigrationIntegrationTest > testDualWriteScram(ClusterInstance) > [1] Type=ZK, Name=testDualWriteScram, MetadataVersion=3.5-IV2, Security=PLAINTEXT PASSED

Gradle Test Run :core:test > Gradle Test Executor 91 > ZkMigrationIntegrationTest > testNewAndChangedTopicsInDualWrite(ClusterInstance) > [1] Type=ZK, Name=testNewAndChangedTopicsInDualWrite, MetadataVersion=3.4-IV0, Security=PLAINTEXT STARTED

Gradle Test Run :core:test > Gradle Test Executor 91 > ZkMigrationIntegrationTest > testNewAndChangedTopicsInDualWrite(ClusterInstance) > [1] Type=ZK, Name=testNewAndChangedTopicsInDualWrite, MetadataVersion=3.4-IV0, Security=PLAINTEXT PASSED

Gradle Test Run :core:test > Gradle Test Executor 91 > ZkMigrationIntegrationTest > testDualWriteQuotaAndScram(ClusterInstance) > [1] Type=ZK, Name=testDualWriteQuotaAndScram, MetadataVersion=3.5-IV2, Security=PLAINTEXT STARTED

Gradle Test Run :core:test > Gradle Test Executor 91 > ZkMigrationIntegrationTest > testDualWriteQuotaAndScram(ClusterInstance) > [1] Type=ZK, Name=testDualWriteQuotaAndScram, MetadataVersion=3.5-IV2, Security=PLAINTEXT PASSED

Gradle Test Run :core:test > Gradle Test Executor 91 > ZkMigrationIntegrationTest > testMigrate(ClusterInstance) > [1] Type=ZK, Name=testMigrate, MetadataVersion=3.4-IV0, Security=PLAINTEXT STARTED

Gradle Test Run :core:test > Gradle Test Executor 91 > ZkMigrationIntegrationTest > testMigrate(ClusterInstance) > [1] Type=ZK, Name=testMigrate, MetadataVersion=3.4-IV0, Security=PLAINTEXT PASSED

Gradle Test Run :core:test > Gradle Test Executor 91 > ZkMigrationIntegrationTest > testMigrateAcls(ClusterInstance) > [1] Type=ZK, Name=testMigrateAcls, MetadataVersion=3.4-IV0, Security=PLAINTEXT STARTED

Gradle Test Run :core:test > Gradle Test Executor 91 > ZkMigrationIntegrationTest > testMigrateAcls(ClusterInstance) > [1] Type=ZK, Name=testMigrateAcls, MetadataVersion=3.4-IV0, Security=PLAINTEXT PASSED

Gradle Test Run :core:test > Gradle Test Executor 91 > ZkMigrationIntegrationTest > testStartZkBrokerWithAuthorizer(ClusterInstance) > [1] Type=ZK, Name=testStartZkBrokerWithAuthorizer, MetadataVersion=3.4-IV0, Security=PLAINTEXT STARTED

Gradle Test Run :core:test > Gradle Test Executor 91 > ZkMigrationIntegrationTest > testStartZkBrokerWithAuthorizer(ClusterInstance) > [1] Type=ZK, Name=testStartZkBrokerWithAuthorizer, MetadataVersion=3.4-IV0, Security=PLAINTEXT PASSED

Gradle Test Run :core:test > Gradle Test Executor 91 > ZkMigrationIntegrationTest > testDualWrite(ClusterInstance) > [1] Type=ZK, MetadataVersion=3.4-IV0, Security=PLAINTEXT STARTED

Gradle Test Run :core:test > Gradle Test Executor 91 > ZkMigrationIntegrationTest > testDualWrite(ClusterInstance) > [1] Type=ZK, MetadataVersion=3.4-IV0, Security=PLAINTEXT PASSED

Gradle Test Run :core:test > Gradle Test Executor 91 > ZkMigrationIntegrationTest > testDualWrite(ClusterInstance) > [2] Type=ZK, MetadataVersion=3.5-IV2, Security=PLAINTEXT STARTED

Gradle Test Run :core:test > Gradle Test Executor 91 > ZkMigrationIntegrationTest > testDualWrite(ClusterInstance) > [2] Type=ZK, MetadataVersion=3.5-IV2, Security=PLAINTEXT PASSED

Gradle Test Run :core:test > Gradle Test Executor 91 > ZkMigrationIntegrationTest > testDualWrite(ClusterInstance) > [3] Type=ZK, MetadataVersion=3.6-IV2, Security=PLAINTEXT STARTED

Gradle Test Run :core:test > Gradle Test Executor 91 > ZkMigrationIntegrationTest > testDualWrite(ClusterInstance) > [3] Type=ZK, MetadataVersion=3.6-IV2, Security=PLAINTEXT PASSED

Gradle Test Run :core:test > Gradle Test Executor 91 > ZkMigrationIntegrationTest > testDualWrite(ClusterInstance) > [4] Type=ZK, MetadataVersion=3.7-IV0, Security=PLAINTEXT STARTED

Gradle Test Run :core:test > Gradle Test Executor 91 > ZkMigrationIntegrationTest > testDualWrite(ClusterInstance) > [4] Type=ZK, MetadataVersion=3.7-IV0, Security=PLAINTEXT PASSED

Gradle Test Run :core:test > Gradle Test Executor 91 > ZkMigrationIntegrationTest > testDualWrite(ClusterInstance) > [5] Type=ZK, MetadataVersion=3.7-IV1, Security=PLAINTEXT STARTED

Gradle Test Run :core:test > Gradle Test Executor 91 > ZkMigrationIntegrationTest > testDualWrite(ClusterInstance) > [5] Type=ZK, MetadataVersion=3.7-IV1, Security=PLAINTEXT PASSED

Gradle Test Run :core:test > Gradle Test Executor 91 > ZkConfigMigrationClientTest > testScram() STARTED

Gradle Test Run :core:test > Gradle Test Executor 91 > ZkConfigMigrationClientTest > testScram() PASSED

Gradle Test Run :core:test > Gradle Test Executor 91 > ZkConfigMigrationClientTest > testMigrationBrokerConfigs() STARTED

Gradle Test Run :core:test > Gradle Test Executor 91 > ZkConfigMigrationClientTest > testMigrationBrokerConfigs() PASSED

Gradle Test Run :core:test > Gradle Test Executor 91 > ZkConfigMigrationClientTest > testMigrateClientQuotas() STARTED

Gradle Test Run :core:test > Gradle Test Executor 91 > ZkConfigMigrationClientTest > testMigrateClientQuotas() PASSED

Gradle Test Run :core:test > Gradle Test Executor 91 > ZkConfigMigrationClientTest > testWriteNewTopicConfigs() STARTED

Gradle Test Run :core:test > Gradle Test Executor 91 > ZkConfigMigrationClientTest > testWriteNewTopicConfigs() PASSED

Gradle Test Run :core:test > Gradle Test Executor 91 > ZkConfigMigrationClientTest > testDelegationTokens() STARTED

Gradle Test Run :core:test > Gradle Test Executor 91 > ZkConfigMigrationClientTest > testDelegationTokens() PASSED

Gradle Test Run :core:test > Gradle Test Executor 91 > ZkConfigMigrationClientTest > testWriteNewClientQuotas() STARTED

Gradle Test Run :core:test > Gradle Test Executor 91 > ZkConfigMigrationClientTest > testWriteNewClientQuotas() PASSED

Gradle Test Run :core:test > Gradle Test Executor 91 > ZkConfigMigrationClientTest > testWriteExistingTopicConfigs() STARTED

Gradle Test Run :core:test > Gradle Test Executor 91 > ZkConfigMigrationClientTest > testWriteExistingTopicConfigs() PASSED

Gradle Test Run :core:test > Gradle Test Executor 91 > ZkConfigMigrationClientTest > testWriteExistingClientQuotas() STARTED

Gradle Test Run :core:test > Gradle Test Executor 91 > ZkConfigMigrationClientTest > testWriteExistingClientQuotas() PASSED

Gradle Test Run :core:test > Gradle Test Executor 91 > ZkConfigMigrationClientTest > testScramAndQuotaChangesInSnapshot() STARTED

Gradle Test Run :core:test > Gradle Test Executor 91 > ZkConfigMigrationClientTest > testScramAndQuotaChangesInSnapshot() PASSED

Gradle Test Run :core:test > Gradle Test Executor 91 > VerificationGuardTest > testEqualsAndHashCode() STARTED

Gradle Test Run :core:test > Gradle Test Executor 91 > VerificationGuardTest > testEqualsAndHashCode() PASSED

Gradle Test Run :core:test > Gradle Test Executor 91 > VerificationGuardTest > testVerify() STARTED

Gradle Test Run :core:test > Gradle Test Executor 91 > VerificationGuardTest > testVerify() PASSED

Gradle Test Run :core:test > Gradle Test Executor 104 > PlaintextConsumerTest > testListTopics() STARTED

Gradle Test Run :core:test > Gradle Test Executor 105 > DelegationTokenEndToEndAuthorizationWithOwnerTest > testDescribeTokenForOtherUserPasses(String) > testDescribeTokenForOtherUserPasses(String).quorum=kraft STARTED

Gradle Test Run :core:test > Gradle Test Executor 104 > PlaintextConsumerTest > testListTopics() PASSED

Gradle Test Run :core:test > Gradle Test Executor 105 > DelegationTokenEndToEndAuthorizationWithOwnerTest > testDescribeTokenForOtherUserPasses(String) > testDescribeTokenForOtherUserPasses(String).quorum=kraft PASSED

Gradle Test Run :core:test > Gradle Test Executor 105 > DelegationTokenEndToEndAuthorizationWithOwnerTest > testDescribeTokenForOtherUserPasses(String) > testDescribeTokenForOtherUserPasses(String).quorum=zk STARTED

Gradle Test Run :core:test > Gradle Test Executor 105 > DelegationTokenEndToEndAuthorizationWithOwnerTest > testDescribeTokenForOtherUserPasses(String) > testDescribeTokenForOtherUserPasses(String).quorum=zk PASSED

5017 tests completed, 2 failed, 15 skipped
There were failing tests. See the report at: file:///home/jenkins/workspace/Kafka_kafka_trunk/core/build/reports/tests/test/index.html

Deprecated Gradle features were used in this build, making it incompatible with Gradle 9.0.

You can use '--warning-mode all' to show the individual deprecation warnings and determine if they come from your own scripts or plugins.

For more on this, please refer to https://docs.gradle.org/8.3/userguide/command_line_interface.html#sec:command_line_warnings in the Gradle documentation.

BUILD SUCCESSFUL in 3h 12m 38s
303 actionable tasks: 111 executed, 192 up-to-date

Publishing build scan...
https://ge.apache.org/s/6kajbrlljixm6


See the profiling report at: file:///home/jenkins/workspace/Kafka_kafka_trunk/build/reports/profile/profile-2023-10-31-13-37-14.html
A fine-grained performance profile is available: use the --scan option.
[Pipeline] junit
Recording test results
[Checks API] No suitable checks publisher found.
[Pipeline] echo
Skipping Kafka Streams archetype test for Java 21
[Pipeline] }
[Pipeline] // withEnv
[Pipeline] }
[Pipeline] // withEnv
[Pipeline] }
[Pipeline] // withEnv
[Pipeline] }
[Pipeline] // node
[Pipeline] }
[Pipeline] // timestamps
[Pipeline] }
[Pipeline] // timeout
[Pipeline] }
[Pipeline] // stage
[Pipeline] }
[Pipeline] // parallel
[Pipeline] }
[Pipeline] // stage
[Pipeline] stage
[Pipeline] { (Declarative: Post Actions)
[Pipeline] script
[Pipeline] {
[Pipeline] node
Still waiting to schedule task
Waiting for next available executor on ‘ubuntu’
Running on builds23 in /home/jenkins/workspace/Kafka_kafka_trunk
[Pipeline] {
[Pipeline] step

Jenkins build is unstable: Kafka » Kafka Branch Builder » trunk #2344

Posted by Apache Jenkins Server <je...@builds.apache.org>.
See <https://ci-builds.apache.org/job/Kafka/job/kafka/job/trunk/2344/display/redirect>


Build failed in Jenkins: Kafka » Kafka Branch Builder » trunk #2343

Posted by Apache Jenkins Server <je...@builds.apache.org>.
See <https://ci-builds.apache.org/job/Kafka/job/kafka/job/trunk/2343/display/redirect>

Changes:


------------------------------------------
[...truncated 436513 lines...]
Progress (1): 2.3/5.6 MB
Progress (1): 2.3/5.6 MB
Progress (1): 2.3/5.6 MB
Progress (1): 2.3/5.6 MB
Progress (1): 2.3/5.6 MB
Progress (1): 2.4/5.6 MB
Progress (1): 2.4/5.6 MB
Progress (1): 2.4/5.6 MB
Progress (1): 2.4/5.6 MB
Progress (1): 2.4/5.6 MB
Progress (1): 2.4/5.6 MB
Progress (1): 2.5/5.6 MB
Progress (1): 2.5/5.6 MB
Progress (1): 2.5/5.6 MB
Progress (1): 2.5/5.6 MB
Progress (1): 2.5/5.6 MB
Progress (1): 2.5/5.6 MB
Progress (1): 2.6/5.6 MB
Progress (1): 2.6/5.6 MB
Progress (1): 2.6/5.6 MB
Progress (1): 2.6/5.6 MB
Progress (1): 2.6/5.6 MB
Progress (1): 2.6/5.6 MB
Progress (1): 2.6/5.6 MB
Progress (1): 2.7/5.6 MB
Progress (1): 2.7/5.6 MB
Progress (1): 2.7/5.6 MB
Progress (1): 2.7/5.6 MB
Progress (1): 2.7/5.6 MB
Progress (1): 2.7/5.6 MB
Progress (1): 2.8/5.6 MB
Progress (1): 2.8/5.6 MB
Progress (1): 2.8/5.6 MB
Progress (1): 2.8/5.6 MB
Progress (1): 2.8/5.6 MB
Progress (1): 2.8/5.6 MB
Progress (1): 2.9/5.6 MB
Progress (1): 2.9/5.6 MB
Progress (1): 2.9/5.6 MB
Progress (1): 2.9/5.6 MB
Progress (1): 2.9/5.6 MB
Progress (1): 2.9/5.6 MB
Progress (1): 3.0/5.6 MB
Progress (1): 3.0/5.6 MB
Progress (1): 3.0/5.6 MB
Progress (1): 3.0/5.6 MB
Progress (1): 3.0/5.6 MB
Progress (1): 3.0/5.6 MB
Progress (1): 3.0/5.6 MB
Progress (1): 3.1/5.6 MB
Progress (1): 3.1/5.6 MB
Progress (1): 3.1/5.6 MB
Progress (1): 3.1/5.6 MB
Progress (1): 3.1/5.6 MB
Progress (1): 3.1/5.6 MB
Progress (1): 3.2/5.6 MB
Progress (1): 3.2/5.6 MB
Progress (1): 3.2/5.6 MB
Progress (1): 3.2/5.6 MB
Progress (1): 3.2/5.6 MB
Progress (1): 3.2/5.6 MB
Progress (1): 3.3/5.6 MB
Progress (1): 3.3/5.6 MB
Progress (1): 3.3/5.6 MB
Progress (1): 3.3/5.6 MB
Progress (1): 3.3/5.6 MB
Progress (1): 3.3/5.6 MB
Progress (1): 3.4/5.6 MB
Progress (1): 3.4/5.6 MB
Progress (1): 3.4/5.6 MB
Progress (1): 3.4/5.6 MB
Progress (1): 3.4/5.6 MB
Progress (1): 3.4/5.6 MB
Progress (1): 3.4/5.6 MB
Progress (1): 3.5/5.6 MB
Progress (1): 3.5/5.6 MB
Progress (1): 3.5/5.6 MB
Progress (1): 3.5/5.6 MB
Progress (1): 3.5/5.6 MB
Progress (1): 3.5/5.6 MB
Progress (1): 3.6/5.6 MB
Progress (1): 3.6/5.6 MB
Progress (1): 3.6/5.6 MB
Progress (1): 3.6/5.6 MB
Progress (1): 3.6/5.6 MB
Progress (1): 3.6/5.6 MB
Progress (1): 3.7/5.6 MB
Progress (1): 3.7/5.6 MB
Progress (1): 3.7/5.6 MB
Progress (1): 3.7/5.6 MB
Progress (1): 3.7/5.6 MB
Progress (1): 3.7/5.6 MB
Progress (1): 3.8/5.6 MB
Progress (1): 3.8/5.6 MB
Progress (1): 3.8/5.6 MB
Progress (1): 3.8/5.6 MB
Progress (1): 3.8/5.6 MB
Progress (1): 3.8/5.6 MB
Progress (1): 3.8/5.6 MB
Progress (1): 3.9/5.6 MB
Progress (1): 3.9/5.6 MB
Progress (1): 3.9/5.6 MB
Progress (1): 3.9/5.6 MB
Progress (1): 3.9/5.6 MB
Progress (1): 3.9/5.6 MB
Progress (1): 4.0/5.6 MB
Progress (1): 4.0/5.6 MB
Progress (1): 4.0/5.6 MB
Progress (1): 4.0/5.6 MB
Progress (1): 4.0/5.6 MB
Progress (1): 4.0/5.6 MB
Progress (1): 4.1/5.6 MB
Progress (1): 4.1/5.6 MB
Progress (1): 4.1/5.6 MB
Progress (1): 4.1/5.6 MB
Progress (1): 4.1/5.6 MB
Progress (1): 4.1/5.6 MB
Progress (1): 4.2/5.6 MB
Progress (1): 4.2/5.6 MB
Progress (1): 4.2/5.6 MB
Progress (1): 4.2/5.6 MB
Progress (1): 4.2/5.6 MB
Progress (1): 4.2/5.6 MB
Progress (1): 4.3/5.6 MB
Progress (1): 4.3/5.6 MB
Progress (1): 4.3/5.6 MB
Progress (1): 4.3/5.6 MB
Progress (1): 4.3/5.6 MB
Progress (1): 4.3/5.6 MB
Progress (1): 4.4/5.6 MB
Progress (1): 4.4/5.6 MB
Progress (1): 4.4/5.6 MB
Progress (1): 4.4/5.6 MB
Progress (1): 4.4/5.6 MB
Progress (1): 4.4/5.6 MB
Progress (1): 4.5/5.6 MB
Progress (1): 4.5/5.6 MB
Progress (1): 4.5/5.6 MB
Progress (1): 4.5/5.6 MB
Progress (1): 4.5/5.6 MB
Progress (1): 4.5/5.6 MB
Progress (1): 4.6/5.6 MB
Progress (1): 4.6/5.6 MB
Progress (1): 4.6/5.6 MB
Progress (1): 4.6/5.6 MB
Progress (1): 4.6/5.6 MB
Progress (1): 4.6/5.6 MB
Progress (1): 4.6/5.6 MB
Progress (1): 4.7/5.6 MB
Progress (1): 4.7/5.6 MB
Progress (1): 4.7/5.6 MB
Progress (1): 4.7/5.6 MB
Progress (1): 4.7/5.6 MB
Progress (1): 4.7/5.6 MB
Progress (1): 4.8/5.6 MB
Progress (1): 4.8/5.6 MB
Progress (1): 4.8/5.6 MB
Progress (1): 4.8/5.6 MB
Progress (1): 4.8/5.6 MB
Progress (1): 4.8/5.6 MB
Progress (1): 4.9/5.6 MB
Progress (1): 4.9/5.6 MB
Progress (1): 4.9/5.6 MB
Progress (1): 4.9/5.6 MB
Progress (1): 4.9/5.6 MB
Progress (1): 4.9/5.6 MB
Progress (1): 4.9/5.6 MB
Progress (1): 5.0/5.6 MB
Progress (1): 5.0/5.6 MB
Progress (1): 5.0/5.6 MB
Progress (1): 5.0/5.6 MB
Progress (1): 5.0/5.6 MB
Progress (1): 5.0/5.6 MB
Progress (1): 5.1/5.6 MB
Progress (1): 5.1/5.6 MB
Progress (1): 5.1/5.6 MB
Progress (1): 5.1/5.6 MB
Progress (1): 5.1/5.6 MB
Progress (1): 5.1/5.6 MB
Progress (1): 5.2/5.6 MB
Progress (1): 5.2/5.6 MB
Progress (1): 5.2/5.6 MB
Progress (1): 5.2/5.6 MB
Progress (1): 5.2/5.6 MB
Progress (1): 5.2/5.6 MB
Progress (1): 5.3/5.6 MB
Progress (1): 5.3/5.6 MB
Progress (1): 5.3/5.6 MB
Progress (1): 5.3/5.6 MB
Progress (1): 5.3/5.6 MB
Progress (1): 5.3/5.6 MB
Progress (1): 5.4/5.6 MB
Progress (1): 5.4/5.6 MB
Progress (1): 5.4/5.6 MB
Progress (1): 5.4/5.6 MB
Progress (1): 5.4/5.6 MB
Progress (1): 5.4/5.6 MB
Progress (1): 5.5/5.6 MB
Progress (1): 5.5/5.6 MB
Progress (1): 5.5/5.6 MB
Progress (1): 5.5/5.6 MB
Progress (1): 5.5/5.6 MB
Progress (1): 5.5/5.6 MB
Progress (1): 5.6/5.6 MB
Progress (1): 5.6 MB    
                    
Downloaded from central: https://repo.maven.apache.org/maven2/org/eclipse/tycho/org.eclipse.jdt.core/3.10.0.v20140604-1726/org.eclipse.jdt.core-3.10.0.v20140604-1726.jar (5.6 MB at 22 MB/s)
[INFO] Changes detected - recompiling the module!
[INFO] Compiling 3 source files to /home/jenkins/workspace/Kafka_kafka_trunk/streams/quickstart/test-streams-archetype/streams.examples/target/classes
[INFO] ------------------------------------------------------------------------
[INFO] BUILD SUCCESS
[INFO] ------------------------------------------------------------------------
[INFO] Total time:  4.509 s
[INFO] Finished at: 2023-10-31T04:27:21Z
[INFO] ------------------------------------------------------------------------
[Pipeline] }
[Pipeline] // dir
[Pipeline] }
[Pipeline] // dir
[Pipeline] }
[Pipeline] // dir
[Pipeline] }
[Pipeline] // withEnv
[Pipeline] }
[Pipeline] // withEnv
[Pipeline] }
[Pipeline] // withEnv
[Pipeline] }
[Pipeline] // node
[Pipeline] }
[Pipeline] // timestamps
[Pipeline] }
[Pipeline] // timeout
[Pipeline] }
[Pipeline] // stage
[Pipeline] }
[Pipeline] // parallel
[Pipeline] }
[Pipeline] // stage
[Pipeline] stage
[Pipeline] { (Declarative: Post Actions)
[Pipeline] script
[Pipeline] {
[Pipeline] node
Still waiting to schedule task
Waiting for next available executor on ‘ubuntu’
Running on EC2 (Jenkins Ephemeral Node User-CLI) - t3.xlarge (i-03e6a85f6e0db8e64) in /home/jenkins/workspace/Kafka_kafka_trunk
[Pipeline] {
[Pipeline] step

Jenkins build is still unstable: Kafka » Kafka Branch Builder » trunk #2342

Posted by Apache Jenkins Server <je...@builds.apache.org>.
See <https://ci-builds.apache.org/job/Kafka/job/kafka/job/trunk/2342/display/redirect>


Jenkins build is still unstable: Kafka » Kafka Branch Builder » trunk #2341

Posted by Apache Jenkins Server <je...@builds.apache.org>.
See <https://ci-builds.apache.org/job/Kafka/job/kafka/job/trunk/2341/display/redirect>


Jenkins build is unstable: Kafka » Kafka Branch Builder » trunk #2340

Posted by Apache Jenkins Server <je...@builds.apache.org>.
See <https://ci-builds.apache.org/job/Kafka/job/kafka/job/trunk/2340/display/redirect>


Build failed in Jenkins: Kafka » Kafka Branch Builder » trunk #2339

Posted by Apache Jenkins Server <je...@builds.apache.org>.
See <https://ci-builds.apache.org/job/Kafka/job/kafka/job/trunk/2339/display/redirect>

Changes:


------------------------------------------
[...truncated 215104 lines...]
Gradle Test Run :core:test > Gradle Test Executor 90 > ZkMigrationClientTest > testEmptyWrite() STARTED

Gradle Test Run :core:test > Gradle Test Executor 90 > ZkMigrationClientTest > testEmptyWrite() PASSED

Gradle Test Run :core:test > Gradle Test Executor 90 > ZkMigrationClientTest > testReadMigrateAndWriteProducerId() STARTED

Gradle Test Run :core:test > Gradle Test Executor 90 > ZkMigrationClientTest > testReadMigrateAndWriteProducerId() PASSED

Gradle Test Run :core:test > Gradle Test Executor 90 > ZkMigrationClientTest > testExistingKRaftControllerClaim() STARTED

Gradle Test Run :core:test > Gradle Test Executor 90 > ZkMigrationClientTest > testExistingKRaftControllerClaim() PASSED

Gradle Test Run :core:test > Gradle Test Executor 90 > ZkMigrationClientTest > testMigrateTopicConfigs() STARTED

Gradle Test Run :core:test > Gradle Test Executor 90 > ZkMigrationClientTest > testMigrateTopicConfigs() PASSED

Gradle Test Run :core:test > Gradle Test Executor 90 > ZkMigrationClientTest > testNonIncreasingKRaftEpoch() STARTED

Gradle Test Run :core:test > Gradle Test Executor 90 > ZkMigrationClientTest > testNonIncreasingKRaftEpoch() PASSED

Gradle Test Run :core:test > Gradle Test Executor 90 > ZkMigrationClientTest > testMigrateEmptyZk() STARTED

Gradle Test Run :core:test > Gradle Test Executor 90 > ZkMigrationClientTest > testMigrateEmptyZk() PASSED

Gradle Test Run :core:test > Gradle Test Executor 90 > ZkMigrationClientTest > testTopicAndBrokerConfigsMigrationWithSnapshots() STARTED

Gradle Test Run :core:test > Gradle Test Executor 90 > ZkMigrationClientTest > testTopicAndBrokerConfigsMigrationWithSnapshots() PASSED

Gradle Test Run :core:test > Gradle Test Executor 90 > ZkMigrationClientTest > testClaimAndReleaseExistingController() STARTED

Gradle Test Run :core:test > Gradle Test Executor 90 > ZkMigrationClientTest > testClaimAndReleaseExistingController() PASSED

Gradle Test Run :core:test > Gradle Test Executor 90 > ZkMigrationClientTest > testClaimAbsentController() STARTED

Gradle Test Run :core:test > Gradle Test Executor 90 > ZkMigrationClientTest > testClaimAbsentController() PASSED

Gradle Test Run :core:test > Gradle Test Executor 90 > ZkMigrationClientTest > testIdempotentCreateTopics() STARTED

Gradle Test Run :core:test > Gradle Test Executor 90 > ZkMigrationClientTest > testIdempotentCreateTopics() PASSED

Gradle Test Run :core:test > Gradle Test Executor 90 > ZkMigrationClientTest > testCreateNewTopic() STARTED

Gradle Test Run :core:test > Gradle Test Executor 90 > ZkMigrationClientTest > testCreateNewTopic() PASSED

Gradle Test Run :core:test > Gradle Test Executor 90 > ZkMigrationClientTest > testUpdateExistingTopicWithNewAndChangedPartitions() STARTED

Gradle Test Run :core:test > Gradle Test Executor 90 > ZkMigrationClientTest > testUpdateExistingTopicWithNewAndChangedPartitions() PASSED

Gradle Test Run :core:test > Gradle Test Executor 90 > ZooKeeperClientTest > testZNodeChangeHandlerForDataChange() STARTED

Gradle Test Run :core:test > Gradle Test Executor 90 > ZooKeeperClientTest > testZNodeChangeHandlerForDataChange() PASSED

Gradle Test Run :core:test > Gradle Test Executor 90 > ZooKeeperClientTest > testZooKeeperSessionStateMetric() STARTED

Gradle Test Run :core:test > Gradle Test Executor 90 > ZooKeeperClientTest > testZooKeeperSessionStateMetric() PASSED

Gradle Test Run :core:test > Gradle Test Executor 90 > ZooKeeperClientTest > testExceptionInBeforeInitializingSession() STARTED

Gradle Test Run :core:test > Gradle Test Executor 90 > ZooKeeperClientTest > testExceptionInBeforeInitializingSession() PASSED

Gradle Test Run :core:test > Gradle Test Executor 90 > ZooKeeperClientTest > testGetChildrenExistingZNode() STARTED

Gradle Test Run :core:test > Gradle Test Executor 90 > ZooKeeperClientTest > testGetChildrenExistingZNode() PASSED

Gradle Test Run :core:test > Gradle Test Executor 90 > ZooKeeperClientTest > testConnection() STARTED

Gradle Test Run :core:test > Gradle Test Executor 90 > ZooKeeperClientTest > testConnection() PASSED

Gradle Test Run :core:test > Gradle Test Executor 90 > ZooKeeperClientTest > testZNodeChangeHandlerForCreation() STARTED

Gradle Test Run :core:test > Gradle Test Executor 90 > ZooKeeperClientTest > testZNodeChangeHandlerForCreation() PASSED

Gradle Test Run :core:test > Gradle Test Executor 90 > ZooKeeperClientTest > testGetAclExistingZNode() STARTED

Gradle Test Run :core:test > Gradle Test Executor 90 > ZooKeeperClientTest > testGetAclExistingZNode() PASSED

Gradle Test Run :core:test > Gradle Test Executor 90 > ZooKeeperClientTest > testSessionExpiryDuringClose() STARTED

Gradle Test Run :core:test > Gradle Test Executor 90 > ZooKeeperClientTest > testSessionExpiryDuringClose() PASSED

Gradle Test Run :core:test > Gradle Test Executor 90 > ZooKeeperClientTest > testReinitializeAfterAuthFailure() STARTED

Gradle Test Run :core:test > Gradle Test Executor 90 > ZooKeeperClientTest > testReinitializeAfterAuthFailure() PASSED

Gradle Test Run :core:test > Gradle Test Executor 90 > ZooKeeperClientTest > testSetAclNonExistentZNode() STARTED

Gradle Test Run :core:test > Gradle Test Executor 90 > ZooKeeperClientTest > testSetAclNonExistentZNode() PASSED

Gradle Test Run :core:test > Gradle Test Executor 90 > ZooKeeperClientTest > testConnectionLossRequestTermination() STARTED

Gradle Test Run :core:test > Gradle Test Executor 90 > ZooKeeperClientTest > testConnectionLossRequestTermination() PASSED

Gradle Test Run :core:test > Gradle Test Executor 90 > ZooKeeperClientTest > testExistsNonExistentZNode() STARTED

Gradle Test Run :core:test > Gradle Test Executor 90 > ZooKeeperClientTest > testExistsNonExistentZNode() PASSED

Gradle Test Run :core:test > Gradle Test Executor 90 > ZooKeeperClientTest > testGetDataNonExistentZNode() STARTED

Gradle Test Run :core:test > Gradle Test Executor 90 > ZooKeeperClientTest > testGetDataNonExistentZNode() PASSED

Gradle Test Run :core:test > Gradle Test Executor 90 > ZooKeeperClientTest > testConnectionTimeout() STARTED

Gradle Test Run :core:test > Gradle Test Executor 90 > ZooKeeperClientTest > testConnectionTimeout() PASSED

Gradle Test Run :core:test > Gradle Test Executor 90 > ZooKeeperClientTest > testBlockOnRequestCompletionFromStateChangeHandler() STARTED

Gradle Test Run :core:test > Gradle Test Executor 90 > ZooKeeperClientTest > testBlockOnRequestCompletionFromStateChangeHandler() PASSED

Gradle Test Run :core:test > Gradle Test Executor 90 > ZooKeeperClientTest > testUnresolvableConnectString() STARTED

Gradle Test Run :core:test > Gradle Test Executor 90 > ZooKeeperClientTest > testUnresolvableConnectString() PASSED

Gradle Test Run :core:test > Gradle Test Executor 90 > ZooKeeperClientTest > testGetChildrenNonExistentZNode() STARTED

Gradle Test Run :core:test > Gradle Test Executor 90 > ZooKeeperClientTest > testGetChildrenNonExistentZNode() PASSED

Gradle Test Run :core:test > Gradle Test Executor 90 > ZooKeeperClientTest > testPipelinedGetData() STARTED

Gradle Test Run :core:test > Gradle Test Executor 90 > ZooKeeperClientTest > testPipelinedGetData() PASSED

Gradle Test Run :core:test > Gradle Test Executor 90 > ZooKeeperClientTest > testZNodeChildChangeHandlerForChildChange() STARTED

Gradle Test Run :core:test > Gradle Test Executor 90 > ZooKeeperClientTest > testZNodeChildChangeHandlerForChildChange() PASSED

Gradle Test Run :core:test > Gradle Test Executor 90 > ZooKeeperClientTest > testGetChildrenExistingZNodeWithChildren() STARTED

Gradle Test Run :core:test > Gradle Test Executor 90 > ZooKeeperClientTest > testGetChildrenExistingZNodeWithChildren() PASSED

Gradle Test Run :core:test > Gradle Test Executor 90 > ZooKeeperClientTest > testSetDataExistingZNode() STARTED

Gradle Test Run :core:test > Gradle Test Executor 90 > ZooKeeperClientTest > testSetDataExistingZNode() PASSED

Gradle Test Run :core:test > Gradle Test Executor 90 > ZooKeeperClientTest > testZNodeChildChangeHandlerForChildChangeNotTriggered() STARTED

Gradle Test Run :core:test > Gradle Test Executor 90 > ZooKeeperClientTest > testZNodeChildChangeHandlerForChildChangeNotTriggered() PASSED

Gradle Test Run :core:test > Gradle Test Executor 90 > ZooKeeperClientTest > testMixedPipeline() STARTED

Gradle Test Run :core:test > Gradle Test Executor 90 > ZooKeeperClientTest > testMixedPipeline() PASSED

Gradle Test Run :core:test > Gradle Test Executor 90 > ZooKeeperClientTest > testGetDataExistingZNode() STARTED

Gradle Test Run :core:test > Gradle Test Executor 90 > ZooKeeperClientTest > testGetDataExistingZNode() PASSED

Gradle Test Run :core:test > Gradle Test Executor 90 > ZooKeeperClientTest > testDeleteExistingZNode() STARTED

Gradle Test Run :core:test > Gradle Test Executor 90 > ZooKeeperClientTest > testDeleteExistingZNode() PASSED

Gradle Test Run :core:test > Gradle Test Executor 90 > ZooKeeperClientTest > testSessionExpiry() STARTED

Gradle Test Run :core:test > Gradle Test Executor 90 > ZooKeeperClientTest > testSessionExpiry() PASSED

Gradle Test Run :core:test > Gradle Test Executor 90 > ZooKeeperClientTest > testSetDataNonExistentZNode() STARTED

Gradle Test Run :core:test > Gradle Test Executor 90 > ZooKeeperClientTest > testSetDataNonExistentZNode() PASSED

Gradle Test Run :core:test > Gradle Test Executor 90 > ZooKeeperClientTest > testConnectionViaNettyClient() STARTED

Gradle Test Run :core:test > Gradle Test Executor 90 > ZooKeeperClientTest > testConnectionViaNettyClient() PASSED

Gradle Test Run :core:test > Gradle Test Executor 90 > ZooKeeperClientTest > testDeleteNonExistentZNode() STARTED

Gradle Test Run :core:test > Gradle Test Executor 90 > ZooKeeperClientTest > testDeleteNonExistentZNode() PASSED

Gradle Test Run :core:test > Gradle Test Executor 90 > ZooKeeperClientTest > testExistsExistingZNode() STARTED

Gradle Test Run :core:test > Gradle Test Executor 90 > ZooKeeperClientTest > testExistsExistingZNode() PASSED

Gradle Test Run :core:test > Gradle Test Executor 90 > ZooKeeperClientTest > testZooKeeperStateChangeRateMetrics() STARTED

Gradle Test Run :core:test > Gradle Test Executor 90 > ZooKeeperClientTest > testZooKeeperStateChangeRateMetrics() PASSED

Gradle Test Run :core:test > Gradle Test Executor 90 > ZooKeeperClientTest > testZNodeChangeHandlerForDeletion() STARTED

Gradle Test Run :core:test > Gradle Test Executor 90 > ZooKeeperClientTest > testZNodeChangeHandlerForDeletion() PASSED

Gradle Test Run :core:test > Gradle Test Executor 90 > ZooKeeperClientTest > testGetAclNonExistentZNode() STARTED

Gradle Test Run :core:test > Gradle Test Executor 90 > ZooKeeperClientTest > testGetAclNonExistentZNode() PASSED

Gradle Test Run :core:test > Gradle Test Executor 90 > ZooKeeperClientTest > testStateChangeHandlerForAuthFailure() STARTED

Gradle Test Run :core:test > Gradle Test Executor 90 > ZooKeeperClientTest > testStateChangeHandlerForAuthFailure() PASSED

Gradle Test Run :core:test > Gradle Test Executor 90 > AllocateProducerIdsRequestTest > testAllocateProducersIdSentToController() > [1] Type=Raft-Isolated, Name=testAllocateProducersIdSentToController, MetadataVersion=3.7-IV1, Security=PLAINTEXT STARTED

Gradle Test Run :core:test > Gradle Test Executor 90 > AllocateProducerIdsRequestTest > testAllocateProducersIdSentToController() > [1] Type=Raft-Isolated, Name=testAllocateProducersIdSentToController, MetadataVersion=3.7-IV1, Security=PLAINTEXT PASSED

Gradle Test Run :core:test > Gradle Test Executor 90 > AllocateProducerIdsRequestTest > testAllocateProducersIdSentToNonController() > [1] Type=Raft-Isolated, Name=testAllocateProducersIdSentToNonController, MetadataVersion=3.7-IV1, Security=PLAINTEXT STARTED

Gradle Test Run :core:test > Gradle Test Executor 90 > AllocateProducerIdsRequestTest > testAllocateProducersIdSentToNonController() > [1] Type=Raft-Isolated, Name=testAllocateProducersIdSentToNonController, MetadataVersion=3.7-IV1, Security=PLAINTEXT PASSED

Gradle Test Run :core:test > Gradle Test Executor 96 > FetchFromFollowerIntegrationTest > testRackAwareRangeAssignor(String) > testRackAwareRangeAssignor(String).quorum=zk STARTED

Gradle Test Run :core:test > Gradle Test Executor 96 > FetchFromFollowerIntegrationTest > testRackAwareRangeAssignor(String) > testRackAwareRangeAssignor(String).quorum=zk PASSED

Gradle Test Run :core:test > Gradle Test Executor 96 > FetchFromFollowerIntegrationTest > testRackAwareRangeAssignor(String) > testRackAwareRangeAssignor(String).quorum=kraft STARTED

Gradle Test Run :core:test > Gradle Test Executor 96 > FetchFromFollowerIntegrationTest > testRackAwareRangeAssignor(String) > testRackAwareRangeAssignor(String).quorum=kraft PASSED

5016 tests completed, 1 failed, 15 skipped
There were failing tests. See the report at: file:///home/jenkins/workspace/Kafka_kafka_trunk/core/build/reports/tests/test/index.html

Deprecated Gradle features were used in this build, making it incompatible with Gradle 9.0.

You can use '--warning-mode all' to show the individual deprecation warnings and determine if they come from your own scripts or plugins.

For more on this, please refer to https://docs.gradle.org/8.3/userguide/command_line_interface.html#sec:command_line_warnings in the Gradle documentation.

BUILD SUCCESSFUL in 2h 34m 49s
303 actionable tasks: 111 executed, 192 up-to-date

Publishing build scan...
https://ge.apache.org/s/ncw5h7wwblee4


See the profiling report at: file:///home/jenkins/workspace/Kafka_kafka_trunk/build/reports/profile/profile-2023-10-30-09-29-32.html
A fine-grained performance profile is available: use the --scan option.
[Pipeline] junit
Recording test results
[Checks API] No suitable checks publisher found.
[Pipeline] echo
Skipping Kafka Streams archetype test for Java 11
[Pipeline] }
[Pipeline] // withEnv
[Pipeline] }
[Pipeline] // withEnv
[Pipeline] }
[Pipeline] // withEnv
[Pipeline] }
[Pipeline] // node
[Pipeline] }
[Pipeline] // timestamps
[Pipeline] }
[Pipeline] // timeout
[Pipeline] }
[Pipeline] // stage
[Pipeline] }
[Pipeline] // parallel
[Pipeline] }
[Pipeline] // stage
[Pipeline] stage
[Pipeline] { (Declarative: Post Actions)
[Pipeline] script
[Pipeline] {
[Pipeline] node
Running on builds45 in /home/jenkins/jenkins-agent/workspace/Kafka_kafka_trunk
[Pipeline] {
[Pipeline] step

Jenkins build is unstable: Kafka » Kafka Branch Builder » trunk #2338

Posted by Apache Jenkins Server <je...@builds.apache.org>.
See <https://ci-builds.apache.org/job/Kafka/job/kafka/job/trunk/2338/display/redirect>


Build failed in Jenkins: Kafka » Kafka Branch Builder » trunk #2337

Posted by Apache Jenkins Server <je...@builds.apache.org>.
See <https://ci-builds.apache.org/job/Kafka/job/kafka/job/trunk/2337/display/redirect>

Changes:


------------------------------------------
[...truncated 337289 lines...]
> Task :connect:json:testClasses UP-TO-DATE
> Task :connect:api:jar UP-TO-DATE
> Task :connect:json:testJar
> Task :connect:api:generateMetadataFileForMavenJavaPublication
> Task :connect:json:copyDependantLibs UP-TO-DATE
> Task :connect:api:compileTestJava UP-TO-DATE
> Task :connect:api:testClasses UP-TO-DATE
> Task :connect:json:jar UP-TO-DATE
> Task :connect:json:generateMetadataFileForMavenJavaPublication
> Task :connect:api:testJar
> Task :connect:json:testSrcJar
> Task :connect:api:testSrcJar
> Task :connect:api:publishMavenJavaPublicationToMavenLocal
> Task :connect:api:publishToMavenLocal
> Task :connect:json:publishMavenJavaPublicationToMavenLocal
> Task :connect:json:publishToMavenLocal
> Task :clients:generateMetadataFileForMavenJavaPublication
> Task :core:compileScala
> Task :storage:storage-api:compileTestJava
> Task :storage:storage-api:testClasses
> Task :server-common:compileTestJava
> Task :server-common:testClasses
> Task :raft:compileTestJava
> Task :raft:testClasses
> Task :group-coordinator:compileTestJava
> Task :group-coordinator:testClasses

> Task :clients:javadoc
/home/jenkins/workspace/Kafka_kafka_trunk/clients/src/main/java/org/apache/kafka/clients/admin/ScramMechanism.java:32: warning - Tag @see: missing final '>': "<a href="https://cwiki.apache.org/confluence/display/KAFKA/KIP-554%3A+Add+Broker-side+SCRAM+Config+API">KIP-554: Add Broker-side SCRAM Config API</a>

 This code is duplicated in org.apache.kafka.common.security.scram.internals.ScramMechanism.
 The type field in both files must match and must not change. The type field
 is used both for passing ScramCredentialUpsertion and for the internal
 UserScramCredentialRecord. Do not change the type field."
/home/jenkins/workspace/Kafka_kafka_trunk/clients/src/main/java/org/apache/kafka/common/security/oauthbearer/secured/package-info.java:21: warning - Tag @link: reference not found: org.apache.kafka.common.security.oauthbearer
2 warnings

> Task :metadata:compileTestJava
> Task :metadata:testClasses
> Task :clients:javadocJar
> Task :clients:srcJar
> Task :clients:testJar
> Task :clients:testSrcJar
> Task :clients:publishMavenJavaPublicationToMavenLocal
> Task :clients:publishToMavenLocal
> Task :core:classes
> Task :core:compileTestJava NO-SOURCE
> Task :core:compileTestScala
> Task :core:testClasses
> Task :streams:compileTestJava
> Task :streams:testClasses
> Task :streams:testJar
> Task :streams:testSrcJar
> Task :streams:publishMavenJavaPublicationToMavenLocal
> Task :streams:publishToMavenLocal

Deprecated Gradle features were used in this build, making it incompatible with Gradle 9.0.

You can use '--warning-mode all' to show the individual deprecation warnings and determine if they come from your own scripts or plugins.

For more on this, please refer to https://docs.gradle.org/8.3/userguide/command_line_interface.html#sec:command_line_warnings in the Gradle documentation.

BUILD SUCCESSFUL in 7m 53s
94 actionable tasks: 41 executed, 53 up-to-date

Publishing build scan...
https://ge.apache.org/s/qbxgped4ggo4w

[Pipeline] sh
+ grep ^version= gradle.properties
+ cut -d= -f 2
[Pipeline] dir
Running in /home/jenkins/workspace/Kafka_kafka_trunk/streams/quickstart
[Pipeline] {
[Pipeline] sh
+ mvn clean install -Dgpg.skip
[INFO] Scanning for projects...
[INFO] ------------------------------------------------------------------------
[INFO] Reactor Build Order:
[INFO] 
[INFO] Kafka Streams :: Quickstart                                        [pom]
[INFO] streams-quickstart-java                                [maven-archetype]
[INFO] 
[INFO] ----------------< org.apache.kafka:streams-quickstart >-----------------
[INFO] Building Kafka Streams :: Quickstart 3.7.0-SNAPSHOT                [1/2]
[INFO]   from pom.xml
[INFO] --------------------------------[ pom ]---------------------------------
[INFO] 
[INFO] --- clean:3.0.0:clean (default-clean) @ streams-quickstart ---
[INFO] 
[INFO] --- remote-resources:1.5:process (process-resource-bundles) @ streams-quickstart ---
[INFO] 
[INFO] --- site:3.5.1:attach-descriptor (attach-descriptor) @ streams-quickstart ---
[INFO] 
[INFO] --- gpg:1.6:sign (sign-artifacts) @ streams-quickstart ---
[INFO] 
[INFO] --- install:2.5.2:install (default-install) @ streams-quickstart ---
[INFO] Installing /home/jenkins/workspace/Kafka_kafka_trunk/streams/quickstart/pom.xml to /home/jenkins/.m2/repository/org/apache/kafka/streams-quickstart/3.7.0-SNAPSHOT/streams-quickstart-3.7.0-SNAPSHOT.pom
[INFO] 
[INFO] --------------< org.apache.kafka:streams-quickstart-java >--------------
[INFO] Building streams-quickstart-java 3.7.0-SNAPSHOT                    [2/2]
[INFO]   from java/pom.xml
[INFO] --------------------------[ maven-archetype ]---------------------------
[INFO] 
[INFO] --- clean:3.0.0:clean (default-clean) @ streams-quickstart-java ---
[INFO] 
[INFO] --- remote-resources:1.5:process (process-resource-bundles) @ streams-quickstart-java ---
[INFO] 
[INFO] --- resources:2.7:resources (default-resources) @ streams-quickstart-java ---
[INFO] Using 'UTF-8' encoding to copy filtered resources.
[INFO] Copying 6 resources
[INFO] Copying 3 resources
[INFO] 
[INFO] --- resources:2.7:testResources (default-testResources) @ streams-quickstart-java ---
[INFO] Using 'UTF-8' encoding to copy filtered resources.
[INFO] Copying 2 resources
[INFO] Copying 3 resources
[INFO] 
[INFO] --- archetype:2.2:jar (default-jar) @ streams-quickstart-java ---
[INFO] Building archetype jar: /home/jenkins/workspace/Kafka_kafka_trunk/streams/quickstart/java/target/streams-quickstart-java-3.7.0-SNAPSHOT
[INFO] 
[INFO] --- site:3.5.1:attach-descriptor (attach-descriptor) @ streams-quickstart-java ---
[INFO] 
[INFO] --- archetype:2.2:integration-test (default-integration-test) @ streams-quickstart-java ---
[WARNING]  Parameter 'skip' (user property 'archetype.test.skip') is read-only, must not be used in configuration
[INFO] 
[INFO] --- gpg:1.6:sign (sign-artifacts) @ streams-quickstart-java ---
[INFO] 
[INFO] --- install:2.5.2:install (default-install) @ streams-quickstart-java ---
[INFO] Installing /home/jenkins/workspace/Kafka_kafka_trunk/streams/quickstart/java/target/streams-quickstart-java-3.7.0-SNAPSHOT.jar to /home/jenkins/.m2/repository/org/apache/kafka/streams-quickstart-java/3.7.0-SNAPSHOT/streams-quickstart-java-3.7.0-SNAPSHOT.jar
[INFO] Installing /home/jenkins/workspace/Kafka_kafka_trunk/streams/quickstart/java/pom.xml to /home/jenkins/.m2/repository/org/apache/kafka/streams-quickstart-java/3.7.0-SNAPSHOT/streams-quickstart-java-3.7.0-SNAPSHOT.pom
[INFO] 
[INFO] --- archetype:2.2:update-local-catalog (default-update-local-catalog) @ streams-quickstart-java ---
[INFO] ------------------------------------------------------------------------
[INFO] Reactor Summary for Kafka Streams :: Quickstart 3.7.0-SNAPSHOT:
[INFO] 
[INFO] Kafka Streams :: Quickstart ........................ SUCCESS [  2.975 s]
[INFO] streams-quickstart-java ............................ SUCCESS [  1.348 s]
[INFO] ------------------------------------------------------------------------
[INFO] BUILD SUCCESS
[INFO] ------------------------------------------------------------------------
[INFO] Total time:  4.847 s
[INFO] Finished at: 2023-10-28T07:08:16Z
[INFO] ------------------------------------------------------------------------
[Pipeline] dir
Running in /home/jenkins/workspace/Kafka_kafka_trunk/streams/quickstart/test-streams-archetype
[Pipeline] {
[Pipeline] sh
+ echo Y+ 
mvn archetype:generate -DarchetypeCatalog=local -DarchetypeGroupId=org.apache.kafka -DarchetypeArtifactId=streams-quickstart-java -DarchetypeVersion=3.7.0-SNAPSHOT -DgroupId=streams.examples -DartifactId=streams.examples -Dversion=0.1 -Dpackage=myapps
[INFO] Scanning for projects...
[INFO] 
[INFO] ------------------< org.apache.maven:standalone-pom >-------------------
[INFO] Building Maven Stub Project (No POM) 1
[INFO] --------------------------------[ pom ]---------------------------------
[INFO] 
[INFO] >>> archetype:3.2.1:generate (default-cli) > generate-sources @ standalone-pom >>>
[INFO] 
[INFO] <<< archetype:3.2.1:generate (default-cli) < generate-sources @ standalone-pom <<<
[INFO] 
[INFO] 
[INFO] --- archetype:3.2.1:generate (default-cli) @ standalone-pom ---
[INFO] Generating project in Interactive mode
[WARNING] Archetype not found in any catalog. Falling back to central repository.
[WARNING] Add a repository with id 'archetype' in your settings.xml if archetype's repository is elsewhere.
[INFO] Using property: groupId = streams.examples
[INFO] Using property: artifactId = streams.examples
[INFO] Using property: version = 0.1
[INFO] Using property: package = myapps
Confirm properties configuration:
groupId: streams.examples
artifactId: streams.examples
version: 0.1
package: myapps
 Y: : [INFO] ----------------------------------------------------------------------------
[INFO] Using following parameters for creating project from Archetype: streams-quickstart-java:3.7.0-SNAPSHOT
[INFO] ----------------------------------------------------------------------------
[INFO] Parameter: groupId, Value: streams.examples
[INFO] Parameter: artifactId, Value: streams.examples
[INFO] Parameter: version, Value: 0.1
[INFO] Parameter: package, Value: myapps
[INFO] Parameter: packageInPathFormat, Value: myapps
[INFO] Parameter: package, Value: myapps
[INFO] Parameter: version, Value: 0.1
[INFO] Parameter: groupId, Value: streams.examples
[INFO] Parameter: artifactId, Value: streams.examples
[INFO] Project created from Archetype in dir: /home/jenkins/workspace/Kafka_kafka_trunk/streams/quickstart/test-streams-archetype/streams.examples
[INFO] ------------------------------------------------------------------------
[INFO] BUILD SUCCESS
[INFO] ------------------------------------------------------------------------
[INFO] Total time:  3.025 s
[INFO] Finished at: 2023-10-28T07:08:24Z
[INFO] ------------------------------------------------------------------------
[Pipeline] dir
Running in /home/jenkins/workspace/Kafka_kafka_trunk/streams/quickstart/test-streams-archetype/streams.examples
[Pipeline] {
[Pipeline] sh
+ mvn compile
[INFO] Scanning for projects...
[INFO] 
[INFO] -----------------< streams.examples:streams.examples >------------------
[INFO] Building Kafka Streams Quickstart :: Java 0.1
[INFO]   from pom.xml
[INFO] --------------------------------[ jar ]---------------------------------
[INFO] 
[INFO] --- resources:3.3.1:resources (default-resources) @ streams.examples ---
[INFO] Copying 1 resource from src/main/resources to target/classes
[INFO] 
[INFO] --- compiler:3.1:compile (default-compile) @ streams.examples ---
[INFO] Changes detected - recompiling the module!
[INFO] Compiling 3 source files to /home/jenkins/workspace/Kafka_kafka_trunk/streams/quickstart/test-streams-archetype/streams.examples/target/classes
[INFO] ------------------------------------------------------------------------
[INFO] BUILD SUCCESS
[INFO] ------------------------------------------------------------------------
[INFO] Total time:  3.847 s
[INFO] Finished at: 2023-10-28T07:08:33Z
[INFO] ------------------------------------------------------------------------
[Pipeline] }
[Pipeline] // dir
[Pipeline] }
[Pipeline] // dir
[Pipeline] }
[Pipeline] // dir
[Pipeline] }
[Pipeline] // withEnv
[Pipeline] }
[Pipeline] // withEnv
[Pipeline] }
[Pipeline] // withEnv
[Pipeline] }
[Pipeline] // node
[Pipeline] }
[Pipeline] // timestamps
[Pipeline] }
[Pipeline] // timeout
[Pipeline] }
[Pipeline] // stage
[Pipeline] }
[Pipeline] // parallel
[Pipeline] }
[Pipeline] // stage
[Pipeline] stage
[Pipeline] { (Declarative: Post Actions)
[Pipeline] script
[Pipeline] {
[Pipeline] node
Running on builds35 in /home/jenkins/workspace/Kafka_kafka_trunk
[Pipeline] {
[Pipeline] step

Jenkins build is unstable: Kafka » Kafka Branch Builder » trunk #2336

Posted by Apache Jenkins Server <je...@builds.apache.org>.
See <https://ci-builds.apache.org/job/Kafka/job/kafka/job/trunk/2336/display/redirect>


Build failed in Jenkins: Kafka » Kafka Branch Builder » trunk #2335

Posted by Apache Jenkins Server <je...@builds.apache.org>.
See <https://ci-builds.apache.org/job/Kafka/job/kafka/job/trunk/2335/display/redirect>

Changes:


------------------------------------------
[...truncated 322010 lines...]

Gradle Test Run :core:test > Gradle Test Executor 95 > ZkAclMigrationClientTest > testAclsChangesInSnapshot() PASSED

Gradle Test Run :core:test > Gradle Test Executor 95 > ZkAclMigrationClientTest > testAclsMigrateAndDualWrite() STARTED

Gradle Test Run :core:test > Gradle Test Executor 95 > ZkAclMigrationClientTest > testAclsMigrateAndDualWrite() PASSED

Gradle Test Run :core:test > Gradle Test Executor 95 > ZkMigrationClientTest > testUpdateExistingPartitions() STARTED

Gradle Test Run :core:test > Gradle Test Executor 95 > ZkMigrationClientTest > testUpdateExistingPartitions() PASSED

Gradle Test Run :core:test > Gradle Test Executor 95 > ZkMigrationClientTest > testEmptyWrite() STARTED

Gradle Test Run :core:test > Gradle Test Executor 95 > ZkMigrationClientTest > testEmptyWrite() PASSED

Gradle Test Run :core:test > Gradle Test Executor 95 > ZkMigrationClientTest > testReadMigrateAndWriteProducerId() STARTED

Gradle Test Run :core:test > Gradle Test Executor 95 > ZkMigrationClientTest > testReadMigrateAndWriteProducerId() PASSED

Gradle Test Run :core:test > Gradle Test Executor 95 > ZkMigrationClientTest > testExistingKRaftControllerClaim() STARTED

Gradle Test Run :core:test > Gradle Test Executor 95 > ZkMigrationClientTest > testExistingKRaftControllerClaim() PASSED

Gradle Test Run :core:test > Gradle Test Executor 95 > ZkMigrationClientTest > testMigrateTopicConfigs() STARTED

Gradle Test Run :core:test > Gradle Test Executor 95 > ZkMigrationClientTest > testMigrateTopicConfigs() PASSED

Gradle Test Run :core:test > Gradle Test Executor 95 > ZkMigrationClientTest > testNonIncreasingKRaftEpoch() STARTED

Gradle Test Run :core:test > Gradle Test Executor 95 > ZkMigrationClientTest > testNonIncreasingKRaftEpoch() PASSED

Gradle Test Run :core:test > Gradle Test Executor 95 > ZkMigrationClientTest > testMigrateEmptyZk() STARTED

Gradle Test Run :core:test > Gradle Test Executor 95 > ZkMigrationClientTest > testMigrateEmptyZk() PASSED

Gradle Test Run :core:test > Gradle Test Executor 95 > ZkMigrationClientTest > testTopicAndBrokerConfigsMigrationWithSnapshots() STARTED

Gradle Test Run :core:test > Gradle Test Executor 95 > ZkMigrationClientTest > testTopicAndBrokerConfigsMigrationWithSnapshots() PASSED

Gradle Test Run :core:test > Gradle Test Executor 95 > ZkMigrationClientTest > testClaimAndReleaseExistingController() STARTED

Gradle Test Run :core:test > Gradle Test Executor 95 > ZkMigrationClientTest > testClaimAndReleaseExistingController() PASSED

Gradle Test Run :core:test > Gradle Test Executor 95 > ZkMigrationClientTest > testClaimAbsentController() STARTED

Gradle Test Run :core:test > Gradle Test Executor 95 > ZkMigrationClientTest > testClaimAbsentController() PASSED

Gradle Test Run :core:test > Gradle Test Executor 95 > ZkMigrationClientTest > testIdempotentCreateTopics() STARTED

Gradle Test Run :core:test > Gradle Test Executor 95 > ZkMigrationClientTest > testIdempotentCreateTopics() PASSED

Gradle Test Run :core:test > Gradle Test Executor 95 > ZkMigrationClientTest > testCreateNewTopic() STARTED

Gradle Test Run :core:test > Gradle Test Executor 95 > ZkMigrationClientTest > testCreateNewTopic() PASSED

Gradle Test Run :core:test > Gradle Test Executor 95 > ZkMigrationClientTest > testUpdateExistingTopicWithNewAndChangedPartitions() STARTED

Gradle Test Run :core:test > Gradle Test Executor 95 > ZkMigrationClientTest > testUpdateExistingTopicWithNewAndChangedPartitions() PASSED

Gradle Test Run :core:test > Gradle Test Executor 95 > ZooKeeperClientTest > testZNodeChangeHandlerForDataChange() STARTED

Gradle Test Run :core:test > Gradle Test Executor 95 > ZooKeeperClientTest > testZNodeChangeHandlerForDataChange() PASSED

Gradle Test Run :core:test > Gradle Test Executor 95 > ZooKeeperClientTest > testZooKeeperSessionStateMetric() STARTED

Gradle Test Run :core:test > Gradle Test Executor 95 > ZooKeeperClientTest > testZooKeeperSessionStateMetric() PASSED

Gradle Test Run :core:test > Gradle Test Executor 95 > ZooKeeperClientTest > testExceptionInBeforeInitializingSession() STARTED

Gradle Test Run :core:test > Gradle Test Executor 95 > ZooKeeperClientTest > testExceptionInBeforeInitializingSession() PASSED

Gradle Test Run :core:test > Gradle Test Executor 95 > ZooKeeperClientTest > testGetChildrenExistingZNode() STARTED

Gradle Test Run :core:test > Gradle Test Executor 95 > ZooKeeperClientTest > testGetChildrenExistingZNode() PASSED

Gradle Test Run :core:test > Gradle Test Executor 95 > ZooKeeperClientTest > testConnection() STARTED

Gradle Test Run :core:test > Gradle Test Executor 95 > ZooKeeperClientTest > testConnection() PASSED

Gradle Test Run :core:test > Gradle Test Executor 95 > ZooKeeperClientTest > testZNodeChangeHandlerForCreation() STARTED

Gradle Test Run :core:test > Gradle Test Executor 95 > ZooKeeperClientTest > testZNodeChangeHandlerForCreation() PASSED

Gradle Test Run :core:test > Gradle Test Executor 95 > ZooKeeperClientTest > testGetAclExistingZNode() STARTED

Gradle Test Run :core:test > Gradle Test Executor 95 > ZooKeeperClientTest > testGetAclExistingZNode() PASSED

Gradle Test Run :core:test > Gradle Test Executor 95 > ZooKeeperClientTest > testSessionExpiryDuringClose() STARTED

Gradle Test Run :core:test > Gradle Test Executor 95 > ZooKeeperClientTest > testSessionExpiryDuringClose() PASSED

Gradle Test Run :core:test > Gradle Test Executor 95 > ZooKeeperClientTest > testReinitializeAfterAuthFailure() STARTED

Gradle Test Run :core:test > Gradle Test Executor 95 > ZooKeeperClientTest > testReinitializeAfterAuthFailure() PASSED

Gradle Test Run :core:test > Gradle Test Executor 95 > ZooKeeperClientTest > testSetAclNonExistentZNode() STARTED

Gradle Test Run :core:test > Gradle Test Executor 95 > ZooKeeperClientTest > testSetAclNonExistentZNode() PASSED

Gradle Test Run :core:test > Gradle Test Executor 95 > ZooKeeperClientTest > testConnectionLossRequestTermination() STARTED

Gradle Test Run :core:test > Gradle Test Executor 95 > ZooKeeperClientTest > testConnectionLossRequestTermination() PASSED

Gradle Test Run :core:test > Gradle Test Executor 95 > ZooKeeperClientTest > testExistsNonExistentZNode() STARTED

Gradle Test Run :core:test > Gradle Test Executor 95 > ZooKeeperClientTest > testExistsNonExistentZNode() PASSED

Gradle Test Run :core:test > Gradle Test Executor 95 > ZooKeeperClientTest > testGetDataNonExistentZNode() STARTED

Gradle Test Run :core:test > Gradle Test Executor 95 > ZooKeeperClientTest > testGetDataNonExistentZNode() PASSED

Gradle Test Run :core:test > Gradle Test Executor 95 > ZooKeeperClientTest > testConnectionTimeout() STARTED

Gradle Test Run :core:test > Gradle Test Executor 95 > ZooKeeperClientTest > testConnectionTimeout() PASSED

Gradle Test Run :core:test > Gradle Test Executor 95 > ZooKeeperClientTest > testBlockOnRequestCompletionFromStateChangeHandler() STARTED

Gradle Test Run :core:test > Gradle Test Executor 95 > ZooKeeperClientTest > testBlockOnRequestCompletionFromStateChangeHandler() PASSED

Gradle Test Run :core:test > Gradle Test Executor 95 > ZooKeeperClientTest > testUnresolvableConnectString() STARTED

Gradle Test Run :core:test > Gradle Test Executor 95 > ZooKeeperClientTest > testUnresolvableConnectString() PASSED

Gradle Test Run :core:test > Gradle Test Executor 95 > ZooKeeperClientTest > testGetChildrenNonExistentZNode() STARTED

Gradle Test Run :core:test > Gradle Test Executor 95 > ZooKeeperClientTest > testGetChildrenNonExistentZNode() PASSED

Gradle Test Run :core:test > Gradle Test Executor 95 > ZooKeeperClientTest > testPipelinedGetData() STARTED

Gradle Test Run :core:test > Gradle Test Executor 95 > ZooKeeperClientTest > testPipelinedGetData() PASSED

Gradle Test Run :core:test > Gradle Test Executor 95 > ZooKeeperClientTest > testZNodeChildChangeHandlerForChildChange() STARTED

Gradle Test Run :core:test > Gradle Test Executor 95 > ZooKeeperClientTest > testZNodeChildChangeHandlerForChildChange() PASSED

Gradle Test Run :core:test > Gradle Test Executor 95 > ZooKeeperClientTest > testGetChildrenExistingZNodeWithChildren() STARTED

Gradle Test Run :core:test > Gradle Test Executor 95 > ZooKeeperClientTest > testGetChildrenExistingZNodeWithChildren() PASSED

Gradle Test Run :core:test > Gradle Test Executor 95 > ZooKeeperClientTest > testSetDataExistingZNode() STARTED

Gradle Test Run :core:test > Gradle Test Executor 95 > ZooKeeperClientTest > testSetDataExistingZNode() PASSED

Gradle Test Run :core:test > Gradle Test Executor 95 > ZooKeeperClientTest > testZNodeChildChangeHandlerForChildChangeNotTriggered() STARTED

Gradle Test Run :core:test > Gradle Test Executor 95 > ZooKeeperClientTest > testZNodeChildChangeHandlerForChildChangeNotTriggered() PASSED

Gradle Test Run :core:test > Gradle Test Executor 95 > ZooKeeperClientTest > testMixedPipeline() STARTED

Gradle Test Run :core:test > Gradle Test Executor 95 > ZooKeeperClientTest > testMixedPipeline() PASSED

Gradle Test Run :core:test > Gradle Test Executor 95 > ZooKeeperClientTest > testGetDataExistingZNode() STARTED

Gradle Test Run :core:test > Gradle Test Executor 95 > ZooKeeperClientTest > testGetDataExistingZNode() PASSED

Gradle Test Run :core:test > Gradle Test Executor 95 > ZooKeeperClientTest > testDeleteExistingZNode() STARTED

Gradle Test Run :core:test > Gradle Test Executor 95 > ZooKeeperClientTest > testDeleteExistingZNode() PASSED

Gradle Test Run :core:test > Gradle Test Executor 95 > ZooKeeperClientTest > testSessionExpiry() STARTED

Gradle Test Run :core:test > Gradle Test Executor 95 > ZooKeeperClientTest > testSessionExpiry() PASSED

Gradle Test Run :core:test > Gradle Test Executor 95 > ZooKeeperClientTest > testSetDataNonExistentZNode() STARTED

Gradle Test Run :core:test > Gradle Test Executor 95 > ZooKeeperClientTest > testSetDataNonExistentZNode() PASSED

Gradle Test Run :core:test > Gradle Test Executor 95 > ZooKeeperClientTest > testConnectionViaNettyClient() STARTED

Gradle Test Run :core:test > Gradle Test Executor 95 > ZooKeeperClientTest > testConnectionViaNettyClient() PASSED

Gradle Test Run :core:test > Gradle Test Executor 95 > ZooKeeperClientTest > testDeleteNonExistentZNode() STARTED

Gradle Test Run :core:test > Gradle Test Executor 95 > ZooKeeperClientTest > testDeleteNonExistentZNode() PASSED

Gradle Test Run :core:test > Gradle Test Executor 95 > ZooKeeperClientTest > testExistsExistingZNode() STARTED

Gradle Test Run :core:test > Gradle Test Executor 95 > ZooKeeperClientTest > testExistsExistingZNode() PASSED

Gradle Test Run :core:test > Gradle Test Executor 95 > ZooKeeperClientTest > testZooKeeperStateChangeRateMetrics() STARTED

Gradle Test Run :core:test > Gradle Test Executor 95 > ZooKeeperClientTest > testZooKeeperStateChangeRateMetrics() PASSED

Gradle Test Run :core:test > Gradle Test Executor 95 > ZooKeeperClientTest > testZNodeChangeHandlerForDeletion() STARTED

Gradle Test Run :core:test > Gradle Test Executor 95 > ZooKeeperClientTest > testZNodeChangeHandlerForDeletion() PASSED

Gradle Test Run :core:test > Gradle Test Executor 95 > ZooKeeperClientTest > testGetAclNonExistentZNode() STARTED

Gradle Test Run :core:test > Gradle Test Executor 95 > ZooKeeperClientTest > testGetAclNonExistentZNode() PASSED

Gradle Test Run :core:test > Gradle Test Executor 95 > ZooKeeperClientTest > testStateChangeHandlerForAuthFailure() STARTED

Gradle Test Run :core:test > Gradle Test Executor 95 > ZooKeeperClientTest > testStateChangeHandlerForAuthFailure() PASSED

Gradle Test Run :core:test > Gradle Test Executor 95 > AllocateProducerIdsRequestTest > testAllocateProducersIdSentToController() > [1] Type=Raft-Isolated, Name=testAllocateProducersIdSentToController, MetadataVersion=3.7-IV1, Security=PLAINTEXT STARTED

Gradle Test Run :core:test > Gradle Test Executor 95 > AllocateProducerIdsRequestTest > testAllocateProducersIdSentToController() > [1] Type=Raft-Isolated, Name=testAllocateProducersIdSentToController, MetadataVersion=3.7-IV1, Security=PLAINTEXT PASSED

Gradle Test Run :core:test > Gradle Test Executor 95 > AllocateProducerIdsRequestTest > testAllocateProducersIdSentToNonController() > [1] Type=Raft-Isolated, Name=testAllocateProducersIdSentToNonController, MetadataVersion=3.7-IV1, Security=PLAINTEXT STARTED

Gradle Test Run :core:test > Gradle Test Executor 95 > AllocateProducerIdsRequestTest > testAllocateProducersIdSentToNonController() > [1] Type=Raft-Isolated, Name=testAllocateProducersIdSentToNonController, MetadataVersion=3.7-IV1, Security=PLAINTEXT PASSED

Deprecated Gradle features were used in this build, making it incompatible with Gradle 9.0.

You can use '--warning-mode all' to show the individual deprecation warnings and determine if they come from your own scripts or plugins.

For more on this, please refer to https://docs.gradle.org/8.3/userguide/command_line_interface.html#sec:command_line_warnings in the Gradle documentation.

BUILD SUCCESSFUL in 3h 17m 59s
303 actionable tasks: 111 executed, 192 up-to-date

Publishing build scan...
https://ge.apache.org/s/5cotf7o56rr44


See the profiling report at: file:///home/jenkins/workspace/Kafka_kafka_trunk/build/reports/profile/profile-2023-10-27-17-45-34.html
A fine-grained performance profile is available: use the --scan option.
[Pipeline] junit
Recording test results
[Checks API] No suitable checks publisher found.
[Pipeline] echo
Skipping Kafka Streams archetype test for Java 21
[Pipeline] }
[Pipeline] // withEnv
[Pipeline] }
[Pipeline] // withEnv
[Pipeline] }
[Pipeline] // withEnv
[Pipeline] }
[Pipeline] // node
[Pipeline] }
[Pipeline] // timestamps
[Pipeline] }
[Pipeline] // timeout
[Pipeline] }
[Pipeline] // stage
[Pipeline] }
[Pipeline] // parallel
[Pipeline] }
[Pipeline] // stage
[Pipeline] stage
[Pipeline] { (Declarative: Post Actions)
[Pipeline] script
[Pipeline] {
[Pipeline] node
Running on builds35 in /home/jenkins/workspace/Kafka_kafka_trunk
[Pipeline] {
[Pipeline] step

Build failed in Jenkins: Kafka » Kafka Branch Builder » trunk #2334

Posted by Apache Jenkins Server <je...@builds.apache.org>.
See <https://ci-builds.apache.org/job/Kafka/job/kafka/job/trunk/2334/display/redirect>

Changes:


------------------------------------------
[...truncated 321366 lines...]
Gradle Test Run :core:test > Gradle Test Executor 92 > ZooKeeperClientTest > testZNodeChangeHandlerForDataChange() PASSED

Gradle Test Run :core:test > Gradle Test Executor 92 > ZooKeeperClientTest > testZooKeeperSessionStateMetric() STARTED

Gradle Test Run :core:test > Gradle Test Executor 92 > ZooKeeperClientTest > testZooKeeperSessionStateMetric() PASSED

Gradle Test Run :core:test > Gradle Test Executor 92 > ZooKeeperClientTest > testExceptionInBeforeInitializingSession() STARTED

Gradle Test Run :core:test > Gradle Test Executor 92 > ZooKeeperClientTest > testExceptionInBeforeInitializingSession() PASSED

Gradle Test Run :core:test > Gradle Test Executor 92 > ZooKeeperClientTest > testGetChildrenExistingZNode() STARTED

Gradle Test Run :core:test > Gradle Test Executor 92 > ZooKeeperClientTest > testGetChildrenExistingZNode() PASSED

Gradle Test Run :core:test > Gradle Test Executor 92 > ZooKeeperClientTest > testConnection() STARTED

Gradle Test Run :core:test > Gradle Test Executor 92 > ZooKeeperClientTest > testConnection() PASSED

Gradle Test Run :core:test > Gradle Test Executor 92 > ZooKeeperClientTest > testZNodeChangeHandlerForCreation() STARTED

Gradle Test Run :core:test > Gradle Test Executor 92 > ZooKeeperClientTest > testZNodeChangeHandlerForCreation() PASSED

Gradle Test Run :core:test > Gradle Test Executor 92 > ZooKeeperClientTest > testGetAclExistingZNode() STARTED

Gradle Test Run :core:test > Gradle Test Executor 92 > ZooKeeperClientTest > testGetAclExistingZNode() PASSED

Gradle Test Run :core:test > Gradle Test Executor 92 > ZooKeeperClientTest > testSessionExpiryDuringClose() STARTED

Gradle Test Run :core:test > Gradle Test Executor 92 > ZooKeeperClientTest > testSessionExpiryDuringClose() PASSED

Gradle Test Run :core:test > Gradle Test Executor 92 > ZooKeeperClientTest > testReinitializeAfterAuthFailure() STARTED

Gradle Test Run :core:test > Gradle Test Executor 92 > ZooKeeperClientTest > testReinitializeAfterAuthFailure() PASSED

Gradle Test Run :core:test > Gradle Test Executor 92 > ZooKeeperClientTest > testSetAclNonExistentZNode() STARTED

Gradle Test Run :core:test > Gradle Test Executor 92 > ZooKeeperClientTest > testSetAclNonExistentZNode() PASSED

Gradle Test Run :core:test > Gradle Test Executor 92 > ZooKeeperClientTest > testConnectionLossRequestTermination() STARTED

Gradle Test Run :core:test > Gradle Test Executor 97 > ConsumerBounceTest > testConsumptionWithBrokerFailures() PASSED

5011 tests completed, 1 failed, 13 skipped

Gradle Test Run :core:test > Gradle Test Executor 92 > ZooKeeperClientTest > testConnectionLossRequestTermination() PASSED

Gradle Test Run :core:test > Gradle Test Executor 92 > ZooKeeperClientTest > testExistsNonExistentZNode() STARTED

Gradle Test Run :core:test > Gradle Test Executor 92 > ZooKeeperClientTest > testExistsNonExistentZNode() PASSED

Gradle Test Run :core:test > Gradle Test Executor 92 > ZooKeeperClientTest > testGetDataNonExistentZNode() STARTED

Gradle Test Run :core:test > Gradle Test Executor 92 > ZooKeeperClientTest > testGetDataNonExistentZNode() PASSED

Gradle Test Run :core:test > Gradle Test Executor 92 > ZooKeeperClientTest > testConnectionTimeout() STARTED
There were failing tests. See the report at: file:///home/jenkins/jenkins-agent/workspace/Kafka_kafka_trunk/core/build/reports/tests/test/index.html

Deprecated Gradle features were used in this build, making it incompatible with Gradle 9.0.

You can use '--warning-mode all' to show the individual deprecation warnings and determine if they come from your own scripts or plugins.

For more on this, please refer to https://docs.gradle.org/8.3/userguide/command_line_interface.html#sec:command_line_warnings in the Gradle documentation.

BUILD SUCCESSFUL in 2h 35m 34s
303 actionable tasks: 111 executed, 192 up-to-date

Publishing build scan...

Gradle Test Run :core:test > Gradle Test Executor 92 > ZooKeeperClientTest > testConnectionTimeout() PASSED

Gradle Test Run :core:test > Gradle Test Executor 92 > ZooKeeperClientTest > testBlockOnRequestCompletionFromStateChangeHandler() STARTED
https://ge.apache.org/s/tugq25wwb4dde


See the profiling report at: file:///home/jenkins/jenkins-agent/workspace/Kafka_kafka_trunk/build/reports/profile/profile-2023-10-27-08-56-45.html
A fine-grained performance profile is available: use the --scan option.

Gradle Test Run :core:test > Gradle Test Executor 92 > ZooKeeperClientTest > testBlockOnRequestCompletionFromStateChangeHandler() PASSED

Gradle Test Run :core:test > Gradle Test Executor 92 > ZooKeeperClientTest > testUnresolvableConnectString() STARTED

Gradle Test Run :core:test > Gradle Test Executor 92 > ZooKeeperClientTest > testUnresolvableConnectString() PASSED

Gradle Test Run :core:test > Gradle Test Executor 92 > ZooKeeperClientTest > testGetChildrenNonExistentZNode() STARTED

Gradle Test Run :core:test > Gradle Test Executor 92 > ZooKeeperClientTest > testGetChildrenNonExistentZNode() PASSED

Gradle Test Run :core:test > Gradle Test Executor 92 > ZooKeeperClientTest > testPipelinedGetData() STARTED

Gradle Test Run :core:test > Gradle Test Executor 92 > ZooKeeperClientTest > testPipelinedGetData() PASSED

Gradle Test Run :core:test > Gradle Test Executor 92 > ZooKeeperClientTest > testZNodeChildChangeHandlerForChildChange() STARTED
[Pipeline] junit
Recording test results

Gradle Test Run :core:test > Gradle Test Executor 92 > ZooKeeperClientTest > testZNodeChildChangeHandlerForChildChange() PASSED

Gradle Test Run :core:test > Gradle Test Executor 92 > ZooKeeperClientTest > testGetChildrenExistingZNodeWithChildren() STARTED

Gradle Test Run :core:test > Gradle Test Executor 92 > ZooKeeperClientTest > testGetChildrenExistingZNodeWithChildren() PASSED

Gradle Test Run :core:test > Gradle Test Executor 92 > ZooKeeperClientTest > testSetDataExistingZNode() STARTED

Gradle Test Run :core:test > Gradle Test Executor 92 > ZooKeeperClientTest > testSetDataExistingZNode() PASSED

Gradle Test Run :core:test > Gradle Test Executor 92 > ZooKeeperClientTest > testZNodeChildChangeHandlerForChildChangeNotTriggered() STARTED

Gradle Test Run :core:test > Gradle Test Executor 92 > ZooKeeperClientTest > testZNodeChildChangeHandlerForChildChangeNotTriggered() PASSED

Gradle Test Run :core:test > Gradle Test Executor 92 > ZooKeeperClientTest > testMixedPipeline() STARTED

Gradle Test Run :core:test > Gradle Test Executor 92 > ZooKeeperClientTest > testMixedPipeline() PASSED

Gradle Test Run :core:test > Gradle Test Executor 92 > ZooKeeperClientTest > testGetDataExistingZNode() STARTED

Gradle Test Run :core:test > Gradle Test Executor 92 > ZooKeeperClientTest > testGetDataExistingZNode() PASSED

Gradle Test Run :core:test > Gradle Test Executor 92 > ZooKeeperClientTest > testDeleteExistingZNode() STARTED

Gradle Test Run :core:test > Gradle Test Executor 92 > ZooKeeperClientTest > testDeleteExistingZNode() PASSED

Gradle Test Run :core:test > Gradle Test Executor 92 > ZooKeeperClientTest > testSessionExpiry() STARTED

Gradle Test Run :core:test > Gradle Test Executor 92 > ZooKeeperClientTest > testSessionExpiry() PASSED

Gradle Test Run :core:test > Gradle Test Executor 92 > ZooKeeperClientTest > testSetDataNonExistentZNode() STARTED

Gradle Test Run :core:test > Gradle Test Executor 92 > ZooKeeperClientTest > testSetDataNonExistentZNode() PASSED

Gradle Test Run :core:test > Gradle Test Executor 92 > ZooKeeperClientTest > testConnectionViaNettyClient() STARTED

Gradle Test Run :core:test > Gradle Test Executor 92 > ZooKeeperClientTest > testConnectionViaNettyClient() PASSED

Gradle Test Run :core:test > Gradle Test Executor 92 > ZooKeeperClientTest > testDeleteNonExistentZNode() STARTED

Gradle Test Run :core:test > Gradle Test Executor 92 > ZooKeeperClientTest > testDeleteNonExistentZNode() PASSED

Gradle Test Run :core:test > Gradle Test Executor 92 > ZooKeeperClientTest > testExistsExistingZNode() STARTED

Gradle Test Run :core:test > Gradle Test Executor 92 > ZooKeeperClientTest > testExistsExistingZNode() PASSED

Gradle Test Run :core:test > Gradle Test Executor 92 > ZooKeeperClientTest > testZooKeeperStateChangeRateMetrics() STARTED

Gradle Test Run :core:test > Gradle Test Executor 92 > ZooKeeperClientTest > testZooKeeperStateChangeRateMetrics() PASSED

Gradle Test Run :core:test > Gradle Test Executor 92 > ZooKeeperClientTest > testZNodeChangeHandlerForDeletion() STARTED

Gradle Test Run :core:test > Gradle Test Executor 92 > ZooKeeperClientTest > testZNodeChangeHandlerForDeletion() PASSED

Gradle Test Run :core:test > Gradle Test Executor 92 > ZooKeeperClientTest > testGetAclNonExistentZNode() STARTED

Gradle Test Run :core:test > Gradle Test Executor 92 > ZooKeeperClientTest > testGetAclNonExistentZNode() PASSED

Gradle Test Run :core:test > Gradle Test Executor 92 > ZooKeeperClientTest > testStateChangeHandlerForAuthFailure() STARTED

Gradle Test Run :core:test > Gradle Test Executor 92 > ZooKeeperClientTest > testStateChangeHandlerForAuthFailure() PASSED

Gradle Test Run :core:test > Gradle Test Executor 92 > AllocateProducerIdsRequestTest > testAllocateProducersIdSentToController() > [1] Type=Raft-Isolated, Name=testAllocateProducersIdSentToController, MetadataVersion=3.7-IV1, Security=PLAINTEXT STARTED

Gradle Test Run :core:test > Gradle Test Executor 92 > AllocateProducerIdsRequestTest > testAllocateProducersIdSentToController() > [1] Type=Raft-Isolated, Name=testAllocateProducersIdSentToController, MetadataVersion=3.7-IV1, Security=PLAINTEXT PASSED

Gradle Test Run :core:test > Gradle Test Executor 92 > AllocateProducerIdsRequestTest > testAllocateProducersIdSentToNonController() > [1] Type=Raft-Isolated, Name=testAllocateProducersIdSentToNonController, MetadataVersion=3.7-IV1, Security=PLAINTEXT STARTED

Gradle Test Run :core:test > Gradle Test Executor 92 > AllocateProducerIdsRequestTest > testAllocateProducersIdSentToNonController() > [1] Type=Raft-Isolated, Name=testAllocateProducersIdSentToNonController, MetadataVersion=3.7-IV1, Security=PLAINTEXT PASSED
[Checks API] No suitable checks publisher found.
[Pipeline] echo
Skipping Kafka Streams archetype test for Java 17
[Pipeline] }
[Pipeline] // withEnv
[Pipeline] }
[Pipeline] // withEnv
[Pipeline] }
[Pipeline] // withEnv
[Pipeline] }
[Pipeline] // node
[Pipeline] }
[Pipeline] // timestamps
[Pipeline] }
[Pipeline] // timeout
[Pipeline] }
[Pipeline] // stage
[Pipeline] }

Gradle Test Run :core:test > Gradle Test Executor 95 > DelegationTokenEndToEndAuthorizationWithOwnerTest > testCreateTokenForOtherUserFails(String) > testCreateTokenForOtherUserFails(String).quorum=kraft STARTED

Gradle Test Run :core:test > Gradle Test Executor 95 > DelegationTokenEndToEndAuthorizationWithOwnerTest > testCreateTokenForOtherUserFails(String) > testCreateTokenForOtherUserFails(String).quorum=kraft PASSED

Gradle Test Run :core:test > Gradle Test Executor 95 > DelegationTokenEndToEndAuthorizationWithOwnerTest > testCreateTokenForOtherUserFails(String) > testCreateTokenForOtherUserFails(String).quorum=zk STARTED

Gradle Test Run :core:test > Gradle Test Executor 95 > DelegationTokenEndToEndAuthorizationWithOwnerTest > testCreateTokenForOtherUserFails(String) > testCreateTokenForOtherUserFails(String).quorum=zk PASSED

5012 tests completed, 1 failed, 13 skipped
There were failing tests. See the report at: file:///home/jenkins/workspace/Kafka_kafka_trunk/core/build/reports/tests/test/index.html

FAILURE: Build failed with an exception.

* What went wrong:
Execution failed for task ':streams:upgrade-system-tests-26:test'.
> Process 'Gradle Test Executor 9' finished with non-zero exit value 1
  This problem might be caused by incorrect test process configuration.
  For more on test execution, please refer to https://docs.gradle.org/8.3/userguide/java_testing.html#sec:test_execution in the Gradle documentation.

* Try:
> Run with --stacktrace option to get the stack trace.
> Run with --info or --debug option to get more log output.
> Get more help at https://help.gradle.org.

Deprecated Gradle features were used in this build, making it incompatible with Gradle 9.0.

You can use '--warning-mode all' to show the individual deprecation warnings and determine if they come from your own scripts or plugins.

For more on this, please refer to https://docs.gradle.org/8.3/userguide/command_line_interface.html#sec:command_line_warnings in the Gradle documentation.

BUILD FAILED in 2h 34m 18s
303 actionable tasks: 111 executed, 192 up-to-date

Publishing build scan...
https://ge.apache.org/s/etwma2y2piypy


See the profiling report at: file:///home/jenkins/workspace/Kafka_kafka_trunk/build/reports/profile/profile-2023-10-27-08-59-02.html
A fine-grained performance profile is available: use the --scan option.
[Pipeline] }
[Pipeline] // withEnv
[Pipeline] }
[Pipeline] // withEnv
[Pipeline] }
[Pipeline] // withEnv
[Pipeline] }
[Pipeline] // node
[Pipeline] }
[Pipeline] // timestamps
[Pipeline] }
[Pipeline] // timeout
[Pipeline] }
[Pipeline] // stage
[Pipeline] }
Failed in branch JDK 11 and Scala 2.13
[Pipeline] // parallel
[Pipeline] }
[Pipeline] // stage
[Pipeline] stage
[Pipeline] { (Declarative: Post Actions)
[Pipeline] script
[Pipeline] {
[Pipeline] node
Running on builds57 in /home/jenkins/jenkins-agent/workspace/Kafka_kafka_trunk
[Pipeline] {
[Pipeline] step

Build failed in Jenkins: Kafka » Kafka Branch Builder » trunk #2333

Posted by Apache Jenkins Server <je...@builds.apache.org>.
See <https://ci-builds.apache.org/job/Kafka/job/kafka/job/trunk/2333/display/redirect>

Changes:


------------------------------------------
[...truncated 322688 lines...]

Gradle Test Run :connect:runtime:test > Gradle Test Executor 47 > org.apache.kafka.connect.util.SinkUtilsTest > testValidateAndParseIntegerPartitionValue PASSED

Gradle Test Run :connect:runtime:test > Gradle Test Executor 47 > org.apache.kafka.connect.util.SinkUtilsTest > testValidateAndParseIntegerOffsetValue STARTED

Gradle Test Run :connect:runtime:test > Gradle Test Executor 47 > org.apache.kafka.connect.util.SinkUtilsTest > testValidateAndParseIntegerOffsetValue PASSED

Gradle Test Run :connect:runtime:test > Gradle Test Executor 47 > org.apache.kafka.connect.util.SinkUtilsTest > testValidateAndParseStringOffsetValue STARTED

Gradle Test Run :connect:runtime:test > Gradle Test Executor 47 > org.apache.kafka.connect.util.SinkUtilsTest > testValidateAndParseStringOffsetValue PASSED

Gradle Test Run :connect:runtime:test > Gradle Test Executor 47 > org.apache.kafka.connect.util.SinkUtilsTest > testValidateAndParseEmptyPartitionOffsetMap STARTED

Gradle Test Run :connect:runtime:test > Gradle Test Executor 47 > org.apache.kafka.connect.util.SinkUtilsTest > testValidateAndParseEmptyPartitionOffsetMap PASSED

Gradle Test Run :connect:runtime:test > Gradle Test Executor 47 > org.apache.kafka.connect.util.SinkUtilsTest > testValidateAndParseStringPartitionValue STARTED

Gradle Test Run :connect:runtime:test > Gradle Test Executor 47 > org.apache.kafka.connect.util.SinkUtilsTest > testValidateAndParseStringPartitionValue PASSED

Gradle Test Run :connect:runtime:test > Gradle Test Executor 47 > org.apache.kafka.connect.util.SinkUtilsTest > testConsumerGroupOffsetsToConnectorOffsets STARTED

Gradle Test Run :connect:runtime:test > Gradle Test Executor 47 > org.apache.kafka.connect.util.SinkUtilsTest > testConsumerGroupOffsetsToConnectorOffsets PASSED

Gradle Test Run :connect:runtime:test > Gradle Test Executor 47 > org.apache.kafka.connect.util.SinkUtilsTest > testValidateAndParseInvalidOffset STARTED

Gradle Test Run :connect:runtime:test > Gradle Test Executor 47 > org.apache.kafka.connect.util.SinkUtilsTest > testValidateAndParseInvalidOffset PASSED

Gradle Test Run :connect:runtime:test > Gradle Test Executor 47 > org.apache.kafka.connect.util.SinkUtilsTest > testNullOffset STARTED

Gradle Test Run :connect:runtime:test > Gradle Test Executor 47 > org.apache.kafka.connect.util.SinkUtilsTest > testNullOffset PASSED

Gradle Test Run :connect:runtime:test > Gradle Test Executor 47 > org.apache.kafka.connect.util.SinkUtilsTest > testNullPartition STARTED

Gradle Test Run :connect:runtime:test > Gradle Test Executor 47 > org.apache.kafka.connect.util.SinkUtilsTest > testNullPartition PASSED

Gradle Test Run :connect:runtime:test > Gradle Test Executor 47 > org.apache.kafka.connect.util.SinkUtilsTest > testNullTopic STARTED

Gradle Test Run :connect:runtime:test > Gradle Test Executor 47 > org.apache.kafka.connect.util.SinkUtilsTest > testNullTopic PASSED

Gradle Test Run :connect:runtime:test > Gradle Test Executor 47 > org.apache.kafka.connect.util.SinkUtilsTest > testValidateAndParseInvalidPartition STARTED

Gradle Test Run :connect:runtime:test > Gradle Test Executor 47 > org.apache.kafka.connect.util.SinkUtilsTest > testValidateAndParseInvalidPartition PASSED

Gradle Test Run :connect:runtime:test > Gradle Test Executor 47 > org.apache.kafka.connect.util.TopicAdminTest > verifyingTopicCleanupPolicyShouldReturnFalseWhenBrokerVersionIsUnsupported STARTED

Gradle Test Run :connect:runtime:test > Gradle Test Executor 47 > org.apache.kafka.connect.util.TopicAdminTest > verifyingTopicCleanupPolicyShouldReturnFalseWhenBrokerVersionIsUnsupported PASSED

Gradle Test Run :connect:runtime:test > Gradle Test Executor 47 > org.apache.kafka.connect.util.TopicAdminTest > shouldNotCreateTopicWhenItAlreadyExists STARTED

Gradle Test Run :connect:runtime:test > Gradle Test Executor 47 > org.apache.kafka.connect.util.TopicAdminTest > shouldNotCreateTopicWhenItAlreadyExists PASSED

Gradle Test Run :connect:runtime:test > Gradle Test Executor 47 > org.apache.kafka.connect.util.TopicAdminTest > endOffsetsShouldFailWithNonRetriableWhenUnknownErrorOccurs STARTED

Gradle Test Run :connect:runtime:test > Gradle Test Executor 47 > org.apache.kafka.connect.util.TopicAdminTest > endOffsetsShouldFailWithNonRetriableWhenUnknownErrorOccurs PASSED

Gradle Test Run :connect:runtime:test > Gradle Test Executor 47 > org.apache.kafka.connect.util.TopicAdminTest > verifyingTopicCleanupPolicyShouldFailWhenTopicHasDeleteAndCompactPolicy STARTED

Gradle Test Run :connect:runtime:test > Gradle Test Executor 47 > org.apache.kafka.connect.util.TopicAdminTest > verifyingTopicCleanupPolicyShouldFailWhenTopicHasDeleteAndCompactPolicy PASSED

Gradle Test Run :connect:runtime:test > Gradle Test Executor 47 > org.apache.kafka.connect.util.TopicAdminTest > describeTopicConfigShouldReturnEmptyMapWhenUnsupportedVersionFailure STARTED

Gradle Test Run :connect:runtime:test > Gradle Test Executor 47 > org.apache.kafka.connect.util.TopicAdminTest > describeTopicConfigShouldReturnEmptyMapWhenUnsupportedVersionFailure PASSED

Gradle Test Run :connect:runtime:test > Gradle Test Executor 47 > org.apache.kafka.connect.util.TopicAdminTest > shouldRetryWhenTopicCreateThrowsWrappedTimeoutException STARTED

Gradle Test Run :connect:runtime:test > Gradle Test Executor 47 > org.apache.kafka.connect.util.TopicAdminTest > shouldRetryWhenTopicCreateThrowsWrappedTimeoutException PASSED

Gradle Test Run :connect:runtime:test > Gradle Test Executor 47 > org.apache.kafka.connect.util.TopicAdminTest > describeTopicConfigShouldReturnTopicConfigWhenTopicExists STARTED

Gradle Test Run :connect:runtime:test > Gradle Test Executor 47 > org.apache.kafka.connect.util.TopicAdminTest > describeTopicConfigShouldReturnTopicConfigWhenTopicExists PASSED

Gradle Test Run :connect:runtime:test > Gradle Test Executor 47 > org.apache.kafka.connect.util.TopicAdminTest > retryEndOffsetsShouldRetryWhenTopicNotFound STARTED

Gradle Test Run :connect:runtime:test > Gradle Test Executor 47 > org.apache.kafka.connect.util.TopicAdminTest > retryEndOffsetsShouldRetryWhenTopicNotFound PASSED

Gradle Test Run :connect:runtime:test > Gradle Test Executor 47 > org.apache.kafka.connect.util.TopicAdminTest > createShouldReturnFalseWhenSuppliedNullTopicDescription STARTED

Gradle Test Run :connect:runtime:test > Gradle Test Executor 47 > org.apache.kafka.connect.util.TopicAdminTest > createShouldReturnFalseWhenSuppliedNullTopicDescription PASSED

Gradle Test Run :connect:runtime:test > Gradle Test Executor 47 > org.apache.kafka.connect.util.TopicAdminTest > describeShouldReturnEmptyWhenTopicDoesNotExist STARTED

Gradle Test Run :connect:runtime:test > Gradle Test Executor 47 > org.apache.kafka.connect.util.TopicAdminTest > describeShouldReturnEmptyWhenTopicDoesNotExist PASSED

Gradle Test Run :connect:runtime:test > Gradle Test Executor 47 > org.apache.kafka.connect.util.TopicAdminTest > verifyingTopicCleanupPolicyShouldReturnFalseWhenTopicAuthorizationError STARTED

Gradle Test Run :connect:runtime:test > Gradle Test Executor 47 > org.apache.kafka.connect.util.TopicAdminTest > verifyingTopicCleanupPolicyShouldReturnFalseWhenTopicAuthorizationError PASSED

Gradle Test Run :connect:runtime:test > Gradle Test Executor 47 > org.apache.kafka.connect.util.TopicAdminTest > describeTopicConfigShouldReturnEmptyMapWhenNoTopicsAreSpecified STARTED

Gradle Test Run :connect:runtime:test > Gradle Test Executor 47 > org.apache.kafka.connect.util.TopicAdminTest > describeTopicConfigShouldReturnEmptyMapWhenNoTopicsAreSpecified PASSED

Gradle Test Run :connect:runtime:test > Gradle Test Executor 47 > org.apache.kafka.connect.util.TopicAdminTest > shouldRetryCreateTopicWhenAvailableBrokersAreNotEnoughForReplicationFactor STARTED

Gradle Test Run :connect:runtime:test > Gradle Test Executor 47 > org.apache.kafka.connect.util.TopicAdminTest > shouldRetryCreateTopicWhenAvailableBrokersAreNotEnoughForReplicationFactor PASSED

Gradle Test Run :connect:runtime:test > Gradle Test Executor 47 > org.apache.kafka.connect.util.TopicAdminTest > throwsWithApiVersionMismatchOnDescribe STARTED

Gradle Test Run :connect:runtime:test > Gradle Test Executor 47 > org.apache.kafka.connect.util.TopicAdminTest > throwsWithApiVersionMismatchOnDescribe PASSED

Gradle Test Run :connect:runtime:test > Gradle Test Executor 47 > org.apache.kafka.connect.util.TopicAdminTest > returnEmptyWithApiVersionMismatchOnCreate STARTED

Gradle Test Run :connect:runtime:test > Gradle Test Executor 47 > org.apache.kafka.connect.util.TopicAdminTest > returnEmptyWithApiVersionMismatchOnCreate PASSED

Gradle Test Run :connect:runtime:test > Gradle Test Executor 47 > org.apache.kafka.connect.util.TopicAdminTest > endOffsetsShouldFailWhenAnyTopicPartitionHasError STARTED

Gradle Test Run :connect:runtime:test > Gradle Test Executor 47 > org.apache.kafka.connect.util.TopicAdminTest > endOffsetsShouldFailWhenAnyTopicPartitionHasError PASSED

Gradle Test Run :connect:runtime:test > Gradle Test Executor 47 > org.apache.kafka.connect.util.TopicAdminTest > endOffsetsShouldReturnEmptyMapWhenPartitionsSetIsNull STARTED

Gradle Test Run :connect:runtime:test > Gradle Test Executor 47 > org.apache.kafka.connect.util.TopicAdminTest > endOffsetsShouldReturnEmptyMapWhenPartitionsSetIsNull PASSED

Gradle Test Run :connect:runtime:test > Gradle Test Executor 47 > org.apache.kafka.connect.util.TopicAdminTest > shouldCreateTopicWithPartitionsWhenItDoesNotExist STARTED

Gradle Test Run :connect:runtime:test > Gradle Test Executor 47 > org.apache.kafka.connect.util.TopicAdminTest > shouldCreateTopicWithPartitionsWhenItDoesNotExist PASSED

Gradle Test Run :connect:runtime:test > Gradle Test Executor 47 > org.apache.kafka.connect.util.TopicAdminTest > endOffsetsShouldFailWithTimeoutExceptionWhenTimeoutErrorOccurs STARTED

Gradle Test Run :connect:runtime:test > Gradle Test Executor 47 > org.apache.kafka.connect.util.TopicAdminTest > endOffsetsShouldFailWithTimeoutExceptionWhenTimeoutErrorOccurs PASSED

Gradle Test Run :connect:runtime:test > Gradle Test Executor 47 > org.apache.kafka.connect.util.TopicAdminTest > throwsWithTopicAuthorizationFailureOnDescribe STARTED

Gradle Test Run :connect:runtime:test > Gradle Test Executor 47 > org.apache.kafka.connect.util.TopicAdminTest > throwsWithTopicAuthorizationFailureOnDescribe PASSED

Gradle Test Run :connect:runtime:test > Gradle Test Executor 47 > org.apache.kafka.connect.util.TopicAdminTest > verifyingGettingTopicCleanupPolicies STARTED

Gradle Test Run :connect:runtime:test > Gradle Test Executor 47 > org.apache.kafka.connect.util.TopicAdminTest > verifyingGettingTopicCleanupPolicies PASSED

Gradle Test Run :connect:runtime:test > Gradle Test Executor 47 > org.apache.kafka.connect.util.TopicAdminTest > throwsWithClusterAuthorizationFailureOnDescribe STARTED

Gradle Test Run :connect:runtime:test > Gradle Test Executor 47 > org.apache.kafka.connect.util.TopicAdminTest > throwsWithClusterAuthorizationFailureOnDescribe PASSED

Gradle Test Run :connect:runtime:test > Gradle Test Executor 47 > org.apache.kafka.connect.util.TopicAdminTest > endOffsetsShouldReturnOffsetsForOnePartition STARTED

Gradle Test Run :connect:runtime:test > Gradle Test Executor 47 > org.apache.kafka.connect.util.TopicAdminTest > endOffsetsShouldReturnOffsetsForOnePartition PASSED

Gradle Test Run :connect:runtime:test > Gradle Test Executor 47 > org.apache.kafka.connect.util.TopicAdminTest > shouldCreateOneTopicWhenProvidedMultipleDefinitionsWithSameTopicName STARTED

Gradle Test Run :connect:runtime:test > Gradle Test Executor 47 > org.apache.kafka.connect.util.TopicAdminTest > shouldCreateOneTopicWhenProvidedMultipleDefinitionsWithSameTopicName PASSED

Gradle Test Run :connect:runtime:test > Gradle Test Executor 47 > org.apache.kafka.connect.util.TopicAdminTest > describeTopicConfigShouldReturnEmptyMapWhenClusterAuthorizationFailure STARTED

Gradle Test Run :connect:runtime:test > Gradle Test Executor 47 > org.apache.kafka.connect.util.TopicAdminTest > describeTopicConfigShouldReturnEmptyMapWhenClusterAuthorizationFailure PASSED

Gradle Test Run :connect:runtime:test > Gradle Test Executor 47 > org.apache.kafka.connect.util.TopicAdminTest > returnEmptyWithClusterAuthorizationFailureOnCreate STARTED

Gradle Test Run :connect:runtime:test > Gradle Test Executor 47 > org.apache.kafka.connect.util.TopicAdminTest > returnEmptyWithClusterAuthorizationFailureOnCreate PASSED

Gradle Test Run :connect:runtime:test > Gradle Test Executor 47 > org.apache.kafka.connect.util.TopicAdminTest > shouldCreateTopicWithDefaultPartitionsAndReplicationFactorWhenItDoesNotExist STARTED

Gradle Test Run :connect:runtime:test > Gradle Test Executor 47 > org.apache.kafka.connect.util.TopicAdminTest > shouldCreateTopicWithDefaultPartitionsAndReplicationFactorWhenItDoesNotExist PASSED

Gradle Test Run :connect:runtime:test > Gradle Test Executor 47 > org.apache.kafka.connect.util.TopicAdminTest > describeShouldReturnTopicDescriptionWhenTopicExists STARTED

Gradle Test Run :connect:runtime:test > Gradle Test Executor 47 > org.apache.kafka.connect.util.TopicAdminTest > describeShouldReturnTopicDescriptionWhenTopicExists PASSED

Gradle Test Run :connect:runtime:test > Gradle Test Executor 47 > org.apache.kafka.connect.util.TopicAdminTest > describeTopicConfigShouldReturnMapWithNullValueWhenTopicDoesNotExist STARTED

Gradle Test Run :connect:runtime:test > Gradle Test Executor 47 > org.apache.kafka.connect.util.TopicAdminTest > describeTopicConfigShouldReturnMapWithNullValueWhenTopicDoesNotExist PASSED

Gradle Test Run :connect:runtime:test > Gradle Test Executor 47 > org.apache.kafka.connect.util.TopicAdminTest > retryEndOffsetsShouldWrapNonRetriableExceptionsWithConnectException STARTED

Gradle Test Run :connect:runtime:test > Gradle Test Executor 47 > org.apache.kafka.connect.util.TopicAdminTest > retryEndOffsetsShouldWrapNonRetriableExceptionsWithConnectException PASSED

Gradle Test Run :connect:runtime:test > Gradle Test Executor 47 > org.apache.kafka.connect.util.TopicAdminTest > verifyingTopicCleanupPolicyShouldFailWhenTopicHasDeletePolicy STARTED

Gradle Test Run :connect:runtime:test > Gradle Test Executor 47 > org.apache.kafka.connect.util.TopicAdminTest > verifyingTopicCleanupPolicyShouldFailWhenTopicHasDeletePolicy PASSED

Gradle Test Run :connect:runtime:test > Gradle Test Executor 47 > org.apache.kafka.connect.util.TopicAdminTest > shouldCreateTopicWithReplicationFactorWhenItDoesNotExist STARTED

Gradle Test Run :connect:runtime:test > Gradle Test Executor 47 > org.apache.kafka.connect.util.TopicAdminTest > shouldCreateTopicWithReplicationFactorWhenItDoesNotExist PASSED

Gradle Test Run :connect:runtime:test > Gradle Test Executor 47 > org.apache.kafka.connect.util.TopicAdminTest > retryEndOffsetsShouldRethrowUnknownVersionException STARTED

Gradle Test Run :connect:runtime:test > Gradle Test Executor 47 > org.apache.kafka.connect.util.TopicAdminTest > retryEndOffsetsShouldRethrowUnknownVersionException PASSED

Gradle Test Run :connect:runtime:test > Gradle Test Executor 47 > org.apache.kafka.connect.util.TopicAdminTest > endOffsetsShouldFailWithUnsupportedVersionWhenVersionUnsupportedErrorOccurs STARTED

Gradle Test Run :connect:runtime:test > Gradle Test Executor 47 > org.apache.kafka.connect.util.TopicAdminTest > endOffsetsShouldFailWithUnsupportedVersionWhenVersionUnsupportedErrorOccurs PASSED

Gradle Test Run :connect:runtime:test > Gradle Test Executor 47 > org.apache.kafka.connect.util.TopicAdminTest > returnEmptyWithTopicAuthorizationFailureOnCreate STARTED

Gradle Test Run :connect:runtime:test > Gradle Test Executor 47 > org.apache.kafka.connect.util.TopicAdminTest > returnEmptyWithTopicAuthorizationFailureOnCreate PASSED

Gradle Test Run :connect:runtime:test > Gradle Test Executor 47 > org.apache.kafka.connect.util.TopicAdminTest > endOffsetsShouldReturnOffsetsForMultiplePartitions STARTED

Gradle Test Run :connect:runtime:test > Gradle Test Executor 47 > org.apache.kafka.connect.util.TopicAdminTest > endOffsetsShouldReturnOffsetsForMultiplePartitions PASSED

Gradle Test Run :connect:runtime:test > Gradle Test Executor 47 > org.apache.kafka.connect.util.TopicAdminTest > verifyingTopicCleanupPolicyShouldReturnFalseWhenClusterAuthorizationError STARTED

Gradle Test Run :connect:runtime:test > Gradle Test Executor 47 > org.apache.kafka.connect.util.TopicAdminTest > verifyingTopicCleanupPolicyShouldReturnFalseWhenClusterAuthorizationError PASSED

Gradle Test Run :connect:runtime:test > Gradle Test Executor 47 > org.apache.kafka.connect.util.TopicAdminTest > describeTopicConfigShouldReturnEmptyMapWhenTopicAuthorizationFailure STARTED

Gradle Test Run :connect:runtime:test > Gradle Test Executor 47 > org.apache.kafka.connect.util.TopicAdminTest > describeTopicConfigShouldReturnEmptyMapWhenTopicAuthorizationFailure PASSED

Gradle Test Run :connect:runtime:test > Gradle Test Executor 47 > org.apache.kafka.connect.util.TopicAdminTest > verifyingTopicCleanupPolicyShouldReturnTrueWhenTopicHasCorrectPolicy STARTED

Gradle Test Run :connect:runtime:test > Gradle Test Executor 47 > org.apache.kafka.connect.util.TopicAdminTest > verifyingTopicCleanupPolicyShouldReturnTrueWhenTopicHasCorrectPolicy PASSED

Gradle Test Run :connect:runtime:test > Gradle Test Executor 47 > org.apache.kafka.connect.util.TopicAdminTest > endOffsetsShouldFailWithNonRetriableWhenAuthorizationFailureOccurs STARTED

Gradle Test Run :connect:runtime:test > Gradle Test Executor 47 > org.apache.kafka.connect.util.TopicAdminTest > endOffsetsShouldFailWithNonRetriableWhenAuthorizationFailureOccurs PASSED

Deprecated Gradle features were used in this build, making it incompatible with Gradle 9.0.

You can use '--warning-mode all' to show the individual deprecation warnings and determine if they come from your own scripts or plugins.

For more on this, please refer to https://docs.gradle.org/8.3/userguide/command_line_interface.html#sec:command_line_warnings in the Gradle documentation.

BUILD SUCCESSFUL in 2h 41m 15s
303 actionable tasks: 111 executed, 192 up-to-date

Publishing build scan...
https://ge.apache.org/s/cmcwvaklqcfkc


See the profiling report at: file:///home/jenkins/jenkins-agent/712657a4/workspace/Kafka_kafka_trunk/build/reports/profile/profile-2023-10-27-02-14-05.html
A fine-grained performance profile is available: use the --scan option.
[Pipeline] junit
Recording test results
[Checks API] No suitable checks publisher found.
[Pipeline] echo
Skipping Kafka Streams archetype test for Java 21
[Pipeline] }
[Pipeline] // withEnv
[Pipeline] }
[Pipeline] // withEnv
[Pipeline] }
[Pipeline] // withEnv
[Pipeline] }
[Pipeline] // node
[Pipeline] }
[Pipeline] // timestamps
[Pipeline] }
[Pipeline] // timeout
[Pipeline] }
[Pipeline] // stage
[Pipeline] }
[Pipeline] // parallel
[Pipeline] }
[Pipeline] // stage
[Pipeline] stage
[Pipeline] { (Declarative: Post Actions)
[Pipeline] script
[Pipeline] {
[Pipeline] node
Running on builds57 in /home/jenkins/jenkins-agent/workspace/Kafka_kafka_trunk
[Pipeline] {
[Pipeline] step

Build failed in Jenkins: Kafka » Kafka Branch Builder » trunk #2332

Posted by Apache Jenkins Server <je...@builds.apache.org>.
See <https://ci-builds.apache.org/job/Kafka/job/kafka/job/trunk/2332/display/redirect>

Changes:


------------------------------------------
[...truncated 319922 lines...]
Gradle Test Run :core:test > Gradle Test Executor 93 > ZkMigrationClientTest > testEmptyWrite() STARTED

Gradle Test Run :core:test > Gradle Test Executor 93 > ZkMigrationClientTest > testEmptyWrite() PASSED

Gradle Test Run :core:test > Gradle Test Executor 93 > ZkMigrationClientTest > testReadMigrateAndWriteProducerId() STARTED

Gradle Test Run :core:test > Gradle Test Executor 93 > ZkMigrationClientTest > testReadMigrateAndWriteProducerId() PASSED

Gradle Test Run :core:test > Gradle Test Executor 93 > ZkMigrationClientTest > testExistingKRaftControllerClaim() STARTED

Gradle Test Run :core:test > Gradle Test Executor 93 > ZkMigrationClientTest > testExistingKRaftControllerClaim() PASSED

Gradle Test Run :core:test > Gradle Test Executor 93 > ZkMigrationClientTest > testMigrateTopicConfigs() STARTED

Gradle Test Run :core:test > Gradle Test Executor 93 > ZkMigrationClientTest > testMigrateTopicConfigs() PASSED

Gradle Test Run :core:test > Gradle Test Executor 93 > ZkMigrationClientTest > testNonIncreasingKRaftEpoch() STARTED

Gradle Test Run :core:test > Gradle Test Executor 93 > ZkMigrationClientTest > testNonIncreasingKRaftEpoch() PASSED

Gradle Test Run :core:test > Gradle Test Executor 93 > ZkMigrationClientTest > testMigrateEmptyZk() STARTED

Gradle Test Run :core:test > Gradle Test Executor 93 > ZkMigrationClientTest > testMigrateEmptyZk() PASSED

Gradle Test Run :core:test > Gradle Test Executor 93 > ZkMigrationClientTest > testTopicAndBrokerConfigsMigrationWithSnapshots() STARTED

Gradle Test Run :core:test > Gradle Test Executor 93 > ZkMigrationClientTest > testTopicAndBrokerConfigsMigrationWithSnapshots() PASSED

Gradle Test Run :core:test > Gradle Test Executor 93 > ZkMigrationClientTest > testClaimAndReleaseExistingController() STARTED

Gradle Test Run :core:test > Gradle Test Executor 93 > ZkMigrationClientTest > testClaimAndReleaseExistingController() PASSED

Gradle Test Run :core:test > Gradle Test Executor 93 > ZkMigrationClientTest > testClaimAbsentController() STARTED

Gradle Test Run :core:test > Gradle Test Executor 93 > ZkMigrationClientTest > testClaimAbsentController() PASSED

Gradle Test Run :core:test > Gradle Test Executor 93 > ZkMigrationClientTest > testIdempotentCreateTopics() STARTED

Gradle Test Run :core:test > Gradle Test Executor 93 > ZkMigrationClientTest > testIdempotentCreateTopics() PASSED

Gradle Test Run :core:test > Gradle Test Executor 93 > ZkMigrationClientTest > testCreateNewTopic() STARTED

Gradle Test Run :core:test > Gradle Test Executor 93 > ZkMigrationClientTest > testCreateNewTopic() PASSED

Gradle Test Run :core:test > Gradle Test Executor 93 > ZkMigrationClientTest > testUpdateExistingTopicWithNewAndChangedPartitions() STARTED

Gradle Test Run :core:test > Gradle Test Executor 93 > ZkMigrationClientTest > testUpdateExistingTopicWithNewAndChangedPartitions() PASSED

Gradle Test Run :core:test > Gradle Test Executor 93 > ZooKeeperClientTest > testZNodeChangeHandlerForDataChange() STARTED

Gradle Test Run :core:test > Gradle Test Executor 93 > ZooKeeperClientTest > testZNodeChangeHandlerForDataChange() PASSED

Gradle Test Run :core:test > Gradle Test Executor 93 > ZooKeeperClientTest > testZooKeeperSessionStateMetric() STARTED

Gradle Test Run :core:test > Gradle Test Executor 93 > ZooKeeperClientTest > testZooKeeperSessionStateMetric() PASSED

Gradle Test Run :core:test > Gradle Test Executor 93 > ZooKeeperClientTest > testExceptionInBeforeInitializingSession() STARTED

Gradle Test Run :core:test > Gradle Test Executor 93 > ZooKeeperClientTest > testExceptionInBeforeInitializingSession() PASSED

Gradle Test Run :core:test > Gradle Test Executor 93 > ZooKeeperClientTest > testGetChildrenExistingZNode() STARTED

Gradle Test Run :core:test > Gradle Test Executor 93 > ZooKeeperClientTest > testGetChildrenExistingZNode() PASSED

Gradle Test Run :core:test > Gradle Test Executor 93 > ZooKeeperClientTest > testConnection() STARTED

Gradle Test Run :core:test > Gradle Test Executor 93 > ZooKeeperClientTest > testConnection() PASSED

Gradle Test Run :core:test > Gradle Test Executor 93 > ZooKeeperClientTest > testZNodeChangeHandlerForCreation() STARTED

Gradle Test Run :core:test > Gradle Test Executor 93 > ZooKeeperClientTest > testZNodeChangeHandlerForCreation() PASSED

Gradle Test Run :core:test > Gradle Test Executor 93 > ZooKeeperClientTest > testGetAclExistingZNode() STARTED

Gradle Test Run :core:test > Gradle Test Executor 93 > ZooKeeperClientTest > testGetAclExistingZNode() PASSED

Gradle Test Run :core:test > Gradle Test Executor 93 > ZooKeeperClientTest > testSessionExpiryDuringClose() STARTED

Gradle Test Run :core:test > Gradle Test Executor 93 > ZooKeeperClientTest > testSessionExpiryDuringClose() PASSED

Gradle Test Run :core:test > Gradle Test Executor 93 > ZooKeeperClientTest > testReinitializeAfterAuthFailure() STARTED

Gradle Test Run :core:test > Gradle Test Executor 93 > ZooKeeperClientTest > testReinitializeAfterAuthFailure() PASSED

Gradle Test Run :core:test > Gradle Test Executor 93 > ZooKeeperClientTest > testSetAclNonExistentZNode() STARTED

Gradle Test Run :core:test > Gradle Test Executor 93 > ZooKeeperClientTest > testSetAclNonExistentZNode() PASSED

Gradle Test Run :core:test > Gradle Test Executor 93 > ZooKeeperClientTest > testConnectionLossRequestTermination() STARTED

Gradle Test Run :core:test > Gradle Test Executor 93 > ZooKeeperClientTest > testConnectionLossRequestTermination() PASSED

Gradle Test Run :core:test > Gradle Test Executor 93 > ZooKeeperClientTest > testExistsNonExistentZNode() STARTED

Gradle Test Run :core:test > Gradle Test Executor 93 > ZooKeeperClientTest > testExistsNonExistentZNode() PASSED

Gradle Test Run :core:test > Gradle Test Executor 93 > ZooKeeperClientTest > testGetDataNonExistentZNode() STARTED

Gradle Test Run :core:test > Gradle Test Executor 93 > ZooKeeperClientTest > testGetDataNonExistentZNode() PASSED

Gradle Test Run :core:test > Gradle Test Executor 93 > ZooKeeperClientTest > testConnectionTimeout() STARTED

Gradle Test Run :core:test > Gradle Test Executor 93 > ZooKeeperClientTest > testConnectionTimeout() PASSED

Gradle Test Run :core:test > Gradle Test Executor 93 > ZooKeeperClientTest > testBlockOnRequestCompletionFromStateChangeHandler() STARTED

Gradle Test Run :core:test > Gradle Test Executor 93 > ZooKeeperClientTest > testBlockOnRequestCompletionFromStateChangeHandler() PASSED

Gradle Test Run :core:test > Gradle Test Executor 93 > ZooKeeperClientTest > testUnresolvableConnectString() STARTED

Gradle Test Run :core:test > Gradle Test Executor 93 > ZooKeeperClientTest > testUnresolvableConnectString() PASSED

Gradle Test Run :core:test > Gradle Test Executor 93 > ZooKeeperClientTest > testGetChildrenNonExistentZNode() STARTED

Gradle Test Run :core:test > Gradle Test Executor 93 > ZooKeeperClientTest > testGetChildrenNonExistentZNode() PASSED

Gradle Test Run :core:test > Gradle Test Executor 93 > ZooKeeperClientTest > testPipelinedGetData() STARTED

Gradle Test Run :core:test > Gradle Test Executor 93 > ZooKeeperClientTest > testPipelinedGetData() PASSED

Gradle Test Run :core:test > Gradle Test Executor 93 > ZooKeeperClientTest > testZNodeChildChangeHandlerForChildChange() STARTED

Gradle Test Run :core:test > Gradle Test Executor 93 > ZooKeeperClientTest > testZNodeChildChangeHandlerForChildChange() PASSED

Gradle Test Run :core:test > Gradle Test Executor 93 > ZooKeeperClientTest > testGetChildrenExistingZNodeWithChildren() STARTED

Gradle Test Run :core:test > Gradle Test Executor 93 > ZooKeeperClientTest > testGetChildrenExistingZNodeWithChildren() PASSED

Gradle Test Run :core:test > Gradle Test Executor 93 > ZooKeeperClientTest > testSetDataExistingZNode() STARTED

Gradle Test Run :core:test > Gradle Test Executor 93 > ZooKeeperClientTest > testSetDataExistingZNode() PASSED

Gradle Test Run :core:test > Gradle Test Executor 93 > ZooKeeperClientTest > testZNodeChildChangeHandlerForChildChangeNotTriggered() STARTED

Gradle Test Run :core:test > Gradle Test Executor 93 > ZooKeeperClientTest > testZNodeChildChangeHandlerForChildChangeNotTriggered() PASSED

Gradle Test Run :core:test > Gradle Test Executor 93 > ZooKeeperClientTest > testMixedPipeline() STARTED

Gradle Test Run :core:test > Gradle Test Executor 93 > ZooKeeperClientTest > testMixedPipeline() PASSED

Gradle Test Run :core:test > Gradle Test Executor 93 > ZooKeeperClientTest > testGetDataExistingZNode() STARTED

Gradle Test Run :core:test > Gradle Test Executor 93 > ZooKeeperClientTest > testGetDataExistingZNode() PASSED

Gradle Test Run :core:test > Gradle Test Executor 93 > ZooKeeperClientTest > testDeleteExistingZNode() STARTED

Gradle Test Run :core:test > Gradle Test Executor 93 > ZooKeeperClientTest > testDeleteExistingZNode() PASSED

Gradle Test Run :core:test > Gradle Test Executor 93 > ZooKeeperClientTest > testSessionExpiry() STARTED

Gradle Test Run :core:test > Gradle Test Executor 93 > ZooKeeperClientTest > testSessionExpiry() PASSED

Gradle Test Run :core:test > Gradle Test Executor 93 > ZooKeeperClientTest > testSetDataNonExistentZNode() STARTED

Gradle Test Run :core:test > Gradle Test Executor 93 > ZooKeeperClientTest > testSetDataNonExistentZNode() PASSED

Gradle Test Run :core:test > Gradle Test Executor 93 > ZooKeeperClientTest > testConnectionViaNettyClient() STARTED

Gradle Test Run :core:test > Gradle Test Executor 93 > ZooKeeperClientTest > testConnectionViaNettyClient() PASSED

Gradle Test Run :core:test > Gradle Test Executor 93 > ZooKeeperClientTest > testDeleteNonExistentZNode() STARTED

Gradle Test Run :core:test > Gradle Test Executor 93 > ZooKeeperClientTest > testDeleteNonExistentZNode() PASSED

Gradle Test Run :core:test > Gradle Test Executor 93 > ZooKeeperClientTest > testExistsExistingZNode() STARTED

Gradle Test Run :core:test > Gradle Test Executor 93 > ZooKeeperClientTest > testExistsExistingZNode() PASSED

Gradle Test Run :core:test > Gradle Test Executor 93 > ZooKeeperClientTest > testZooKeeperStateChangeRateMetrics() STARTED

Gradle Test Run :core:test > Gradle Test Executor 93 > ZooKeeperClientTest > testZooKeeperStateChangeRateMetrics() PASSED

Gradle Test Run :core:test > Gradle Test Executor 93 > ZooKeeperClientTest > testZNodeChangeHandlerForDeletion() STARTED

Gradle Test Run :core:test > Gradle Test Executor 93 > ZooKeeperClientTest > testZNodeChangeHandlerForDeletion() PASSED

Gradle Test Run :core:test > Gradle Test Executor 93 > ZooKeeperClientTest > testGetAclNonExistentZNode() STARTED

Gradle Test Run :core:test > Gradle Test Executor 93 > ZooKeeperClientTest > testGetAclNonExistentZNode() PASSED

Gradle Test Run :core:test > Gradle Test Executor 93 > ZooKeeperClientTest > testStateChangeHandlerForAuthFailure() STARTED

Gradle Test Run :core:test > Gradle Test Executor 93 > ZooKeeperClientTest > testStateChangeHandlerForAuthFailure() PASSED

Gradle Test Run :core:test > Gradle Test Executor 93 > AllocateProducerIdsRequestTest > testAllocateProducersIdSentToController() > [1] Type=Raft-Isolated, Name=testAllocateProducersIdSentToController, MetadataVersion=3.7-IV1, Security=PLAINTEXT STARTED

Gradle Test Run :core:test > Gradle Test Executor 93 > AllocateProducerIdsRequestTest > testAllocateProducersIdSentToController() > [1] Type=Raft-Isolated, Name=testAllocateProducersIdSentToController, MetadataVersion=3.7-IV1, Security=PLAINTEXT PASSED

Gradle Test Run :core:test > Gradle Test Executor 93 > AllocateProducerIdsRequestTest > testAllocateProducersIdSentToNonController() > [1] Type=Raft-Isolated, Name=testAllocateProducersIdSentToNonController, MetadataVersion=3.7-IV1, Security=PLAINTEXT STARTED

Gradle Test Run :core:test > Gradle Test Executor 93 > AllocateProducerIdsRequestTest > testAllocateProducersIdSentToNonController() > [1] Type=Raft-Isolated, Name=testAllocateProducersIdSentToNonController, MetadataVersion=3.7-IV1, Security=PLAINTEXT PASSED

Gradle Test Run :core:test > Gradle Test Executor 95 > FetchFromFollowerIntegrationTest > testRackAwareRangeAssignor(String) > testRackAwareRangeAssignor(String).quorum=zk STARTED

Gradle Test Run :core:test > Gradle Test Executor 95 > FetchFromFollowerIntegrationTest > testRackAwareRangeAssignor(String) > testRackAwareRangeAssignor(String).quorum=zk PASSED

Gradle Test Run :core:test > Gradle Test Executor 95 > FetchFromFollowerIntegrationTest > testRackAwareRangeAssignor(String) > testRackAwareRangeAssignor(String).quorum=kraft STARTED

Gradle Test Run :core:test > Gradle Test Executor 95 > FetchFromFollowerIntegrationTest > testRackAwareRangeAssignor(String) > testRackAwareRangeAssignor(String).quorum=kraft PASSED

5012 tests completed, 1 failed, 13 skipped
There were failing tests. See the report at: file:///home/jenkins/jenkins-agent/workspace/Kafka_kafka_trunk/core/build/reports/tests/test/index.html

Deprecated Gradle features were used in this build, making it incompatible with Gradle 9.0.

You can use '--warning-mode all' to show the individual deprecation warnings and determine if they come from your own scripts or plugins.

For more on this, please refer to https://docs.gradle.org/8.3/userguide/command_line_interface.html#sec:command_line_warnings in the Gradle documentation.

BUILD SUCCESSFUL in 2h 32m 5s
303 actionable tasks: 111 executed, 192 up-to-date

Publishing build scan...
https://ge.apache.org/s/ji7rhmz6s6grk


See the profiling report at: file:///home/jenkins/jenkins-agent/workspace/Kafka_kafka_trunk/build/reports/profile/profile-2023-10-26-23-19-10.html
A fine-grained performance profile is available: use the --scan option.
[Pipeline] junit
Recording test results
[Checks API] No suitable checks publisher found.
[Pipeline] echo
Skipping Kafka Streams archetype test for Java 17
[Pipeline] }
[Pipeline] // withEnv
[Pipeline] }
[Pipeline] // withEnv
[Pipeline] }
[Pipeline] // withEnv
[Pipeline] }
[Pipeline] // node
[Pipeline] }
[Pipeline] // timestamps
[Pipeline] }
[Pipeline] // timeout
[Pipeline] }
[Pipeline] // stage
[Pipeline] }
[Pipeline] // parallel
[Pipeline] }
[Pipeline] // stage
[Pipeline] stage
[Pipeline] { (Declarative: Post Actions)
[Pipeline] script
[Pipeline] {
[Pipeline] node
Running on builds23 in /home/jenkins/workspace/Kafka_kafka_trunk
[Pipeline] {
[Pipeline] step

Build failed in Jenkins: Kafka » Kafka Branch Builder » trunk #2331

Posted by Apache Jenkins Server <je...@builds.apache.org>.
See <https://ci-builds.apache.org/job/Kafka/job/kafka/job/trunk/2331/display/redirect>

Changes:


------------------------------------------
[...truncated 426588 lines...]

Gradle Test Run :connect:runtime:test > Gradle Test Executor 44 > org.apache.kafka.connect.storage.MemoryStatusBackingStoreTest > putAndGetTaskStatus STARTED

Gradle Test Run :connect:runtime:test > Gradle Test Executor 44 > org.apache.kafka.connect.storage.MemoryStatusBackingStoreTest > putAndGetTaskStatus PASSED

Gradle Test Run :connect:runtime:test > Gradle Test Executor 44 > org.apache.kafka.connect.storage.MemoryStatusBackingStoreTest > deleteTaskStatus STARTED

Gradle Test Run :connect:runtime:test > Gradle Test Executor 44 > org.apache.kafka.connect.storage.MemoryStatusBackingStoreTest > deleteTaskStatus PASSED

Gradle Test Run :connect:runtime:test > Gradle Test Executor 44 > org.apache.kafka.connect.storage.MemoryStatusBackingStoreTest > deleteConnectorStatus STARTED

Gradle Test Run :connect:runtime:test > Gradle Test Executor 44 > org.apache.kafka.connect.storage.MemoryStatusBackingStoreTest > deleteConnectorStatus PASSED

Gradle Test Run :connect:runtime:test > Gradle Test Executor 44 > org.apache.kafka.connect.storage.OffsetUtilsTest > testValidateFormatWithValidFormat STARTED

Gradle Test Run :connect:runtime:test > Gradle Test Executor 44 > org.apache.kafka.connect.storage.OffsetUtilsTest > testValidateFormatWithValidFormat PASSED

Gradle Test Run :connect:runtime:test > Gradle Test Executor 44 > org.apache.kafka.connect.storage.OffsetUtilsTest > testValidateFormatMapWithNonStringKeys STARTED

Gradle Test Run :connect:runtime:test > Gradle Test Executor 44 > org.apache.kafka.connect.storage.OffsetUtilsTest > testValidateFormatMapWithNonStringKeys PASSED

Gradle Test Run :connect:runtime:test > Gradle Test Executor 44 > org.apache.kafka.connect.storage.OffsetUtilsTest > testProcessPartitionKeyListWithElementsOfWrongType STARTED

Gradle Test Run :connect:runtime:test > Gradle Test Executor 44 > org.apache.kafka.connect.storage.OffsetUtilsTest > testProcessPartitionKeyListWithElementsOfWrongType PASSED

Gradle Test Run :connect:runtime:test > Gradle Test Executor 44 > org.apache.kafka.connect.storage.OffsetUtilsTest > testProcessPartitionKeyNotList STARTED

Gradle Test Run :connect:runtime:test > Gradle Test Executor 44 > org.apache.kafka.connect.storage.OffsetUtilsTest > testProcessPartitionKeyNotList PASSED

Gradle Test Run :connect:runtime:test > Gradle Test Executor 44 > org.apache.kafka.connect.storage.OffsetUtilsTest > testValidateFormatMapWithNonPrimitiveKeys STARTED

Gradle Test Run :connect:runtime:test > Gradle Test Executor 44 > org.apache.kafka.connect.storage.OffsetUtilsTest > testValidateFormatMapWithNonPrimitiveKeys PASSED

Gradle Test Run :connect:runtime:test > Gradle Test Executor 44 > org.apache.kafka.connect.storage.OffsetUtilsTest > testProcessPartitionKeyListWithOneElement STARTED

Gradle Test Run :connect:runtime:test > Gradle Test Executor 44 > org.apache.kafka.connect.storage.OffsetUtilsTest > testProcessPartitionKeyListWithOneElement PASSED

Gradle Test Run :connect:runtime:test > Gradle Test Executor 44 > org.apache.kafka.connect.storage.OffsetUtilsTest > testValidateFormatNotMap STARTED

Gradle Test Run :connect:runtime:test > Gradle Test Executor 44 > org.apache.kafka.connect.storage.OffsetUtilsTest > testValidateFormatNotMap PASSED

Gradle Test Run :connect:runtime:test > Gradle Test Executor 44 > org.apache.kafka.connect.storage.OffsetUtilsTest > testProcessPartitionKeyValidList STARTED

Gradle Test Run :connect:runtime:test > Gradle Test Executor 44 > org.apache.kafka.connect.storage.OffsetUtilsTest > testProcessPartitionKeyValidList PASSED

Gradle Test Run :connect:runtime:test > Gradle Test Executor 44 > org.apache.kafka.connect.util.ConvertingFutureCallbackTest > shouldNotConvertBeforeGetOnFailedCompletion STARTED

Gradle Test Run :connect:runtime:test > Gradle Test Executor 44 > org.apache.kafka.connect.util.ConvertingFutureCallbackTest > shouldNotConvertBeforeGetOnFailedCompletion PASSED

Gradle Test Run :connect:runtime:test > Gradle Test Executor 44 > org.apache.kafka.connect.util.ConvertingFutureCallbackTest > shouldBlockUntilCancellation STARTED

Gradle Test Run :connect:runtime:test > Gradle Test Executor 44 > org.apache.kafka.connect.util.ConvertingFutureCallbackTest > shouldBlockUntilCancellation PASSED

Gradle Test Run :connect:runtime:test > Gradle Test Executor 44 > org.apache.kafka.connect.util.ConvertingFutureCallbackTest > shouldConvertOnlyOnceBeforeGetOnSuccessfulCompletion STARTED

Gradle Test Run :connect:runtime:test > Gradle Test Executor 44 > org.apache.kafka.connect.util.ConvertingFutureCallbackTest > shouldConvertOnlyOnceBeforeGetOnSuccessfulCompletion PASSED

Gradle Test Run :connect:runtime:test > Gradle Test Executor 44 > org.apache.kafka.connect.util.ConvertingFutureCallbackTest > shouldBlockUntilSuccessfulCompletion STARTED

Gradle Test Run :connect:runtime:test > Gradle Test Executor 44 > org.apache.kafka.connect.util.ConvertingFutureCallbackTest > shouldBlockUntilSuccessfulCompletion PASSED

Gradle Test Run :connect:runtime:test > Gradle Test Executor 44 > org.apache.kafka.connect.util.ConvertingFutureCallbackTest > shouldConvertBeforeGetOnSuccessfulCompletion STARTED

Gradle Test Run :connect:runtime:test > Gradle Test Executor 44 > org.apache.kafka.connect.util.ConvertingFutureCallbackTest > shouldConvertBeforeGetOnSuccessfulCompletion PASSED

Gradle Test Run :connect:runtime:test > Gradle Test Executor 44 > org.apache.kafka.connect.util.ConvertingFutureCallbackTest > shouldNotCancelIfMayNotCancelWhileRunning STARTED

Gradle Test Run :connect:runtime:test > Gradle Test Executor 44 > org.apache.kafka.connect.util.ConvertingFutureCallbackTest > shouldNotCancelIfMayNotCancelWhileRunning PASSED

Gradle Test Run :connect:runtime:test > Gradle Test Executor 44 > org.apache.kafka.connect.util.ConvertingFutureCallbackTest > shouldCancelBeforeGetIfMayCancelWhileRunning STARTED

Gradle Test Run :connect:runtime:test > Gradle Test Executor 44 > org.apache.kafka.connect.util.ConvertingFutureCallbackTest > shouldCancelBeforeGetIfMayCancelWhileRunning PASSED

Gradle Test Run :connect:runtime:test > Gradle Test Executor 44 > org.apache.kafka.connect.util.ConvertingFutureCallbackTest > shouldRecordOnlyFirstErrorBeforeGetOnFailedCompletion STARTED

Gradle Test Run :connect:runtime:test > Gradle Test Executor 44 > org.apache.kafka.connect.util.ConvertingFutureCallbackTest > shouldRecordOnlyFirstErrorBeforeGetOnFailedCompletion PASSED

Gradle Test Run :connect:runtime:test > Gradle Test Executor 44 > org.apache.kafka.connect.util.ConvertingFutureCallbackTest > shouldBlockUntilFailedCompletion STARTED

Gradle Test Run :connect:runtime:test > Gradle Test Executor 44 > org.apache.kafka.connect.util.ConvertingFutureCallbackTest > shouldBlockUntilFailedCompletion PASSED

Gradle Test Run :connect:runtime:test > Gradle Test Executor 44 > org.apache.kafka.connect.util.LoggingContextTest > shouldCreateConnectorLoggingContext STARTED

Gradle Test Run :connect:runtime:test > Gradle Test Executor 44 > org.apache.kafka.connect.util.LoggingContextTest > shouldCreateConnectorLoggingContext PASSED

Gradle Test Run :connect:runtime:test > Gradle Test Executor 44 > org.apache.kafka.connect.util.LoggingContextTest > shouldCreateTaskLoggingContext STARTED

Gradle Test Run :connect:runtime:test > Gradle Test Executor 44 > org.apache.kafka.connect.util.LoggingContextTest > shouldCreateTaskLoggingContext PASSED

Gradle Test Run :connect:runtime:test > Gradle Test Executor 44 > org.apache.kafka.connect.util.LoggingContextTest > shouldNotAllowNullConnectorNameForConnectorContext STARTED

Gradle Test Run :connect:runtime:test > Gradle Test Executor 44 > org.apache.kafka.connect.util.LoggingContextTest > shouldNotAllowNullConnectorNameForConnectorContext PASSED

Gradle Test Run :connect:runtime:test > Gradle Test Executor 44 > org.apache.kafka.connect.util.LoggingContextTest > shouldAllowNestedLoggingContexts STARTED

Gradle Test Run :connect:runtime:test > Gradle Test Executor 44 > org.apache.kafka.connect.util.LoggingContextTest > shouldAllowNestedLoggingContexts PASSED

Gradle Test Run :connect:runtime:test > Gradle Test Executor 44 > org.apache.kafka.connect.util.LoggingContextTest > shouldNotAllowNullTaskIdForTaskContext STARTED

Gradle Test Run :connect:runtime:test > Gradle Test Executor 44 > org.apache.kafka.connect.util.LoggingContextTest > shouldNotAllowNullTaskIdForTaskContext PASSED

Gradle Test Run :connect:runtime:test > Gradle Test Executor 44 > org.apache.kafka.connect.util.LoggingContextTest > shouldCreateAndCloseLoggingContextEvenWithNullContextMap STARTED

Gradle Test Run :connect:runtime:test > Gradle Test Executor 44 > org.apache.kafka.connect.util.LoggingContextTest > shouldCreateAndCloseLoggingContextEvenWithNullContextMap PASSED

Gradle Test Run :connect:runtime:test > Gradle Test Executor 44 > org.apache.kafka.connect.util.LoggingContextTest > shouldNotAllowNullTaskIdForOffsetContext STARTED

Gradle Test Run :connect:runtime:test > Gradle Test Executor 44 > org.apache.kafka.connect.util.LoggingContextTest > shouldNotAllowNullTaskIdForOffsetContext PASSED

Gradle Test Run :connect:runtime:test > Gradle Test Executor 44 > org.apache.kafka.connect.util.LoggingContextTest > shouldCreateOffsetsLoggingContext STARTED

Gradle Test Run :connect:runtime:test > Gradle Test Executor 44 > org.apache.kafka.connect.util.LoggingContextTest > shouldCreateOffsetsLoggingContext PASSED

Gradle Test Run :connect:runtime:test > Gradle Test Executor 44 > org.apache.kafka.connect.util.SharedTopicAdminTest > shouldCloseWithDurationAfterTopicAdminUsed STARTED

Gradle Test Run :connect:runtime:test > Gradle Test Executor 44 > org.apache.kafka.connect.util.SharedTopicAdminTest > shouldCloseWithDurationAfterTopicAdminUsed PASSED

Gradle Test Run :connect:runtime:test > Gradle Test Executor 44 > org.apache.kafka.connect.util.SharedTopicAdminTest > shouldCloseWithoutBeingUsed STARTED

Gradle Test Run :connect:runtime:test > Gradle Test Executor 44 > org.apache.kafka.connect.util.SharedTopicAdminTest > shouldCloseWithoutBeingUsed PASSED

Gradle Test Run :connect:runtime:test > Gradle Test Executor 44 > org.apache.kafka.connect.util.SharedTopicAdminTest > shouldCloseAfterTopicAdminUsed STARTED

Gradle Test Run :connect:runtime:test > Gradle Test Executor 44 > org.apache.kafka.connect.util.SharedTopicAdminTest > shouldCloseAfterTopicAdminUsed PASSED

Gradle Test Run :connect:runtime:test > Gradle Test Executor 44 > org.apache.kafka.connect.util.SharedTopicAdminTest > shouldFailToGetTopicAdminAfterClose STARTED

Gradle Test Run :connect:runtime:test > Gradle Test Executor 44 > org.apache.kafka.connect.util.SharedTopicAdminTest > shouldFailToGetTopicAdminAfterClose PASSED

Gradle Test Run :connect:runtime:test > Gradle Test Executor 44 > org.apache.kafka.connect.util.SharedTopicAdminTest > shouldCloseAfterTopicAdminUsedMultipleTimes STARTED

Gradle Test Run :connect:runtime:test > Gradle Test Executor 44 > org.apache.kafka.connect.util.SharedTopicAdminTest > shouldCloseAfterTopicAdminUsedMultipleTimes PASSED

Gradle Test Run :connect:runtime:test > Gradle Test Executor 44 > org.apache.kafka.connect.util.TableTest > basicOperations STARTED

Gradle Test Run :connect:runtime:test > Gradle Test Executor 44 > org.apache.kafka.connect.util.TableTest > basicOperations PASSED

Gradle Test Run :connect:runtime:test > Gradle Test Executor 44 > org.apache.kafka.connect.util.TopicCreationTest > topicCreationWithOneGroup STARTED

Gradle Test Run :connect:runtime:test > Gradle Test Executor 44 > org.apache.kafka.connect.util.TopicCreationTest > topicCreationWithOneGroup PASSED

Gradle Test Run :connect:runtime:test > Gradle Test Executor 44 > org.apache.kafka.connect.util.TopicCreationTest > topicCreationWithOneGroupAndCombinedRegex STARTED

Gradle Test Run :connect:runtime:test > Gradle Test Executor 44 > org.apache.kafka.connect.util.TopicCreationTest > topicCreationWithOneGroupAndCombinedRegex PASSED

Gradle Test Run :connect:runtime:test > Gradle Test Executor 44 > org.apache.kafka.connect.util.TopicCreationTest > testTopicCreationWithSingleTransformation STARTED

Gradle Test Run :connect:runtime:test > Gradle Test Executor 44 > org.apache.kafka.connect.util.TopicCreationTest > testTopicCreationWithSingleTransformation PASSED

Gradle Test Run :connect:runtime:test > Gradle Test Executor 44 > org.apache.kafka.connect.util.TopicCreationTest > topicCreationWithDefaultGroupAndCustomProps STARTED

Gradle Test Run :connect:runtime:test > Gradle Test Executor 44 > org.apache.kafka.connect.util.TopicCreationTest > topicCreationWithDefaultGroupAndCustomProps PASSED

Gradle Test Run :connect:runtime:test > Gradle Test Executor 44 > org.apache.kafka.connect.util.TopicCreationTest > topicCreationWithTwoGroupsAndTwoTransformations STARTED

Gradle Test Run :connect:runtime:test > Gradle Test Executor 44 > org.apache.kafka.connect.util.TopicCreationTest > topicCreationWithTwoGroupsAndTwoTransformations PASSED

Gradle Test Run :connect:runtime:test > Gradle Test Executor 44 > org.apache.kafka.connect.util.TopicCreationTest > testTopicCreationWhenTopicCreationIsEnabled STARTED

Gradle Test Run :connect:runtime:test > Gradle Test Executor 44 > org.apache.kafka.connect.util.TopicCreationTest > testTopicCreationWhenTopicCreationIsEnabled PASSED

Gradle Test Run :connect:runtime:test > Gradle Test Executor 44 > org.apache.kafka.connect.util.TopicCreationTest > withDefaultTopicCreation STARTED

Gradle Test Run :connect:runtime:test > Gradle Test Executor 44 > org.apache.kafka.connect.util.TopicCreationTest > withDefaultTopicCreation PASSED

Gradle Test Run :connect:runtime:test > Gradle Test Executor 44 > org.apache.kafka.connect.util.TopicCreationTest > testTopicCreationWhenTopicCreationIsDisabled STARTED

Gradle Test Run :connect:runtime:test > Gradle Test Executor 44 > org.apache.kafka.connect.util.TopicCreationTest > testTopicCreationWhenTopicCreationIsDisabled PASSED

Gradle Test Run :connect:runtime:test > Gradle Test Executor 44 > org.apache.kafka.connect.util.TopicCreationTest > topicCreationWithTwoGroups STARTED

Gradle Test Run :connect:runtime:test > Gradle Test Executor 44 > org.apache.kafka.connect.util.TopicCreationTest > topicCreationWithTwoGroups PASSED

Gradle Test Run :connect:runtime:test > Gradle Test Executor 44 > org.apache.kafka.connect.util.TopicCreationTest > testEmptyTopicCreation STARTED

Gradle Test Run :connect:runtime:test > Gradle Test Executor 44 > org.apache.kafka.connect.util.TopicCreationTest > testEmptyTopicCreation PASSED

FAILURE: Build completed with 2 failures.

1: Task failed with an exception.
-----------
* What went wrong:
Execution failed for task ':core:test'.
> Process 'Gradle Test Executor 10' finished with non-zero exit value 137
  This problem might be caused by incorrect test process configuration.
  For more on test execution, please refer to https://docs.gradle.org/8.3/userguide/java_testing.html#sec:test_execution in the Gradle documentation.

* Try:
> Run with --stacktrace option to get the stack trace.
> Run with --info or --debug option to get more log output.
> Get more help at https://help.gradle.org.
==============================================================================

2: Task failed with an exception.
-----------
* What went wrong:
Execution failed for task ':streams:test'.
> Process 'Gradle Test Executor 22' finished with non-zero exit value 137
  This problem might be caused by incorrect test process configuration.
  For more on test execution, please refer to https://docs.gradle.org/8.3/userguide/java_testing.html#sec:test_execution in the Gradle documentation.

* Try:
> Run with --stacktrace option to get the stack trace.
> Run with --info or --debug option to get more log output.
> Get more help at https://help.gradle.org.
==============================================================================

Deprecated Gradle features were used in this build, making it incompatible with Gradle 9.0.

You can use '--warning-mode all' to show the individual deprecation warnings and determine if they come from your own scripts or plugins.

For more on this, please refer to https://docs.gradle.org/8.3/userguide/command_line_interface.html#sec:command_line_warnings in the Gradle documentation.

BUILD FAILED in 4h 13m 19s
303 actionable tasks: 111 executed, 192 up-to-date

Publishing build scan...
https://ge.apache.org/s/bvd5klahlixdo


See the profiling report at: file:///home/jenkins/jenkins-agent/712657a4/workspace/Kafka_kafka_trunk/build/reports/profile/profile-2023-10-29-19-00-36.html
A fine-grained performance profile is available: use the --scan option.
[Pipeline] }
[Pipeline] // withEnv
[Pipeline] }
[Pipeline] // withEnv
[Pipeline] }
[Pipeline] // withEnv
[Pipeline] }
[Pipeline] // node
[Pipeline] }
[Pipeline] // timestamps
[Pipeline] }
[Pipeline] // timeout
[Pipeline] }
[Pipeline] // stage
[Pipeline] }
Failed in branch JDK 11 and Scala 2.13
[Pipeline] // parallel
[Pipeline] }
[Pipeline] // stage
[Pipeline] stage
[Pipeline] { (Declarative: Post Actions)
[Pipeline] script
[Pipeline] {
[Pipeline] node
Running on builds35 in /home/jenkins/workspace/Kafka_kafka_trunk
[Pipeline] {
[Pipeline] step

Build failed in Jenkins: Kafka » Kafka Branch Builder » trunk #2330

Posted by Apache Jenkins Server <je...@builds.apache.org>.
See <https://ci-builds.apache.org/job/Kafka/job/kafka/job/trunk/2330/display/redirect>

Changes:


------------------------------------------
[...truncated 373707 lines...]
Gradle Test Run :connect:runtime:test > Gradle Test Executor 45 > org.apache.kafka.connect.util.TopicAdminTest > throwsWithApiVersionMismatchOnDescribe PASSED

Gradle Test Run :connect:runtime:test > Gradle Test Executor 45 > org.apache.kafka.connect.util.TopicAdminTest > returnEmptyWithApiVersionMismatchOnCreate STARTED

Gradle Test Run :connect:runtime:test > Gradle Test Executor 45 > org.apache.kafka.connect.util.TopicAdminTest > returnEmptyWithApiVersionMismatchOnCreate PASSED

Gradle Test Run :connect:runtime:test > Gradle Test Executor 45 > org.apache.kafka.connect.util.TopicAdminTest > endOffsetsShouldFailWhenAnyTopicPartitionHasError STARTED

Gradle Test Run :connect:runtime:test > Gradle Test Executor 45 > org.apache.kafka.connect.util.TopicAdminTest > endOffsetsShouldFailWhenAnyTopicPartitionHasError PASSED

Gradle Test Run :connect:runtime:test > Gradle Test Executor 45 > org.apache.kafka.connect.util.TopicAdminTest > endOffsetsShouldReturnEmptyMapWhenPartitionsSetIsNull STARTED

Gradle Test Run :connect:runtime:test > Gradle Test Executor 45 > org.apache.kafka.connect.util.TopicAdminTest > endOffsetsShouldReturnEmptyMapWhenPartitionsSetIsNull PASSED

Gradle Test Run :connect:runtime:test > Gradle Test Executor 45 > org.apache.kafka.connect.util.TopicAdminTest > shouldCreateTopicWithPartitionsWhenItDoesNotExist STARTED

Gradle Test Run :connect:runtime:test > Gradle Test Executor 45 > org.apache.kafka.connect.util.TopicAdminTest > shouldCreateTopicWithPartitionsWhenItDoesNotExist PASSED

Gradle Test Run :connect:runtime:test > Gradle Test Executor 45 > org.apache.kafka.connect.util.TopicAdminTest > endOffsetsShouldFailWithTimeoutExceptionWhenTimeoutErrorOccurs STARTED

Gradle Test Run :connect:runtime:test > Gradle Test Executor 45 > org.apache.kafka.connect.util.TopicAdminTest > endOffsetsShouldFailWithTimeoutExceptionWhenTimeoutErrorOccurs PASSED

Gradle Test Run :connect:runtime:test > Gradle Test Executor 45 > org.apache.kafka.connect.util.TopicAdminTest > throwsWithTopicAuthorizationFailureOnDescribe STARTED

Gradle Test Run :connect:runtime:test > Gradle Test Executor 45 > org.apache.kafka.connect.util.TopicAdminTest > throwsWithTopicAuthorizationFailureOnDescribe PASSED

Gradle Test Run :connect:runtime:test > Gradle Test Executor 45 > org.apache.kafka.connect.util.TopicAdminTest > verifyingGettingTopicCleanupPolicies STARTED

Gradle Test Run :connect:runtime:test > Gradle Test Executor 45 > org.apache.kafka.connect.util.TopicAdminTest > verifyingGettingTopicCleanupPolicies PASSED

Gradle Test Run :connect:runtime:test > Gradle Test Executor 45 > org.apache.kafka.connect.util.TopicAdminTest > throwsWithClusterAuthorizationFailureOnDescribe STARTED

Gradle Test Run :connect:runtime:test > Gradle Test Executor 45 > org.apache.kafka.connect.util.TopicAdminTest > throwsWithClusterAuthorizationFailureOnDescribe PASSED

Gradle Test Run :connect:runtime:test > Gradle Test Executor 45 > org.apache.kafka.connect.util.TopicAdminTest > endOffsetsShouldReturnOffsetsForOnePartition STARTED

Gradle Test Run :connect:runtime:test > Gradle Test Executor 45 > org.apache.kafka.connect.util.TopicAdminTest > endOffsetsShouldReturnOffsetsForOnePartition PASSED

Gradle Test Run :connect:runtime:test > Gradle Test Executor 45 > org.apache.kafka.connect.util.TopicAdminTest > shouldCreateOneTopicWhenProvidedMultipleDefinitionsWithSameTopicName STARTED

Gradle Test Run :connect:runtime:test > Gradle Test Executor 45 > org.apache.kafka.connect.util.TopicAdminTest > shouldCreateOneTopicWhenProvidedMultipleDefinitionsWithSameTopicName PASSED

Gradle Test Run :connect:runtime:test > Gradle Test Executor 45 > org.apache.kafka.connect.util.TopicAdminTest > describeTopicConfigShouldReturnEmptyMapWhenClusterAuthorizationFailure STARTED

Gradle Test Run :connect:runtime:test > Gradle Test Executor 45 > org.apache.kafka.connect.util.TopicAdminTest > describeTopicConfigShouldReturnEmptyMapWhenClusterAuthorizationFailure PASSED

Gradle Test Run :connect:runtime:test > Gradle Test Executor 45 > org.apache.kafka.connect.util.TopicAdminTest > returnEmptyWithClusterAuthorizationFailureOnCreate STARTED

Gradle Test Run :connect:runtime:test > Gradle Test Executor 45 > org.apache.kafka.connect.util.TopicAdminTest > returnEmptyWithClusterAuthorizationFailureOnCreate PASSED

Gradle Test Run :connect:runtime:test > Gradle Test Executor 45 > org.apache.kafka.connect.util.TopicAdminTest > shouldCreateTopicWithDefaultPartitionsAndReplicationFactorWhenItDoesNotExist STARTED

Gradle Test Run :connect:runtime:test > Gradle Test Executor 45 > org.apache.kafka.connect.util.TopicAdminTest > shouldCreateTopicWithDefaultPartitionsAndReplicationFactorWhenItDoesNotExist PASSED

Gradle Test Run :connect:runtime:test > Gradle Test Executor 45 > org.apache.kafka.connect.util.TopicAdminTest > describeShouldReturnTopicDescriptionWhenTopicExists STARTED

Gradle Test Run :connect:runtime:test > Gradle Test Executor 45 > org.apache.kafka.connect.util.TopicAdminTest > describeShouldReturnTopicDescriptionWhenTopicExists PASSED

Gradle Test Run :connect:runtime:test > Gradle Test Executor 45 > org.apache.kafka.connect.util.TopicAdminTest > describeTopicConfigShouldReturnMapWithNullValueWhenTopicDoesNotExist STARTED

Gradle Test Run :connect:runtime:test > Gradle Test Executor 45 > org.apache.kafka.connect.util.TopicAdminTest > describeTopicConfigShouldReturnMapWithNullValueWhenTopicDoesNotExist PASSED

Gradle Test Run :connect:runtime:test > Gradle Test Executor 45 > org.apache.kafka.connect.util.TopicAdminTest > retryEndOffsetsShouldWrapNonRetriableExceptionsWithConnectException STARTED

Gradle Test Run :connect:runtime:test > Gradle Test Executor 45 > org.apache.kafka.connect.util.TopicAdminTest > retryEndOffsetsShouldWrapNonRetriableExceptionsWithConnectException PASSED

Gradle Test Run :connect:runtime:test > Gradle Test Executor 45 > org.apache.kafka.connect.util.TopicAdminTest > verifyingTopicCleanupPolicyShouldFailWhenTopicHasDeletePolicy STARTED

Gradle Test Run :connect:runtime:test > Gradle Test Executor 45 > org.apache.kafka.connect.util.TopicAdminTest > verifyingTopicCleanupPolicyShouldFailWhenTopicHasDeletePolicy PASSED

Gradle Test Run :connect:runtime:test > Gradle Test Executor 45 > org.apache.kafka.connect.util.TopicAdminTest > shouldCreateTopicWithReplicationFactorWhenItDoesNotExist STARTED

Gradle Test Run :connect:runtime:test > Gradle Test Executor 45 > org.apache.kafka.connect.util.TopicAdminTest > shouldCreateTopicWithReplicationFactorWhenItDoesNotExist PASSED

Gradle Test Run :connect:runtime:test > Gradle Test Executor 45 > org.apache.kafka.connect.util.TopicAdminTest > retryEndOffsetsShouldRethrowUnknownVersionException STARTED

Gradle Test Run :connect:runtime:test > Gradle Test Executor 45 > org.apache.kafka.connect.util.TopicAdminTest > retryEndOffsetsShouldRethrowUnknownVersionException PASSED

Gradle Test Run :connect:runtime:test > Gradle Test Executor 45 > org.apache.kafka.connect.util.TopicAdminTest > endOffsetsShouldFailWithUnsupportedVersionWhenVersionUnsupportedErrorOccurs STARTED

Gradle Test Run :connect:runtime:test > Gradle Test Executor 45 > org.apache.kafka.connect.util.TopicAdminTest > endOffsetsShouldFailWithUnsupportedVersionWhenVersionUnsupportedErrorOccurs PASSED

Gradle Test Run :connect:runtime:test > Gradle Test Executor 45 > org.apache.kafka.connect.util.TopicAdminTest > returnEmptyWithTopicAuthorizationFailureOnCreate STARTED

Gradle Test Run :connect:runtime:test > Gradle Test Executor 45 > org.apache.kafka.connect.util.TopicAdminTest > returnEmptyWithTopicAuthorizationFailureOnCreate PASSED

Gradle Test Run :connect:runtime:test > Gradle Test Executor 45 > org.apache.kafka.connect.util.TopicAdminTest > endOffsetsShouldReturnOffsetsForMultiplePartitions STARTED

Gradle Test Run :connect:runtime:test > Gradle Test Executor 45 > org.apache.kafka.connect.util.TopicAdminTest > endOffsetsShouldReturnOffsetsForMultiplePartitions PASSED

Gradle Test Run :connect:runtime:test > Gradle Test Executor 45 > org.apache.kafka.connect.util.TopicAdminTest > verifyingTopicCleanupPolicyShouldReturnFalseWhenClusterAuthorizationError STARTED

Gradle Test Run :connect:runtime:test > Gradle Test Executor 45 > org.apache.kafka.connect.util.TopicAdminTest > verifyingTopicCleanupPolicyShouldReturnFalseWhenClusterAuthorizationError PASSED

Gradle Test Run :connect:runtime:test > Gradle Test Executor 45 > org.apache.kafka.connect.util.TopicAdminTest > describeTopicConfigShouldReturnEmptyMapWhenTopicAuthorizationFailure STARTED

Gradle Test Run :connect:runtime:test > Gradle Test Executor 45 > org.apache.kafka.connect.util.TopicAdminTest > describeTopicConfigShouldReturnEmptyMapWhenTopicAuthorizationFailure PASSED

Gradle Test Run :connect:runtime:test > Gradle Test Executor 45 > org.apache.kafka.connect.util.TopicAdminTest > verifyingTopicCleanupPolicyShouldReturnTrueWhenTopicHasCorrectPolicy STARTED

Gradle Test Run :connect:runtime:test > Gradle Test Executor 45 > org.apache.kafka.connect.util.TopicAdminTest > verifyingTopicCleanupPolicyShouldReturnTrueWhenTopicHasCorrectPolicy PASSED

Gradle Test Run :connect:runtime:test > Gradle Test Executor 45 > org.apache.kafka.connect.util.TopicAdminTest > endOffsetsShouldFailWithNonRetriableWhenAuthorizationFailureOccurs STARTED

Gradle Test Run :connect:runtime:test > Gradle Test Executor 45 > org.apache.kafka.connect.util.TopicAdminTest > endOffsetsShouldFailWithNonRetriableWhenAuthorizationFailureOccurs PASSED

Gradle Test Run :connect:runtime:test > Gradle Test Executor 100 > org.apache.kafka.connect.integration.OffsetsApiIntegrationTest > testResetSourceConnectorOffsets STARTED

> Task :connect:mirror:test

Gradle Test Run :connect:mirror:test > Gradle Test Executor 46 > MirrorConnectorsWithCustomForwardingAdminIntegrationTest > testReplicationWithEmptyPartition() PASSED

Gradle Test Run :connect:mirror:test > Gradle Test Executor 46 > MirrorConnectorsWithCustomForwardingAdminIntegrationTest > testReplicateSourceDefault() STARTED

> Task :connect:runtime:test

Gradle Test Run :connect:runtime:test > Gradle Test Executor 100 > org.apache.kafka.connect.integration.OffsetsApiIntegrationTest > testResetSourceConnectorOffsets PASSED

1275 tests completed, 1 failed, 1 skipped
There were failing tests. See the report at: file:///home/jenkins/jenkins-agent/712657a4/workspace/Kafka_kafka_trunk/connect/runtime/build/reports/tests/test/index.html

> Task :connect:mirror:test

Gradle Test Run :connect:mirror:test > Gradle Test Executor 46 > MirrorConnectorsWithCustomForwardingAdminIntegrationTest > testReplicateSourceDefault() PASSED

Gradle Test Run :connect:mirror:test > Gradle Test Executor 46 > MirrorConnectorsWithCustomForwardingAdminIntegrationTest > testOffsetSyncsTopicsOnTarget() STARTED

Gradle Test Run :connect:mirror:test > Gradle Test Executor 46 > MirrorConnectorsWithCustomForwardingAdminIntegrationTest > testOffsetSyncsTopicsOnTarget() PASSED

Gradle Test Run :connect:mirror:test > Gradle Test Executor 46 > MirrorConnectorsWithCustomForwardingAdminIntegrationTest > testReplicateTargetDefault() STARTED

Gradle Test Run :connect:mirror:test > Gradle Test Executor 46 > MirrorConnectorsWithCustomForwardingAdminIntegrationTest > testReplicateTargetDefault() PASSED

Gradle Test Run :connect:mirror:test > Gradle Test Executor 46 > MirrorConnectorsWithCustomForwardingAdminIntegrationTest > testOffsetTranslationBehindReplicationFlow() STARTED

Gradle Test Run :connect:mirror:test > Gradle Test Executor 46 > MirrorConnectorsWithCustomForwardingAdminIntegrationTest > testOffsetTranslationBehindReplicationFlow() PASSED

Gradle Test Run :connect:mirror:test > Gradle Test Executor 46 > MirrorConnectorsWithCustomForwardingAdminIntegrationTest > testNoCheckpointsIfNoRecordsAreMirrored() STARTED

Gradle Test Run :connect:mirror:test > Gradle Test Executor 46 > MirrorConnectorsWithCustomForwardingAdminIntegrationTest > testNoCheckpointsIfNoRecordsAreMirrored() PASSED

Gradle Test Run :connect:mirror:test > Gradle Test Executor 46 > MirrorConnectorsWithCustomForwardingAdminIntegrationTest > testOneWayReplicationWithAutoOffsetSync() STARTED

Gradle Test Run :connect:mirror:test > Gradle Test Executor 46 > MirrorConnectorsWithCustomForwardingAdminIntegrationTest > testOneWayReplicationWithAutoOffsetSync() PASSED

Gradle Test Run :connect:mirror:test > Gradle Test Executor 46 > MirrorConnectorsWithCustomForwardingAdminIntegrationTest > testSyncTopicConfigs() STARTED

Gradle Test Run :connect:mirror:test > Gradle Test Executor 46 > MirrorConnectorsWithCustomForwardingAdminIntegrationTest > testSyncTopicConfigs() PASSED

Gradle Test Run :connect:mirror:test > Gradle Test Executor 46 > MirrorConnectorsWithCustomForwardingAdminIntegrationTest > testRestartReplication() STARTED

Gradle Test Run :connect:mirror:test > Gradle Test Executor 46 > MirrorConnectorsWithCustomForwardingAdminIntegrationTest > testRestartReplication() PASSED

Gradle Test Run :connect:mirror:test > Gradle Test Executor 46 > MirrorConnectorsWithCustomForwardingAdminIntegrationTest > testOneWayReplicationWithFrequentOffsetSyncs() STARTED

Gradle Test Run :connect:mirror:test > Gradle Test Executor 46 > MirrorConnectorsWithCustomForwardingAdminIntegrationTest > testOneWayReplicationWithFrequentOffsetSyncs() PASSED

Gradle Test Run :connect:mirror:test > Gradle Test Executor 46 > MirrorConnectorsWithCustomForwardingAdminIntegrationTest > testReplicationIsCreatingTopicsUsingProvidedForwardingAdmin() STARTED

Gradle Test Run :connect:mirror:test > Gradle Test Executor 46 > MirrorConnectorsWithCustomForwardingAdminIntegrationTest > testReplicationIsCreatingTopicsUsingProvidedForwardingAdmin() PASSED

Gradle Test Run :connect:mirror:test > Gradle Test Executor 46 > MirrorConnectorsWithCustomForwardingAdminIntegrationTest > testSyncTopicACLsUseProvidedForwardingAdmin() STARTED

Gradle Test Run :connect:mirror:test > Gradle Test Executor 46 > MirrorConnectorsWithCustomForwardingAdminIntegrationTest > testSyncTopicACLsUseProvidedForwardingAdmin() PASSED

Gradle Test Run :connect:mirror:test > Gradle Test Executor 46 > MirrorConnectorsWithCustomForwardingAdminIntegrationTest > testCreatePartitionsUseProvidedForwardingAdmin() STARTED

Gradle Test Run :connect:mirror:test > Gradle Test Executor 46 > MirrorConnectorsWithCustomForwardingAdminIntegrationTest > testCreatePartitionsUseProvidedForwardingAdmin() PASSED

Gradle Test Run :connect:mirror:test > Gradle Test Executor 46 > MirrorConnectorsWithCustomForwardingAdminIntegrationTest > testSyncTopicConfigUseProvidedForwardingAdmin() STARTED

Gradle Test Run :connect:mirror:test > Gradle Test Executor 46 > MirrorConnectorsWithCustomForwardingAdminIntegrationTest > testSyncTopicConfigUseProvidedForwardingAdmin() PASSED

Gradle Test Run :connect:mirror:test > Gradle Test Executor 43 > MirrorConnectorsIntegrationExactlyOnceTest > testReplication() SKIPPED

> Task :connect:mirror:test FAILED

FAILURE: Build completed with 2 failures.

1: Task failed with an exception.
-----------
* What went wrong:
Execution failed for task ':streams:test'.
> Process 'Gradle Test Executor 23' finished with non-zero exit value 137
  This problem might be caused by incorrect test process configuration.
  For more on test execution, please refer to https://docs.gradle.org/8.3/userguide/java_testing.html#sec:test_execution in the Gradle documentation.

* Try:
> Run with --stacktrace option to get the stack trace.
> Run with --info or --debug option to get more log output.
> Get more help at https://help.gradle.org.
==============================================================================

2: Task failed with an exception.
-----------
* What went wrong:
Execution failed for task ':connect:mirror:test'.
> Process 'Gradle Test Executor 43' finished with non-zero exit value 137
  This problem might be caused by incorrect test process configuration.
  For more on test execution, please refer to https://docs.gradle.org/8.3/userguide/java_testing.html#sec:test_execution in the Gradle documentation.

* Try:
> Run with --stacktrace option to get the stack trace.
> Run with --info or --debug option to get more log output.
> Get more help at https://help.gradle.org.
==============================================================================

Deprecated Gradle features were used in this build, making it incompatible with Gradle 9.0.

You can use '--warning-mode all' to show the individual deprecation warnings and determine if they come from your own scripts or plugins.

For more on this, please refer to https://docs.gradle.org/8.3/userguide/command_line_interface.html#sec:command_line_warnings in the Gradle documentation.

BUILD FAILED in 3h 22m 32s
303 actionable tasks: 111 executed, 192 up-to-date

Publishing build scan...
https://ge.apache.org/s/my2d6kumkkgsm


See the profiling report at: file:///home/jenkins/jenkins-agent/712657a4/workspace/Kafka_kafka_trunk/build/reports/profile/profile-2023-10-29-15-21-44.html
A fine-grained performance profile is available: use the --scan option.
[Pipeline] }
[Pipeline] // withEnv
[Pipeline] }
[Pipeline] // withEnv
[Pipeline] }
[Pipeline] // withEnv
[Pipeline] }
[Pipeline] // node
[Pipeline] }
[Pipeline] // timestamps
[Pipeline] }
[Pipeline] // timeout
[Pipeline] }
[Pipeline] // stage
[Pipeline] }
Failed in branch JDK 21 and Scala 2.13
[Pipeline] // parallel
[Pipeline] }
[Pipeline] // stage
[Pipeline] stage
[Pipeline] { (Declarative: Post Actions)
[Pipeline] script
[Pipeline] {
[Pipeline] node
Running on builds35 in /home/jenkins/workspace/Kafka_kafka_trunk
[Pipeline] {
[Pipeline] step

Jenkins build is unstable: Kafka » Kafka Branch Builder » trunk #2329

Posted by Apache Jenkins Server <je...@builds.apache.org>.
See <https://ci-builds.apache.org/job/Kafka/job/kafka/job/trunk/2329/display/redirect>


Build failed in Jenkins: Kafka » Kafka Branch Builder » trunk #2328

Posted by Apache Jenkins Server <je...@builds.apache.org>.
See <https://ci-builds.apache.org/job/Kafka/job/kafka/job/trunk/2328/display/redirect>

Changes:


------------------------------------------
[...truncated 430754 lines...]
Gradle Test Run :core:test > Gradle Test Executor 91 > ZooKeeperClientTest > testZNodeChangeHandlerForCreation() PASSED

Gradle Test Run :core:test > Gradle Test Executor 91 > ZooKeeperClientTest > testGetAclExistingZNode() STARTED

Gradle Test Run :core:test > Gradle Test Executor 91 > ZooKeeperClientTest > testGetAclExistingZNode() PASSED

Gradle Test Run :core:test > Gradle Test Executor 91 > ZooKeeperClientTest > testSessionExpiryDuringClose() STARTED

Gradle Test Run :core:test > Gradle Test Executor 91 > ZooKeeperClientTest > testSessionExpiryDuringClose() PASSED

Gradle Test Run :core:test > Gradle Test Executor 91 > ZooKeeperClientTest > testReinitializeAfterAuthFailure() STARTED

Gradle Test Run :core:test > Gradle Test Executor 91 > ZooKeeperClientTest > testReinitializeAfterAuthFailure() PASSED

Gradle Test Run :core:test > Gradle Test Executor 91 > ZooKeeperClientTest > testSetAclNonExistentZNode() STARTED

Gradle Test Run :core:test > Gradle Test Executor 91 > ZooKeeperClientTest > testSetAclNonExistentZNode() PASSED

Gradle Test Run :core:test > Gradle Test Executor 91 > ZooKeeperClientTest > testConnectionLossRequestTermination() STARTED

Gradle Test Run :core:test > Gradle Test Executor 91 > ZooKeeperClientTest > testConnectionLossRequestTermination() PASSED

Gradle Test Run :core:test > Gradle Test Executor 91 > ZooKeeperClientTest > testExistsNonExistentZNode() STARTED

Gradle Test Run :core:test > Gradle Test Executor 91 > ZooKeeperClientTest > testExistsNonExistentZNode() PASSED

Gradle Test Run :core:test > Gradle Test Executor 91 > ZooKeeperClientTest > testGetDataNonExistentZNode() STARTED

Gradle Test Run :core:test > Gradle Test Executor 91 > ZooKeeperClientTest > testGetDataNonExistentZNode() PASSED

Gradle Test Run :core:test > Gradle Test Executor 91 > ZooKeeperClientTest > testConnectionTimeout() STARTED

Gradle Test Run :core:test > Gradle Test Executor 91 > ZooKeeperClientTest > testConnectionTimeout() PASSED

Gradle Test Run :core:test > Gradle Test Executor 91 > ZooKeeperClientTest > testBlockOnRequestCompletionFromStateChangeHandler() STARTED

Gradle Test Run :core:test > Gradle Test Executor 91 > ZooKeeperClientTest > testBlockOnRequestCompletionFromStateChangeHandler() PASSED

Gradle Test Run :core:test > Gradle Test Executor 91 > ZooKeeperClientTest > testUnresolvableConnectString() STARTED

Gradle Test Run :core:test > Gradle Test Executor 91 > ZooKeeperClientTest > testUnresolvableConnectString() PASSED

Gradle Test Run :core:test > Gradle Test Executor 91 > ZooKeeperClientTest > testGetChildrenNonExistentZNode() STARTED

Gradle Test Run :core:test > Gradle Test Executor 91 > ZooKeeperClientTest > testGetChildrenNonExistentZNode() PASSED

Gradle Test Run :core:test > Gradle Test Executor 91 > ZooKeeperClientTest > testPipelinedGetData() STARTED

Gradle Test Run :core:test > Gradle Test Executor 91 > ZooKeeperClientTest > testPipelinedGetData() PASSED

Gradle Test Run :core:test > Gradle Test Executor 91 > ZooKeeperClientTest > testZNodeChildChangeHandlerForChildChange() STARTED

Gradle Test Run :core:test > Gradle Test Executor 91 > ZooKeeperClientTest > testZNodeChildChangeHandlerForChildChange() PASSED

Gradle Test Run :core:test > Gradle Test Executor 91 > ZooKeeperClientTest > testGetChildrenExistingZNodeWithChildren() STARTED

Gradle Test Run :core:test > Gradle Test Executor 91 > ZooKeeperClientTest > testGetChildrenExistingZNodeWithChildren() PASSED

Gradle Test Run :core:test > Gradle Test Executor 91 > ZooKeeperClientTest > testSetDataExistingZNode() STARTED

Gradle Test Run :core:test > Gradle Test Executor 91 > ZooKeeperClientTest > testSetDataExistingZNode() PASSED

Gradle Test Run :core:test > Gradle Test Executor 91 > ZooKeeperClientTest > testZNodeChildChangeHandlerForChildChangeNotTriggered() STARTED

Gradle Test Run :core:test > Gradle Test Executor 91 > ZooKeeperClientTest > testZNodeChildChangeHandlerForChildChangeNotTriggered() PASSED

Gradle Test Run :core:test > Gradle Test Executor 91 > ZooKeeperClientTest > testMixedPipeline() STARTED

Gradle Test Run :core:test > Gradle Test Executor 91 > ZooKeeperClientTest > testMixedPipeline() PASSED

Gradle Test Run :core:test > Gradle Test Executor 91 > ZooKeeperClientTest > testGetDataExistingZNode() STARTED

Gradle Test Run :core:test > Gradle Test Executor 91 > ZooKeeperClientTest > testGetDataExistingZNode() PASSED

Gradle Test Run :core:test > Gradle Test Executor 91 > ZooKeeperClientTest > testDeleteExistingZNode() STARTED

Gradle Test Run :core:test > Gradle Test Executor 91 > ZooKeeperClientTest > testDeleteExistingZNode() PASSED

Gradle Test Run :core:test > Gradle Test Executor 91 > ZooKeeperClientTest > testSessionExpiry() STARTED

Gradle Test Run :core:test > Gradle Test Executor 91 > ZooKeeperClientTest > testSessionExpiry() PASSED

Gradle Test Run :core:test > Gradle Test Executor 91 > ZooKeeperClientTest > testSetDataNonExistentZNode() STARTED

Gradle Test Run :core:test > Gradle Test Executor 91 > ZooKeeperClientTest > testSetDataNonExistentZNode() PASSED

Gradle Test Run :core:test > Gradle Test Executor 91 > ZooKeeperClientTest > testConnectionViaNettyClient() STARTED

Gradle Test Run :core:test > Gradle Test Executor 91 > ZooKeeperClientTest > testConnectionViaNettyClient() PASSED

Gradle Test Run :core:test > Gradle Test Executor 91 > ZooKeeperClientTest > testDeleteNonExistentZNode() STARTED

Gradle Test Run :core:test > Gradle Test Executor 91 > ZooKeeperClientTest > testDeleteNonExistentZNode() PASSED

Gradle Test Run :core:test > Gradle Test Executor 91 > ZooKeeperClientTest > testExistsExistingZNode() STARTED

Gradle Test Run :core:test > Gradle Test Executor 91 > ZooKeeperClientTest > testExistsExistingZNode() PASSED

Gradle Test Run :core:test > Gradle Test Executor 91 > ZooKeeperClientTest > testZooKeeperStateChangeRateMetrics() STARTED

Gradle Test Run :core:test > Gradle Test Executor 91 > ZooKeeperClientTest > testZooKeeperStateChangeRateMetrics() PASSED

Gradle Test Run :core:test > Gradle Test Executor 91 > ZooKeeperClientTest > testZNodeChangeHandlerForDeletion() STARTED

Gradle Test Run :core:test > Gradle Test Executor 91 > ZooKeeperClientTest > testZNodeChangeHandlerForDeletion() PASSED

Gradle Test Run :core:test > Gradle Test Executor 91 > ZooKeeperClientTest > testGetAclNonExistentZNode() STARTED

Gradle Test Run :core:test > Gradle Test Executor 91 > ZooKeeperClientTest > testGetAclNonExistentZNode() PASSED

Gradle Test Run :core:test > Gradle Test Executor 91 > ZooKeeperClientTest > testStateChangeHandlerForAuthFailure() STARTED

Gradle Test Run :core:test > Gradle Test Executor 91 > ZooKeeperClientTest > testStateChangeHandlerForAuthFailure() PASSED

Gradle Test Run :core:test > Gradle Test Executor 91 > AllocateProducerIdsRequestTest > testAllocateProducersIdSentToController() > [1] Type=Raft-Isolated, Name=testAllocateProducersIdSentToController, MetadataVersion=3.7-IV1, Security=PLAINTEXT STARTED

Gradle Test Run :core:test > Gradle Test Executor 91 > AllocateProducerIdsRequestTest > testAllocateProducersIdSentToController() > [1] Type=Raft-Isolated, Name=testAllocateProducersIdSentToController, MetadataVersion=3.7-IV1, Security=PLAINTEXT PASSED

Gradle Test Run :core:test > Gradle Test Executor 91 > AllocateProducerIdsRequestTest > testAllocateProducersIdSentToNonController() > [1] Type=Raft-Isolated, Name=testAllocateProducersIdSentToNonController, MetadataVersion=3.7-IV1, Security=PLAINTEXT STARTED

Gradle Test Run :core:test > Gradle Test Executor 91 > AllocateProducerIdsRequestTest > testAllocateProducersIdSentToNonController() > [1] Type=Raft-Isolated, Name=testAllocateProducersIdSentToNonController, MetadataVersion=3.7-IV1, Security=PLAINTEXT PASSED

> Task :streams:test

Gradle Test Run :streams:test > Gradle Test Executor 100 > EosV2UpgradeIntegrationTest > [true] > shouldUpgradeFromEosAlphaToEosV2[true] PASSED

7339 tests completed, 7 failed, 22 skipped

> Task :core:test

Gradle Test Run :core:test > Gradle Test Executor 102 > FetchFromFollowerIntegrationTest > testRackAwareRangeAssignor(String) > testRackAwareRangeAssignor(String).quorum=zk STARTED

Gradle Test Run :core:test > Gradle Test Executor 103 > DeleteConsumerGroupsTest > testDeleteCmdWithMixOfSuccessAndError(String) > testDeleteCmdWithMixOfSuccessAndError(String).quorum=zk STARTED

Gradle Test Run :core:test > Gradle Test Executor 103 > DeleteConsumerGroupsTest > testDeleteCmdWithMixOfSuccessAndError(String) > testDeleteCmdWithMixOfSuccessAndError(String).quorum=zk PASSED

Gradle Test Run :core:test > Gradle Test Executor 103 > DeleteConsumerGroupsTest > testDeleteCmdWithMixOfSuccessAndError(String) > testDeleteCmdWithMixOfSuccessAndError(String).quorum=kraft STARTED

Gradle Test Run :core:test > Gradle Test Executor 102 > FetchFromFollowerIntegrationTest > testRackAwareRangeAssignor(String) > testRackAwareRangeAssignor(String).quorum=zk PASSED

Gradle Test Run :core:test > Gradle Test Executor 102 > FetchFromFollowerIntegrationTest > testRackAwareRangeAssignor(String) > testRackAwareRangeAssignor(String).quorum=kraft STARTED

Gradle Test Run :core:test > Gradle Test Executor 103 > DeleteConsumerGroupsTest > testDeleteCmdWithMixOfSuccessAndError(String) > testDeleteCmdWithMixOfSuccessAndError(String).quorum=kraft PASSED

Gradle Test Run :core:test > Gradle Test Executor 103 > ResetConsumerGroupOffsetTest > testResetOffsetsShiftMinus() STARTED

> Task :streams:test
There were failing tests. See the report at: file:///home/jenkins/workspace/Kafka_kafka_trunk/streams/build/reports/tests/test/index.html

> Task :core:test

Gradle Test Run :core:test > Gradle Test Executor 103 > ResetConsumerGroupOffsetTest > testResetOffsetsShiftMinus() PASSED

Gradle Test Run :core:test > Gradle Test Executor 103 > ConsumerBounceTest > testConsumptionWithBrokerFailures() STARTED

Gradle Test Run :core:test > Gradle Test Executor 102 > FetchFromFollowerIntegrationTest > testRackAwareRangeAssignor(String) > testRackAwareRangeAssignor(String).quorum=kraft PASSED

Gradle Test Run :core:test > Gradle Test Executor 102 > PlaintextAdminIntegrationTest > testElectUncleanLeadersForManyPartitions(String) > testElectUncleanLeadersForManyPartitions(String).quorum=zk STARTED

Gradle Test Run :core:test > Gradle Test Executor 102 > PlaintextAdminIntegrationTest > testElectUncleanLeadersForManyPartitions(String) > testElectUncleanLeadersForManyPartitions(String).quorum=zk PASSED

Gradle Test Run :core:test > Gradle Test Executor 102 > PlaintextAdminIntegrationTest > testElectUncleanLeadersForManyPartitions(String) > testElectUncleanLeadersForManyPartitions(String).quorum=kraft STARTED

Gradle Test Run :core:test > Gradle Test Executor 102 > PlaintextAdminIntegrationTest > testElectUncleanLeadersForManyPartitions(String) > testElectUncleanLeadersForManyPartitions(String).quorum=kraft PASSED

Gradle Test Run :core:test > Gradle Test Executor 103 > ConsumerBounceTest > testConsumptionWithBrokerFailures() PASSED

Gradle Test Run :core:test > Gradle Test Executor 103 > DelegationTokenEndToEndAuthorizationTest > testNoDescribeProduceOrConsumeWithoutTopicDescribeAcl(String, boolean) > [1] quorum=kraft, isIdempotenceEnabled=true STARTED

Gradle Test Run :core:test > Gradle Test Executor 103 > DelegationTokenEndToEndAuthorizationTest > testNoDescribeProduceOrConsumeWithoutTopicDescribeAcl(String, boolean) > [1] quorum=kraft, isIdempotenceEnabled=true PASSED

Gradle Test Run :core:test > Gradle Test Executor 103 > DelegationTokenEndToEndAuthorizationTest > testNoDescribeProduceOrConsumeWithoutTopicDescribeAcl(String, boolean) > [2] quorum=kraft, isIdempotenceEnabled=false STARTED

Gradle Test Run :core:test > Gradle Test Executor 103 > DelegationTokenEndToEndAuthorizationTest > testNoDescribeProduceOrConsumeWithoutTopicDescribeAcl(String, boolean) > [2] quorum=kraft, isIdempotenceEnabled=false PASSED

Gradle Test Run :core:test > Gradle Test Executor 103 > DelegationTokenEndToEndAuthorizationTest > testNoDescribeProduceOrConsumeWithoutTopicDescribeAcl(String, boolean) > [3] quorum=zk, isIdempotenceEnabled=true STARTED

Gradle Test Run :core:test > Gradle Test Executor 103 > DelegationTokenEndToEndAuthorizationTest > testNoDescribeProduceOrConsumeWithoutTopicDescribeAcl(String, boolean) > [3] quorum=zk, isIdempotenceEnabled=true PASSED

Gradle Test Run :core:test > Gradle Test Executor 103 > DelegationTokenEndToEndAuthorizationTest > testNoDescribeProduceOrConsumeWithoutTopicDescribeAcl(String, boolean) > [4] quorum=zk, isIdempotenceEnabled=false STARTED

Gradle Test Run :core:test > Gradle Test Executor 103 > DelegationTokenEndToEndAuthorizationTest > testNoDescribeProduceOrConsumeWithoutTopicDescribeAcl(String, boolean) > [4] quorum=zk, isIdempotenceEnabled=false PASSED

Gradle Test Run :core:test > Gradle Test Executor 103 > SaslScramSslEndToEndAuthorizationTest > testTwoConsumersWithDifferentSaslCredentials(String) > testTwoConsumersWithDifferentSaslCredentials(String).quorum=kraft STARTED

Gradle Test Run :core:test > Gradle Test Executor 103 > SaslScramSslEndToEndAuthorizationTest > testTwoConsumersWithDifferentSaslCredentials(String) > testTwoConsumersWithDifferentSaslCredentials(String).quorum=kraft PASSED

Gradle Test Run :core:test > Gradle Test Executor 103 > SaslScramSslEndToEndAuthorizationTest > testTwoConsumersWithDifferentSaslCredentials(String) > testTwoConsumersWithDifferentSaslCredentials(String).quorum=zk STARTED

Gradle Test Run :core:test > Gradle Test Executor 103 > SaslScramSslEndToEndAuthorizationTest > testTwoConsumersWithDifferentSaslCredentials(String) > testTwoConsumersWithDifferentSaslCredentials(String).quorum=zk PASSED

5018 tests completed, 7 failed, 10 skipped
There were failing tests. See the report at: file:///home/jenkins/workspace/Kafka_kafka_trunk/core/build/reports/tests/test/index.html

FAILURE: Build failed with an exception.

* What went wrong:
Execution failed for task ':streams:upgrade-system-tests-34:test'.
> Process 'Gradle Test Executor 36' finished with non-zero exit value 1
  This problem might be caused by incorrect test process configuration.
  For more on test execution, please refer to https://docs.gradle.org/8.3/userguide/java_testing.html#sec:test_execution in the Gradle documentation.

* Try:
> Run with --stacktrace option to get the stack trace.
> Run with --info or --debug option to get more log output.
> Get more help at https://help.gradle.org.

Deprecated Gradle features were used in this build, making it incompatible with Gradle 9.0.

You can use '--warning-mode all' to show the individual deprecation warnings and determine if they come from your own scripts or plugins.

For more on this, please refer to https://docs.gradle.org/8.3/userguide/command_line_interface.html#sec:command_line_warnings in the Gradle documentation.

BUILD FAILED in 3h 44m 17s
303 actionable tasks: 111 executed, 192 up-to-date

Publishing build scan...
https://ge.apache.org/s/l4w3n5hxhsyi6


See the profiling report at: file:///home/jenkins/workspace/Kafka_kafka_trunk/build/reports/profile/profile-2023-10-26-07-54-45.html
A fine-grained performance profile is available: use the --scan option.
[Pipeline] }
[Pipeline] // withEnv
[Pipeline] }
[Pipeline] // withEnv
[Pipeline] }
[Pipeline] // withEnv
[Pipeline] }
[Pipeline] // node
[Pipeline] }
[Pipeline] // timestamps
[Pipeline] }
[Pipeline] // timeout
[Pipeline] }
[Pipeline] // stage
[Pipeline] }
Failed in branch JDK 21 and Scala 2.13
[Pipeline] // parallel
[Pipeline] }
[Pipeline] // stage
[Pipeline] stage
[Pipeline] { (Declarative: Post Actions)
[Pipeline] script
[Pipeline] {
[Pipeline] node
Running on builds29 in /home/jenkins/workspace/Kafka_kafka_trunk
[Pipeline] {
[Pipeline] step