You are viewing a plain text version of this content. The canonical link for it is here.
Posted to dev@kafka.apache.org by Apache Jenkins Server <je...@builds.apache.org> on 2016/08/19 01:15:05 UTC
Build failed in Jenkins: kafka-0.10.0-jdk7 #190
See <https://builds.apache.org/job/kafka-0.10.0-jdk7/190/changes>
Changes:
[me] KAFKA-4037: Make Connect REST API retries aware of 409 CONFLICT errors
------------------------------------------
[...truncated 6449 lines...]
org.apache.kafka.connect.runtime.WorkerSourceTaskTest > testCommit PASSED
org.apache.kafka.connect.runtime.WorkerSourceTaskTest > testCommitFailure PASSED
org.apache.kafka.connect.runtime.WorkerSourceTaskTest > testSendRecordsConvertsData PASSED
org.apache.kafka.connect.runtime.WorkerSourceTaskTest > testSendRecordsRetries PASSED
org.apache.kafka.connect.runtime.WorkerSourceTaskTest > testSendRecordsTaskCommitRecordFail PASSED
org.apache.kafka.connect.runtime.WorkerSourceTaskTest > testSlowTaskStart PASSED
org.apache.kafka.connect.runtime.distributed.DistributedHerderTest > testPutConnectorConfig PASSED
org.apache.kafka.connect.runtime.distributed.DistributedHerderTest > testRestartTaskRedirectToOwner PASSED
org.apache.kafka.connect.runtime.distributed.DistributedHerderTest > testConnectorConfigAdded PASSED
org.apache.kafka.connect.runtime.distributed.DistributedHerderTest > testConnectorConfigUpdate PASSED
org.apache.kafka.connect.runtime.distributed.DistributedHerderTest > testConnectorPaused PASSED
org.apache.kafka.connect.runtime.distributed.DistributedHerderTest > testConnectorResumed PASSED
org.apache.kafka.connect.runtime.distributed.DistributedHerderTest > testUnknownConnectorPaused PASSED
org.apache.kafka.connect.runtime.distributed.DistributedHerderTest > testConnectorPausedRunningTaskOnly PASSED
org.apache.kafka.connect.runtime.distributed.DistributedHerderTest > testConnectorResumedRunningTaskOnly PASSED
org.apache.kafka.connect.runtime.distributed.DistributedHerderTest > testTaskConfigAdded PASSED
org.apache.kafka.connect.runtime.distributed.DistributedHerderTest > testJoinLeaderCatchUpFails PASSED
org.apache.kafka.connect.runtime.distributed.DistributedHerderTest > testAccessors PASSED
org.apache.kafka.connect.runtime.distributed.DistributedHerderTest > testInconsistentConfigs PASSED
org.apache.kafka.connect.runtime.distributed.DistributedHerderTest > testJoinAssignment PASSED
org.apache.kafka.connect.runtime.distributed.DistributedHerderTest > testRebalance PASSED
org.apache.kafka.connect.runtime.distributed.DistributedHerderTest > testRebalanceFailedConnector PASSED
org.apache.kafka.connect.runtime.distributed.DistributedHerderTest > testHaltCleansUpWorker PASSED
org.apache.kafka.connect.runtime.distributed.DistributedHerderTest > testCreateConnector PASSED
org.apache.kafka.connect.runtime.distributed.DistributedHerderTest > testCreateConnectorAlreadyExists PASSED
org.apache.kafka.connect.runtime.distributed.DistributedHerderTest > testDestroyConnector PASSED
org.apache.kafka.connect.runtime.distributed.DistributedHerderTest > testRestartConnector PASSED
org.apache.kafka.connect.runtime.distributed.DistributedHerderTest > testRestartUnknownConnector PASSED
org.apache.kafka.connect.runtime.distributed.DistributedHerderTest > testRestartConnectorRedirectToLeader PASSED
org.apache.kafka.connect.runtime.distributed.DistributedHerderTest > testRestartConnectorRedirectToOwner PASSED
org.apache.kafka.connect.runtime.distributed.DistributedHerderTest > testRestartTask PASSED
org.apache.kafka.connect.runtime.distributed.DistributedHerderTest > testRestartUnknownTask PASSED
org.apache.kafka.connect.runtime.distributed.DistributedHerderTest > testRestartTaskRedirectToLeader PASSED
org.apache.kafka.connect.runtime.distributed.WorkerCoordinatorTest > testNormalJoinGroupFollower PASSED
org.apache.kafka.connect.runtime.distributed.WorkerCoordinatorTest > testMetadata PASSED
org.apache.kafka.connect.runtime.distributed.WorkerCoordinatorTest > testLeaderPerformAssignment1 PASSED
org.apache.kafka.connect.runtime.distributed.WorkerCoordinatorTest > testLeaderPerformAssignment2 PASSED
org.apache.kafka.connect.runtime.distributed.WorkerCoordinatorTest > testJoinLeaderCannotAssign PASSED
org.apache.kafka.connect.runtime.distributed.WorkerCoordinatorTest > testRejoinGroup PASSED
org.apache.kafka.connect.runtime.distributed.WorkerCoordinatorTest > testNormalJoinGroupLeader PASSED
org.apache.kafka.connect.runtime.standalone.StandaloneHerderTest > testPutConnectorConfig PASSED
org.apache.kafka.connect.runtime.standalone.StandaloneHerderTest > testPutTaskConfigs PASSED
org.apache.kafka.connect.runtime.standalone.StandaloneHerderTest > testAccessors PASSED
org.apache.kafka.connect.runtime.standalone.StandaloneHerderTest > testCreateConnectorAlreadyExists PASSED
org.apache.kafka.connect.runtime.standalone.StandaloneHerderTest > testDestroyConnector PASSED
org.apache.kafka.connect.runtime.standalone.StandaloneHerderTest > testRestartConnector PASSED
org.apache.kafka.connect.runtime.standalone.StandaloneHerderTest > testRestartTask PASSED
org.apache.kafka.connect.runtime.standalone.StandaloneHerderTest > testCreateSourceConnector PASSED
org.apache.kafka.connect.runtime.standalone.StandaloneHerderTest > testCreateSinkConnector PASSED
org.apache.kafka.connect.runtime.standalone.StandaloneHerderTest > testRestartConnectorFailureOnStop PASSED
org.apache.kafka.connect.runtime.standalone.StandaloneHerderTest > testRestartConnectorFailureOnStart PASSED
org.apache.kafka.connect.runtime.standalone.StandaloneHerderTest > testRestartTaskFailureOnStop PASSED
org.apache.kafka.connect.runtime.standalone.StandaloneHerderTest > testRestartTaskFailureOnStart PASSED
org.apache.kafka.connect.runtime.standalone.StandaloneHerderTest > testCreateAndStop PASSED
org.apache.kafka.connect.runtime.WorkerTest > testAddRemoveTask PASSED
org.apache.kafka.connect.runtime.WorkerTest > testStopInvalidTask PASSED
org.apache.kafka.connect.runtime.WorkerTest > testCleanupTasksOnStop PASSED
org.apache.kafka.connect.runtime.WorkerTest > testStartAndStopConnector PASSED
org.apache.kafka.connect.runtime.WorkerTest > testAddConnectorByAlias PASSED
org.apache.kafka.connect.runtime.WorkerTest > testAddConnectorByShortAlias PASSED
org.apache.kafka.connect.runtime.WorkerTest > testStopInvalidConnector PASSED
org.apache.kafka.connect.runtime.WorkerTest > testReconfigureConnectorTasks PASSED
org.apache.kafka.connect.runtime.WorkerConnectorTest > testStartupFailure PASSED
org.apache.kafka.connect.runtime.WorkerConnectorTest > testOnResume PASSED
org.apache.kafka.connect.runtime.WorkerConnectorTest > testStartupPaused PASSED
org.apache.kafka.connect.runtime.WorkerConnectorTest > testTransitionPausedToPaused PASSED
org.apache.kafka.connect.runtime.WorkerConnectorTest > testFailureIsFinalState PASSED
org.apache.kafka.connect.runtime.WorkerConnectorTest > testInitializeFailure PASSED
org.apache.kafka.connect.runtime.WorkerConnectorTest > testStartupAndPause PASSED
org.apache.kafka.connect.runtime.WorkerConnectorTest > testStartupAndShutdown PASSED
org.apache.kafka.connect.runtime.WorkerConnectorTest > testTransitionStartedToStarted PASSED
org.apache.kafka.connect.runtime.WorkerConnectorTest > testShutdownFailure PASSED
org.apache.kafka.connect.runtime.rest.RestServerTest > testCORSEnabled PASSED
org.apache.kafka.connect.runtime.rest.RestServerTest > testCORSDisabled PASSED
org.apache.kafka.connect.runtime.rest.resources.ConnectorPluginsResourceTest > testValidateConfig PASSED
org.apache.kafka.connect.runtime.rest.resources.ConnectorPluginsResourceTest > testListConnectorPlugins FAILED
java.lang.OutOfMemoryError: PermGen space
at java.lang.ClassLoader.defineClass1(Native Method)
at java.lang.ClassLoader.defineClass(ClassLoader.java:800)
at org.powermock.core.classloader.MockClassLoader.loadUnmockedClass(MockClassLoader.java:238)
at org.powermock.core.classloader.MockClassLoader.loadModifiedClass(MockClassLoader.java:182)
at org.powermock.core.classloader.DeferSupportingClassLoader.loadClass(DeferSupportingClassLoader.java:70)
at java.lang.ClassLoader.loadClass(ClassLoader.java:358)
at com.google.common.base.Predicates.<clinit>(Predicates.java:346)
at org.reflections.scanners.AbstractScanner.<init>(AbstractScanner.java:21)
at org.reflections.scanners.TypeAnnotationsScanner.<init>(TypeAnnotationsScanner.java:8)
at org.reflections.util.ConfigurationBuilder.<init>(ConfigurationBuilder.java:53)
at org.apache.kafka.connect.runtime.AbstractHerder.connectorPlugins(AbstractHerder.java:272)
at org.apache.kafka.connect.runtime.rest.resources.ConnectorPluginsResource.listConnectorPlugins(ConnectorPluginsResource.java:57)
at org.apache.kafka.connect.runtime.rest.resources.ConnectorPluginsResourceTest.testListConnectorPlugins(ConnectorPluginsResourceTest.java:165)
org.apache.kafka.connect.runtime.rest.resources.ConnectorsResourceTest > testPutConnectorConfig PASSED
org.apache.kafka.connect.runtime.rest.resources.ConnectorsResourceTest > testCreateConnectorExists PASSED
org.apache.kafka.connect.runtime.rest.resources.ConnectorsResourceTest > testRestartTaskLeaderRedirect PASSED
org.apache.kafka.connect.runtime.rest.resources.ConnectorsResourceTest > testDeleteConnectorNotFound PASSED
org.apache.kafka.connect.runtime.rest.resources.ConnectorsResourceTest > testRestartTaskNotFound PASSED
org.apache.kafka.connect.runtime.rest.resources.ConnectorsResourceTest > testListConnectorsNotSynced PASSED
org.apache.kafka.connect.runtime.rest.resources.ConnectorsResourceTest > testPutConnectorConfigNameMismatch PASSED
org.apache.kafka.connect.runtime.rest.resources.ConnectorsResourceTest > testGetConnectorConfigConnectorNotFound PASSED
org.apache.kafka.connect.runtime.rest.resources.ConnectorsResourceTest > testRestartTaskOwnerRedirect PASSED
org.apache.kafka.connect.runtime.rest.resources.ConnectorsResourceTest > testDeleteConnectorNotLeader PASSED
org.apache.kafka.connect.runtime.rest.resources.ConnectorsResourceTest > testGetConnectorConfig PASSED
org.apache.kafka.connect.runtime.rest.resources.ConnectorsResourceTest > testPutConnectorTaskConfigs PASSED
org.apache.kafka.connect.runtime.rest.resources.ConnectorsResourceTest > testDeleteConnector PASSED
org.apache.kafka.connect.runtime.rest.resources.ConnectorsResourceTest > testListConnectors PASSED
org.apache.kafka.connect.runtime.rest.resources.ConnectorsResourceTest > testRestartConnectorNotFound PASSED
org.apache.kafka.connect.runtime.rest.resources.ConnectorsResourceTest > testRestartConnectorOwnerRedirect PASSED
org.apache.kafka.connect.runtime.rest.resources.ConnectorsResourceTest > testGetConnectorTaskConfigs PASSED
org.apache.kafka.connect.runtime.rest.resources.ConnectorsResourceTest > testCreateConnectorNotLeader PASSED
org.apache.kafka.connect.runtime.rest.resources.ConnectorsResourceTest > testGetConnector PASSED
org.apache.kafka.connect.runtime.rest.resources.ConnectorsResourceTest > testCreateConnector PASSED
org.apache.kafka.connect.runtime.rest.resources.ConnectorsResourceTest > testGetConnectorTaskConfigsConnectorNotFound PASSED
org.apache.kafka.connect.runtime.rest.resources.ConnectorsResourceTest > testListConnectorsNotLeader PASSED
org.apache.kafka.connect.runtime.rest.resources.ConnectorsResourceTest > testRestartConnectorLeaderRedirect PASSED
org.apache.kafka.connect.runtime.rest.resources.ConnectorsResourceTest > testPutConnectorTaskConfigsConnectorNotFound PASSED
org.apache.kafka.connect.runtime.WorkerSinkTaskThreadedTest > testCommitTaskSuccessAndFlushFailure PASSED
org.apache.kafka.connect.runtime.WorkerSinkTaskThreadedTest > testCommitTaskFlushFailure PASSED
org.apache.kafka.connect.runtime.WorkerSinkTaskThreadedTest > testCommitConsumerFailure PASSED
org.apache.kafka.connect.runtime.WorkerSinkTaskThreadedTest > testCommitTimeout PASSED
org.apache.kafka.connect.runtime.WorkerSinkTaskThreadedTest > testPollsInBackground PASSED
org.apache.kafka.connect.runtime.WorkerSinkTaskThreadedTest > testCommit PASSED
org.apache.kafka.connect.runtime.WorkerSinkTaskThreadedTest > testRewind PASSED
org.apache.kafka.connect.runtime.WorkerSinkTaskThreadedTest > testAssignmentPauseResume PASSED
171 tests completed, 1 failed
:connect:runtime:test FAILED
FAILURE: Build failed with an exception.
* What went wrong:
Execution failed for task ':connect:runtime:test'.
> There were failing tests. See the report at: file://<https://builds.apache.org/job/kafka-0.10.0-jdk7/ws/connect/runtime/build/reports/tests/index.html>
* Try:
Run with --stacktrace option to get the stack trace. Run with --info or --debug option to get more log output.
BUILD FAILED
Total time: 1 hrs 54 mins 18.797 secs
Build step 'Execute shell' marked build as failure
Recording test results
Setting GRADLE_2_4_RC_2_HOME=/home/jenkins/jenkins-slave/tools/hudson.plugins.gradle.GradleInstallation/Gradle_2.4-rc-2
Setting GRADLE_2_4_RC_2_HOME=/home/jenkins/jenkins-slave/tools/hudson.plugins.gradle.GradleInstallation/Gradle_2.4-rc-2
Jenkins build is back to normal : kafka-0.10.0-jdk7 #192
Posted by Apache Jenkins Server <je...@builds.apache.org>.
See <https://builds.apache.org/job/kafka-0.10.0-jdk7/192/changes>
Build failed in Jenkins: kafka-0.10.0-jdk7 #191
Posted by Apache Jenkins Server <je...@builds.apache.org>.
See <https://builds.apache.org/job/kafka-0.10.0-jdk7/191/changes>
Changes:
[jjkoshy] KAFKA-4050; Allow configuration of the PRNG used for SSL
------------------------------------------
[...truncated 6131 lines...]
org.apache.kafka.streams.kstream.UnlimitedWindowsTest > shouldIncludeRecordsThatHappenedAfterWindowStart PASSED
org.apache.kafka.streams.kstream.UnlimitedWindowsTest > shouldExcludeRecordsThatHappenedBeforeWindowStart PASSED
org.apache.kafka.streams.kstream.JoinWindowsTest > afterBelowLower PASSED
org.apache.kafka.streams.kstream.JoinWindowsTest > nameMustNotBeEmpty PASSED
org.apache.kafka.streams.kstream.JoinWindowsTest > beforeOverUpper PASSED
org.apache.kafka.streams.kstream.JoinWindowsTest > nameMustNotBeNull PASSED
org.apache.kafka.streams.kstream.JoinWindowsTest > shouldHaveSaneEqualsAndHashCode PASSED
org.apache.kafka.streams.kstream.JoinWindowsTest > validWindows PASSED
org.apache.kafka.streams.kstream.JoinWindowsTest > timeDifferenceMustNotBeNegative PASSED
org.apache.kafka.streams.kstream.TimeWindowsTest > nameMustNotBeEmpty PASSED
org.apache.kafka.streams.kstream.TimeWindowsTest > nameMustNotBeNull PASSED
org.apache.kafka.streams.kstream.TimeWindowsTest > shouldHaveSaneEqualsAndHashCode PASSED
org.apache.kafka.streams.kstream.TimeWindowsTest > windowSizeMustNotBeZero PASSED
org.apache.kafka.streams.kstream.TimeWindowsTest > advanceIntervalMustNotBeZero PASSED
org.apache.kafka.streams.kstream.TimeWindowsTest > windowSizeMustNotBeNegative PASSED
org.apache.kafka.streams.kstream.TimeWindowsTest > advanceIntervalMustNotBeNegative PASSED
org.apache.kafka.streams.kstream.TimeWindowsTest > advanceIntervalMustNotBeLargerThanWindowSize PASSED
org.apache.kafka.streams.kstream.TimeWindowsTest > windowsForTumblingWindows PASSED
org.apache.kafka.streams.kstream.TimeWindowsTest > windowsForHoppingWindows PASSED
org.apache.kafka.streams.kstream.TimeWindowsTest > windowsForBarelyOverlappingHoppingWindows PASSED
org.apache.kafka.streams.kstream.KStreamBuilderTest > testMerge PASSED
org.apache.kafka.streams.kstream.KStreamBuilderTest > testFrom PASSED
org.apache.kafka.streams.kstream.KStreamBuilderTest > testNewName PASSED
org.apache.kafka.streams.KeyValueTest > shouldHaveSaneEqualsAndHashCode PASSED
org.apache.kafka.streams.KafkaStreamsTest > classMethod FAILED
java.lang.OutOfMemoryError: Java heap space
org.apache.kafka.streams.state.internals.OffsetCheckpointTest > testReadWrite PASSED
org.apache.kafka.streams.state.internals.InMemoryLRUCacheStoreTest > testEvict PASSED
org.apache.kafka.streams.state.internals.InMemoryLRUCacheStoreTest > testPutIfAbsent PASSED
org.apache.kafka.streams.state.internals.InMemoryLRUCacheStoreTest > testRestoreWithDefaultSerdes PASSED
org.apache.kafka.streams.state.internals.InMemoryLRUCacheStoreTest > testRestore PASSED
org.apache.kafka.streams.state.internals.InMemoryLRUCacheStoreTest > testPutGetRange PASSED
org.apache.kafka.streams.state.internals.InMemoryLRUCacheStoreTest > testPutGetRangeWithDefaultSerdes PASSED
org.apache.kafka.streams.state.internals.InMemoryKeyValueStoreTest > testPutIfAbsent PASSED
org.apache.kafka.streams.state.internals.InMemoryKeyValueStoreTest > testRestoreWithDefaultSerdes PASSED
org.apache.kafka.streams.state.internals.InMemoryKeyValueStoreTest > testRestore PASSED
org.apache.kafka.streams.state.internals.InMemoryKeyValueStoreTest > testPutGetRange PASSED
org.apache.kafka.streams.state.internals.InMemoryKeyValueStoreTest > testPutGetRangeWithDefaultSerdes PASSED
org.apache.kafka.streams.state.internals.RocksDBKeyValueStoreTest > testPutIfAbsent PASSED
org.apache.kafka.streams.state.internals.RocksDBKeyValueStoreTest > testRestoreWithDefaultSerdes PASSED
org.apache.kafka.streams.state.internals.RocksDBKeyValueStoreTest > testRestore PASSED
org.apache.kafka.streams.state.internals.RocksDBKeyValueStoreTest > testPutGetRange PASSED
org.apache.kafka.streams.state.internals.RocksDBKeyValueStoreTest > testPutGetRangeWithDefaultSerdes PASSED
org.apache.kafka.streams.state.internals.RocksDBWindowStoreTest > testPutAndFetch PASSED
org.apache.kafka.streams.state.internals.RocksDBWindowStoreTest > testPutAndFetchBefore PASSED
org.apache.kafka.streams.state.internals.RocksDBWindowStoreTest > testInitialLoading PASSED
org.apache.kafka.streams.state.internals.RocksDBWindowStoreTest > testRestore PASSED
org.apache.kafka.streams.state.internals.RocksDBWindowStoreTest > testRolling PASSED
org.apache.kafka.streams.state.internals.RocksDBWindowStoreTest > testSegmentMaintenance PASSED
org.apache.kafka.streams.state.internals.RocksDBWindowStoreTest > testPutSameKeyTimestamp PASSED
org.apache.kafka.streams.state.internals.RocksDBWindowStoreTest > testPutAndFetchAfter PASSED
org.apache.kafka.streams.state.internals.StoreChangeLoggerTest > testAddRemove PASSED
org.apache.kafka.streams.processor.DefaultPartitionGrouperTest > testGrouping PASSED
org.apache.kafka.streams.processor.internals.ProcessorTopologyTest > testDrivingMultiplexingTopology PASSED
org.apache.kafka.streams.processor.internals.ProcessorTopologyTest > testDrivingStatefulTopology PASSED
org.apache.kafka.streams.processor.internals.ProcessorTopologyTest > testDrivingSimpleTopology PASSED
org.apache.kafka.streams.processor.internals.ProcessorTopologyTest > testTopologyMetadata PASSED
org.apache.kafka.streams.processor.internals.ProcessorTopologyTest > testDrivingMultiplexByNameTopology PASSED
org.apache.kafka.streams.processor.internals.RecordCollectorTest > testSpecificPartition PASSED
org.apache.kafka.streams.processor.internals.RecordCollectorTest > testStreamPartitioner PASSED
org.apache.kafka.streams.processor.internals.StandbyTaskTest > testStorePartitions PASSED
org.apache.kafka.streams.processor.internals.StandbyTaskTest > testUpdateKTable PASSED
org.apache.kafka.streams.processor.internals.StandbyTaskTest > testUpdateNonPersistentStore PASSED
org.apache.kafka.streams.processor.internals.StandbyTaskTest > testUpdate PASSED
org.apache.kafka.streams.processor.internals.PartitionGroupTest > testTimeTracking PASSED
org.apache.kafka.streams.processor.internals.assignment.AssginmentInfoTest > testEncodeDecode PASSED
org.apache.kafka.streams.processor.internals.assignment.SubscriptionInfoTest > testEncodeDecode PASSED
org.apache.kafka.streams.processor.internals.assignment.TaskAssignorTest > testStickiness PASSED
org.apache.kafka.streams.processor.internals.assignment.TaskAssignorTest > testAssignWithStandby PASSED
org.apache.kafka.streams.processor.internals.assignment.TaskAssignorTest > testAssignWithoutStandby PASSED
org.apache.kafka.streams.processor.internals.PunctuationQueueTest > testPunctuationInterval PASSED
org.apache.kafka.streams.processor.internals.QuickUnionTest > testUnite PASSED
org.apache.kafka.streams.processor.internals.QuickUnionTest > testUniteMany PASSED
org.apache.kafka.streams.processor.internals.ProcessorStateManagerTest > testRegisterNonPersistentStore PASSED
org.apache.kafka.streams.processor.internals.ProcessorStateManagerTest > testLockStateDirectory PASSED
org.apache.kafka.streams.processor.internals.ProcessorStateManagerTest > testGetStore PASSED
org.apache.kafka.streams.processor.internals.ProcessorStateManagerTest > testClose PASSED
org.apache.kafka.streams.processor.internals.ProcessorStateManagerTest > testChangeLogOffsets PASSED
org.apache.kafka.streams.processor.internals.ProcessorStateManagerTest > testRegisterPersistentStore PASSED
org.apache.kafka.streams.processor.internals.ProcessorStateManagerTest > testNoTopic PASSED
org.apache.kafka.streams.processor.internals.RecordQueueTest > testTimeTracking PASSED
org.apache.kafka.streams.processor.internals.StreamTaskTest > testProcessOrder PASSED
org.apache.kafka.streams.processor.internals.StreamTaskTest > testPauseResume PASSED
org.apache.kafka.streams.processor.internals.StreamTaskTest > testMaybePunctuate PASSED
org.apache.kafka.streams.processor.internals.StreamThreadTest > testInjectClients PASSED
org.apache.kafka.streams.processor.internals.StreamThreadTest > testMaybeCommit PASSED
org.apache.kafka.streams.processor.internals.StreamThreadTest > testPartitionAssignmentChange PASSED
org.apache.kafka.streams.processor.internals.StreamThreadTest > testMaybeClean PASSED
org.apache.kafka.streams.processor.internals.MinTimestampTrackerTest > testTracking PASSED
org.apache.kafka.streams.processor.internals.StreamPartitionAssignorTest > testAssignWithStandbyReplicas PASSED
org.apache.kafka.streams.processor.internals.StreamPartitionAssignorTest > testAssignWithNewTasks PASSED
org.apache.kafka.streams.processor.internals.StreamPartitionAssignorTest > testAssignWithStates PASSED
org.apache.kafka.streams.processor.internals.StreamPartitionAssignorTest > testAssignBasic PASSED
org.apache.kafka.streams.processor.internals.StreamPartitionAssignorTest > testOnAssignment PASSED
org.apache.kafka.streams.processor.internals.StreamPartitionAssignorTest > testSubscription PASSED
org.apache.kafka.streams.processor.internals.StreamPartitionAssignorTest > testAssignWithInternalTopics PASSED
org.apache.kafka.streams.processor.TopologyBuilderTest > testSourceTopics PASSED
org.apache.kafka.streams.processor.TopologyBuilderTest > testAddSinkWithSameName PASSED
org.apache.kafka.streams.processor.TopologyBuilderTest > testAddSinkWithSelfParent PASSED
org.apache.kafka.streams.processor.TopologyBuilderTest > testAddProcessorWithSelfParent PASSED
org.apache.kafka.streams.processor.TopologyBuilderTest > testAddStateStoreWithSink PASSED
org.apache.kafka.streams.processor.TopologyBuilderTest > testTopicGroups PASSED
org.apache.kafka.streams.processor.TopologyBuilderTest > testBuild PASSED
org.apache.kafka.streams.processor.TopologyBuilderTest > testAddStateStoreWithSource PASSED
org.apache.kafka.streams.processor.TopologyBuilderTest > testAddSourceWithSameName PASSED
org.apache.kafka.streams.processor.TopologyBuilderTest > testAddProcessorWithSameName PASSED
org.apache.kafka.streams.processor.TopologyBuilderTest > testAddSourceWithSameTopic PASSED
org.apache.kafka.streams.processor.TopologyBuilderTest > testTopicGroupsByStateStore PASSED
org.apache.kafka.streams.processor.TopologyBuilderTest > testAddStateStoreWithDuplicates PASSED
org.apache.kafka.streams.processor.TopologyBuilderTest > testAddSinkWithWrongParent PASSED
org.apache.kafka.streams.processor.TopologyBuilderTest > testAddSinkConnectedWithMultipleParent PASSED
org.apache.kafka.streams.processor.TopologyBuilderTest > testAddProcessorWithWrongParent PASSED
org.apache.kafka.streams.processor.TopologyBuilderTest > testAddStateStore PASSED
org.apache.kafka.streams.processor.TopologyBuilderTest > testAddSinkConnectedWithParent PASSED
org.apache.kafka.streams.processor.TopologyBuilderTest > testAddStateStoreWithNonExistingProcessor PASSED
188 tests completed, 1 failed
:streams:test FAILED
FAILURE: Build failed with an exception.
* What went wrong:
Execution failed for task ':streams:test'.
> There were failing tests. See the report at: file://<https://builds.apache.org/job/kafka-0.10.0-jdk7/ws/streams/build/reports/tests/index.html>
* Try:
Run with --stacktrace option to get the stack trace. Run with --info or --debug option to get more log output.
BUILD FAILED
Total time: 1 hrs 4 mins 32.078 secs
Build step 'Execute shell' marked build as failure
Recording test results
Setting GRADLE_2_4_RC_2_HOME=/home/jenkins/jenkins-slave/tools/hudson.plugins.gradle.GradleInstallation/Gradle_2.4-rc-2
Setting GRADLE_2_4_RC_2_HOME=/home/jenkins/jenkins-slave/tools/hudson.plugins.gradle.GradleInstallation/Gradle_2.4-rc-2