You are viewing a plain text version of this content. The canonical link for it is here.
Posted to builds@beam.apache.org by Apache Jenkins Server <je...@builds.apache.org> on 2021/08/25 07:24:13 UTC

Build failed in Jenkins: beam_PostCommit_Java_Nexmark_Dataflow_V2_Java11 #371

See <https://ci-beam.apache.org/job/beam_PostCommit_Java_Nexmark_Dataflow_V2_Java11/371/display/redirect?page=changes>

Changes:

[Robert Burke] [BEAM-9615] Report Row as Known URN

[noreply] Merge pull request #15357 from [BEAM-12781] Add memoization of


------------------------------------------
[...truncated 673.80 KB...]
2021-08-25T07:17:51.435Z no activity
2021-08-25T07:18:06.476Z RUNNING Query7
2021-08-25T07:18:07.171Z sample of 46.8 sec not long enough to calculate steady-state event rate
Aug 25, 2021 7:18:07 AM org.apache.beam.sdk.testutils.metrics.MetricsReader getCounterMetric
SEVERE: Failed to get metric fatal, from namespace Query7
2021-08-25T07:18:07.228Z WARNING: streaming query appears to have been stuck for 56 min.
2021-08-25T07:18:07.228Z no activity
2021-08-25T07:18:22.265Z RUNNING Query7
2021-08-25T07:18:22.908Z sample of 46.8 sec not long enough to calculate steady-state event rate
Aug 25, 2021 7:18:22 AM org.apache.beam.sdk.testutils.metrics.MetricsReader getCounterMetric
SEVERE: Failed to get metric fatal, from namespace Query7
2021-08-25T07:18:22.968Z WARNING: streaming query appears to have been stuck for 57 min.
2021-08-25T07:18:22.968Z no activity
2021-08-25T07:18:38.014Z RUNNING Query7
2021-08-25T07:18:38.662Z sample of 46.8 sec not long enough to calculate steady-state event rate
Aug 25, 2021 7:18:38 AM org.apache.beam.sdk.testutils.metrics.MetricsReader getCounterMetric
SEVERE: Failed to get metric fatal, from namespace Query7
2021-08-25T07:18:38.720Z WARNING: streaming query appears to have been stuck for 57 min.
2021-08-25T07:18:38.720Z no activity
2021-08-25T07:18:53.751Z RUNNING Query7
2021-08-25T07:18:54.436Z sample of 46.8 sec not long enough to calculate steady-state event rate
Aug 25, 2021 7:18:54 AM org.apache.beam.sdk.testutils.metrics.MetricsReader getCounterMetric
SEVERE: Failed to get metric fatal, from namespace Query7
2021-08-25T07:18:54.515Z WARNING: streaming query appears to have been stuck for 57 min.
2021-08-25T07:18:54.515Z no activity
2021-08-25T07:19:09.554Z RUNNING Query7
2021-08-25T07:19:10.149Z sample of 46.8 sec not long enough to calculate steady-state event rate
Aug 25, 2021 7:19:10 AM org.apache.beam.sdk.testutils.metrics.MetricsReader getCounterMetric
SEVERE: Failed to get metric fatal, from namespace Query7
2021-08-25T07:19:10.213Z WARNING: streaming query appears to have been stuck for 57 min.
2021-08-25T07:19:10.213Z no activity
2021-08-25T07:19:25.244Z RUNNING Query7
2021-08-25T07:19:26.078Z sample of 46.8 sec not long enough to calculate steady-state event rate
Aug 25, 2021 7:19:26 AM org.apache.beam.sdk.testutils.metrics.MetricsReader getCounterMetric
2021-08-25T07:19:26.131Z WARNING: streaming query appears to have been stuck for 58 min.
2021-08-25T07:19:26.131Z no activity
SEVERE: Failed to get metric fatal, from namespace Query7
2021-08-25T07:19:41.182Z RUNNING Query7
2021-08-25T07:19:42.084Z sample of 46.8 sec not long enough to calculate steady-state event rate
Aug 25, 2021 7:19:42 AM org.apache.beam.sdk.testutils.metrics.MetricsReader getCounterMetric
2021-08-25T07:19:42.136Z WARNING: streaming query appears to have been stuck for 58 min.
2021-08-25T07:19:42.136Z no activity
SEVERE: Failed to get metric fatal, from namespace Query7
2021-08-25T07:19:57.164Z RUNNING Query7
2021-08-25T07:19:57.815Z sample of 46.8 sec not long enough to calculate steady-state event rate
Aug 25, 2021 7:19:57 AM org.apache.beam.sdk.testutils.metrics.MetricsReader getCounterMetric
SEVERE: Failed to get metric fatal, from namespace Query7
2021-08-25T07:19:57.874Z WARNING: streaming query appears to have been stuck for 58 min.
2021-08-25T07:19:57.874Z no activity
2021-08-25T07:20:12.913Z RUNNING Query7
2021-08-25T07:20:13.609Z sample of 46.8 sec not long enough to calculate steady-state event rate
Aug 25, 2021 7:20:13 AM org.apache.beam.sdk.testutils.metrics.MetricsReader getCounterMetric
SEVERE: Failed to get metric fatal, from namespace Query7
2021-08-25T07:20:13.663Z WARNING: streaming query appears to have been stuck for 58 min.
2021-08-25T07:20:13.663Z no activity
2021-08-25T07:20:28.699Z RUNNING Query7
2021-08-25T07:20:29.460Z sample of 46.8 sec not long enough to calculate steady-state event rate
Aug 25, 2021 7:20:29 AM org.apache.beam.sdk.testutils.metrics.MetricsReader getCounterMetric
2021-08-25T07:20:29.550Z WARNING: streaming query appears to have been stuck for 59 min.
SEVERE: Failed to get metric fatal, from namespace Query7
2021-08-25T07:20:29.550Z no activity
2021-08-25T07:20:44.585Z RUNNING Query7
2021-08-25T07:20:45.236Z sample of 46.8 sec not long enough to calculate steady-state event rate
Aug 25, 2021 7:20:45 AM org.apache.beam.sdk.testutils.metrics.MetricsReader getCounterMetric
2021-08-25T07:20:45.326Z WARNING: streaming query appears to have been stuck for 59 min.
2021-08-25T07:20:45.326Z no activity
SEVERE: Failed to get metric fatal, from namespace Query7
2021-08-25T07:21:00.356Z RUNNING Query7
2021-08-25T07:21:01.009Z sample of 46.8 sec not long enough to calculate steady-state event rate
Aug 25, 2021 7:21:01 AM org.apache.beam.sdk.testutils.metrics.MetricsReader getCounterMetric
SEVERE: Failed to get metric fatal, from namespace Query7
2021-08-25T07:21:01.085Z WARNING: streaming query appears to have been stuck for 59 min.
2021-08-25T07:21:01.085Z no activity
2021-08-25T07:21:16.125Z RUNNING Query7
2021-08-25T07:21:16.790Z sample of 46.8 sec not long enough to calculate steady-state event rate
Aug 25, 2021 7:21:16 AM org.apache.beam.sdk.testutils.metrics.MetricsReader getCounterMetric
SEVERE: Failed to get metric fatal, from namespace Query7
2021-08-25T07:21:16.851Z WARNING: streaming query appears to have been stuck for 59 min.
2021-08-25T07:21:16.851Z no activity
2021-08-25T07:21:31.886Z RUNNING Query7
2021-08-25T07:21:32.578Z sample of 46.8 sec not long enough to calculate steady-state event rate
Aug 25, 2021 7:21:32 AM org.apache.beam.sdk.testutils.metrics.MetricsReader getCounterMetric
SEVERE: Failed to get metric fatal, from namespace Query7
2021-08-25T07:21:32.642Z ERROR: streaming query appears to have been stuck for 60 minutes, cancelling job.
2021-08-25T07:21:32.682Z no activity
2021-08-25T07:21:47.741Z RUNNING Query7 (waiting for shutdown)
2021-08-25T07:21:48.384Z sample of 46.8 sec not long enough to calculate steady-state event rate
2021-08-25T07:21:48.384Z no activity
2021-08-25T07:22:03.428Z RUNNING Query7 (waiting for shutdown)
2021-08-25T07:22:04.095Z sample of 46.8 sec not long enough to calculate steady-state event rate
2021-08-25T07:22:04.095Z no activity
2021-08-25T07:22:19.134Z RUNNING Query7 (waiting for shutdown)
2021-08-25T07:22:19.751Z sample of 46.8 sec not long enough to calculate steady-state event rate
2021-08-25T07:22:19.751Z no activity
2021-08-25T07:22:34.794Z RUNNING Query7 (waiting for shutdown)
2021-08-25T07:22:35.440Z sample of 46.8 sec not long enough to calculate steady-state event rate
2021-08-25T07:22:35.440Z no activity
2021-08-25T07:22:50.473Z RUNNING Query7 (waiting for shutdown)
2021-08-25T07:22:51.046Z sample of 46.8 sec not long enough to calculate steady-state event rate
2021-08-25T07:22:51.046Z no activity
2021-08-25T07:23:06.074Z RUNNING Query7 (waiting for shutdown)
2021-08-25T07:23:06.706Z sample of 46.8 sec not long enough to calculate steady-state event rate
2021-08-25T07:23:06.706Z no activity
2021-08-25T07:23:21.738Z RUNNING Query7 (waiting for shutdown)
2021-08-25T07:23:22.385Z sample of 46.8 sec not long enough to calculate steady-state event rate
2021-08-25T07:23:22.385Z no activity
2021-08-25T07:23:37.430Z RUNNING Query7 (waiting for shutdown)
2021-08-25T07:23:38.022Z sample of 46.8 sec not long enough to calculate steady-state event rate
2021-08-25T07:23:38.022Z no activity
2021-08-25T07:23:53.055Z RUNNING Query7 (waiting for shutdown)
2021-08-25T07:23:53.306Z sample of 46.8 sec not long enough to calculate steady-state event rate
2021-08-25T07:23:53.306Z no activity
2021-08-25T07:24:08.306Z CANCELLED Query7 (waiting for shutdown)
2021-08-25T07:24:08.307Z sample of 46.8 sec not long enough to calculate steady-state event rate

==========================================================================================
Run started 2021-08-25T06:12:33.787Z and ran for PT4294.520S

Default configuration:
{"debug":true,"query":null,"sourceType":"DIRECT","generateEventFilePathPrefix":null,"sinkType":"DEVNULL","exportSummaryToBigQuery":false,"pubSubMode":"COMBINED","pubsubMessageSerializationMethod":"CODER","sideInputType":"DIRECT","sideInputRowCount":500,"sideInputNumShards":3,"sideInputUrl":null,"sessionGap":600000,"numEvents":100000,"numEventGenerators":100,"rateShape":"SINE","firstEventRate":10000,"nextEventRate":10000,"rateUnit":"PER_SECOND","ratePeriodSec":600,"preloadSeconds":0,"streamTimeout":240,"isRateLimited":false,"useWallclockEventTime":false,"avgPersonByteSize":200,"avgAuctionByteSize":500,"avgBidByteSize":100,"hotAuctionRatio":2,"hotSellersRatio":4,"hotBiddersRatio":4,"windowSizeSec":10,"windowPeriodSec":5,"watermarkHoldbackSec":0,"numInFlightAuctions":100,"numActivePeople":1000,"coderStrategy":"HAND","cpuDelayMs":0,"diskBusyBytes":0,"auctionSkip":123,"fanout":5,"maxAuctionsWaitingTime":600,"occasionalDelaySec":3,"probDelayedEvent":0.1,"maxLogEvents":100000,"usePubsubPublishTime":false,"outOfOrderGroupSize":1,"numKeyBuckets":20000,"pardoCPUFactor":1.0}

Configurations:
  Conf  Description
  0000  query:PASSTHROUGH; numEvents:10000000
  0001  query:CURRENCY_CONVERSION; numEvents:10000000
  0002  query:SELECTION; numEvents:10000000
  0003  query:LOCAL_ITEM_SUGGESTION; numEvents:10000000
  0004  query:AVERAGE_PRICE_FOR_CATEGORY; numEvents:1000000
  0005  query:HOT_ITEMS; numEvents:10000000
  0006  query:AVERAGE_SELLING_PRICE_BY_SELLER; numEvents:1000000
  0007  query:HIGHEST_BID; numEvents:10000000
  0008  query:MONITOR_NEW_USERS; numEvents:10000000
  0009  query:WINNING_BIDS; numEvents:1000000
  0010  query:LOG_TO_SHARDED_FILES; numEvents:10000000
  0011  query:USER_SESSIONS; numEvents:10000000
  0012  query:PROCESSING_TIME_WINDOWS; numEvents:10000000
  0013  query:PORTABILITY_BATCH; numEvents:10000000
  0014  query:BOUNDED_SIDE_INPUT_JOIN; numEvents:10000000
  0015  query:SESSION_SIDE_INPUT_JOIN; numEvents:10000000

Performance:
  Conf  Runtime(sec)    (Baseline)  Events(/sec)    (Baseline)       Results    (Baseline)
  0000          34.5                    196054.7                     6766828              
  0001          30.3                    291736.1                     8135892              
  0002          20.6                    441703.3                       79422              
  0003          81.8                    122291.2                       59507              
  0004  *** not run ***
  0005         498.3                     19776.2                        4488              
  0006  *** not run ***
  0007         333.6                     29967.8                         100              
        *** Cancelling streaming job since it appeared stuck for 60 min. ***
  0008         128.6                     77753.2                       92833              
  0009  *** not run ***
  0010         133.4                     74131.2                         100              
  0011         452.2                     22112.3                     1839657              
  0012         126.1                     73364.1                      300696              
  0013  *** not run ***
  0014  *** not run ***
  0015  *** not run ***
==========================================================================================


==========================================================================================
Run started 2021-08-25T06:12:33.787Z and ran for PT4294.722S

Default configuration:
{"debug":true,"query":null,"sourceType":"DIRECT","generateEventFilePathPrefix":null,"sinkType":"DEVNULL","exportSummaryToBigQuery":false,"pubSubMode":"COMBINED","pubsubMessageSerializationMethod":"CODER","sideInputType":"DIRECT","sideInputRowCount":500,"sideInputNumShards":3,"sideInputUrl":null,"sessionGap":600000,"numEvents":100000,"numEventGenerators":100,"rateShape":"SINE","firstEventRate":10000,"nextEventRate":10000,"rateUnit":"PER_SECOND","ratePeriodSec":600,"preloadSeconds":0,"streamTimeout":240,"isRateLimited":false,"useWallclockEventTime":false,"avgPersonByteSize":200,"avgAuctionByteSize":500,"avgBidByteSize":100,"hotAuctionRatio":2,"hotSellersRatio":4,"hotBiddersRatio":4,"windowSizeSec":10,"windowPeriodSec":5,"watermarkHoldbackSec":0,"numInFlightAuctions":100,"numActivePeople":1000,"coderStrategy":"HAND","cpuDelayMs":0,"diskBusyBytes":0,"auctionSkip":123,"fanout":5,"maxAuctionsWaitingTime":600,"occasionalDelaySec":3,"probDelayedEvent":0.1,"maxLogEvents":100000,"usePubsubPublishTime":false,"outOfOrderGroupSize":1,"numKeyBuckets":20000,"pardoCPUFactor":1.0}

Configurations:
  Conf  Description
  0000  query:PASSTHROUGH; numEvents:10000000
  0001  query:CURRENCY_CONVERSION; numEvents:10000000
  0002  query:SELECTION; numEvents:10000000
  0003  query:LOCAL_ITEM_SUGGESTION; numEvents:10000000
  0004  query:AVERAGE_PRICE_FOR_CATEGORY; numEvents:1000000
  0005  query:HOT_ITEMS; numEvents:10000000
  0006  query:AVERAGE_SELLING_PRICE_BY_SELLER; numEvents:1000000
  0007  query:HIGHEST_BID; numEvents:10000000
  0008  query:MONITOR_NEW_USERS; numEvents:10000000
  0009  query:WINNING_BIDS; numEvents:1000000
  0010  query:LOG_TO_SHARDED_FILES; numEvents:10000000
  0011  query:USER_SESSIONS; numEvents:10000000
  0012  query:PROCESSING_TIME_WINDOWS; numEvents:10000000
  0013  query:PORTABILITY_BATCH; numEvents:10000000
  0014  query:BOUNDED_SIDE_INPUT_JOIN; numEvents:10000000
  0015  query:SESSION_SIDE_INPUT_JOIN; numEvents:10000000

Performance:
  Conf  Runtime(sec)    (Baseline)  Events(/sec)    (Baseline)       Results    (Baseline)
  0000          34.5                    196054.7                     6766828              
  0001          30.3                    291736.1                     8135892              
  0002          20.6                    441703.3                       79422              
  0003          81.8                    122291.2                       59507              
  0004  *** not run ***
  0005         498.3                     19776.2                        4488              
  0006  *** not run ***
  0007         333.6                     29967.8                         100              
        *** Cancelling streaming job since it appeared stuck for 60 min. ***
  0008         128.6                     77753.2                       92833              
  0009  *** not run ***
  0010         133.4                     74131.2                         100              
  0011         452.2                     22112.3                     1839657              
  0012         126.1                     73364.1                      300696              
  0013  *** not run ***
  0014  *** not run ***
  0015  *** not run ***
==========================================================================================

Exception in thread "main" java.lang.RuntimeException: Execution was not successful
	at org.apache.beam.sdk.nexmark.Main.runAll(Main.java:186)
	at org.apache.beam.sdk.nexmark.Main.main(Main.java:495)

> Task :sdks:java:testing:nexmark:run FAILED

> Task :runners:google-cloud-dataflow-java:cleanUpDockerImages
Untagged: us.gcr.io/apache-beam-testing/java-postcommit-it/java:20210825061153
Untagged: us.gcr.io/apache-beam-testing/java-postcommit-it/java@sha256:75790be94a58d5edf5c4623a18f4a8d75f3c84d7769d82c04124b5544cf8eaef
Tag: [us.gcr.io/apache-beam-testing/java-postcommit-it/java:20210825061153]
- referencing digest: [us.gcr.io/apache-beam-testing/java-postcommit-it/java@sha256:75790be94a58d5edf5c4623a18f4a8d75f3c84d7769d82c04124b5544cf8eaef]

Deleted [[us.gcr.io/apache-beam-testing/java-postcommit-it/java:20210825061153] (referencing [us.gcr.io/apache-beam-testing/java-postcommit-it/java@sha256:75790be94a58d5edf5c4623a18f4a8d75f3c84d7769d82c04124b5544cf8eaef])].
Removing untagged image us.gcr.io/apache-beam-testing/java-postcommit-it/java@sha256:75790be94a58d5edf5c4623a18f4a8d75f3c84d7769d82c04124b5544cf8eaef
Digests:
- us.gcr.io/apache-beam-testing/java-postcommit-it/java@sha256:75790be94a58d5edf5c4623a18f4a8d75f3c84d7769d82c04124b5544cf8eaef
Deleted [us.gcr.io/apache-beam-testing/java-postcommit-it/java@sha256:75790be94a58d5edf5c4623a18f4a8d75f3c84d7769d82c04124b5544cf8eaef].

FAILURE: Build failed with an exception.

* What went wrong:
Execution failed for task ':sdks:java:testing:nexmark:run'.
> Process 'command '/usr/lib/jvm/java-8-openjdk-amd64/bin/java'' finished with non-zero exit value 1

* Try:
Run with --stacktrace option to get the stack trace. Run with --info or --debug option to get more log output. Run with --scan to get full insights.

* Get more help at https://help.gradle.org

Deprecated Gradle features were used in this build, making it incompatible with Gradle 7.0.
Use '--warning-mode all' to show the individual deprecation warnings.
See https://docs.gradle.org/6.8.3/userguide/command_line_interface.html#sec:command_line_warnings

BUILD FAILED in 1h 12m 21s
123 actionable tasks: 10 executed, 113 up-to-date

Publishing build scan...
https://gradle.com/s/nvsguejglfumm

Build step 'Invoke Gradle script' changed build result to FAILURE
Build step 'Invoke Gradle script' marked build as failure

---------------------------------------------------------------------
To unsubscribe, e-mail: builds-unsubscribe@beam.apache.org
For additional commands, e-mail: builds-help@beam.apache.org


Jenkins build is back to normal : beam_PostCommit_Java_Nexmark_Dataflow_V2_Java11 #373

Posted by Apache Jenkins Server <je...@builds.apache.org>.
See <https://ci-beam.apache.org/job/beam_PostCommit_Java_Nexmark_Dataflow_V2_Java11/373/display/redirect?page=changes>


---------------------------------------------------------------------
To unsubscribe, e-mail: builds-unsubscribe@beam.apache.org
For additional commands, e-mail: builds-help@beam.apache.org


Build failed in Jenkins: beam_PostCommit_Java_Nexmark_Dataflow_V2_Java11 #372

Posted by Apache Jenkins Server <je...@builds.apache.org>.
See <https://ci-beam.apache.org/job/beam_PostCommit_Java_Nexmark_Dataflow_V2_Java11/372/display/redirect>

Changes:


------------------------------------------
[...truncated 509.16 KB...]
    result = self._call_chain(*args)
  File "/usr/lib/python3.5/urllib/request.py", line 444, in _call_chain
    result = func(*args)
  File "/usr/lib/python3.5/urllib/request.py", line 696, in http_error_302
    return self.parent.open(new, timeout=req.timeout)
  File "/usr/lib/python3.5/urllib/request.py", line 472, in open
    response = meth(req, response)
  File "/usr/lib/python3.5/urllib/request.py", line 582, in http_response
    'http', request, response, code, msg, hdrs)
  File "/usr/lib/python3.5/urllib/request.py", line 510, in error
    return self._call_chain(*args)
  File "/usr/lib/python3.5/urllib/request.py", line 444, in _call_chain
    result = func(*args)
  File "/usr/lib/python3.5/urllib/request.py", line 590, in http_error_default
    raise HTTPError(req.full_url, code, msg, hdrs, fp)
urllib.error.HTTPError: HTTP Error 502: Bad Gateway
ERROR:root:Invalid url for slf4j-api-1.7.30: http://www.opensource.org/licenses/mit-license.php. Retrying...
Traceback (most recent call last):
  File "<https://ci-beam.apache.org/job/beam_PostCommit_Java_Nexmark_Dataflow_V2_Java11/ws/src/sdks/java/container/license_scripts/pull_licenses_java.py",> line 53, in pull_from_url
    url_read = urlopen(url)
  File "/usr/lib/python3.5/urllib/request.py", line 163, in urlopen
    return opener.open(url, data, timeout)
  File "/usr/lib/python3.5/urllib/request.py", line 472, in open
    response = meth(req, response)
  File "/usr/lib/python3.5/urllib/request.py", line 582, in http_response
    'http', request, response, code, msg, hdrs)
  File "/usr/lib/python3.5/urllib/request.py", line 504, in error
    result = self._call_chain(*args)
  File "/usr/lib/python3.5/urllib/request.py", line 444, in _call_chain
    result = func(*args)
  File "/usr/lib/python3.5/urllib/request.py", line 696, in http_error_302
    return self.parent.open(new, timeout=req.timeout)
  File "/usr/lib/python3.5/urllib/request.py", line 472, in open
    response = meth(req, response)
  File "/usr/lib/python3.5/urllib/request.py", line 582, in http_response
    'http', request, response, code, msg, hdrs)
  File "/usr/lib/python3.5/urllib/request.py", line 504, in error
    result = self._call_chain(*args)
  File "/usr/lib/python3.5/urllib/request.py", line 444, in _call_chain
    result = func(*args)
  File "/usr/lib/python3.5/urllib/request.py", line 696, in http_error_302
    return self.parent.open(new, timeout=req.timeout)
  File "/usr/lib/python3.5/urllib/request.py", line 472, in open
    response = meth(req, response)
  File "/usr/lib/python3.5/urllib/request.py", line 582, in http_response
    'http', request, response, code, msg, hdrs)
  File "/usr/lib/python3.5/urllib/request.py", line 510, in error
    return self._call_chain(*args)
  File "/usr/lib/python3.5/urllib/request.py", line 444, in _call_chain
    result = func(*args)
  File "/usr/lib/python3.5/urllib/request.py", line 590, in http_error_default
    raise HTTPError(req.full_url, code, msg, hdrs, fp)
urllib.error.HTTPError: HTTP Error 502: Bad Gateway
ERROR:root:Invalid url for slf4j-simple-1.7.30: http://www.opensource.org/licenses/mit-license.php after 9 retries.
Traceback (most recent call last):
  File "<https://ci-beam.apache.org/job/beam_PostCommit_Java_Nexmark_Dataflow_V2_Java11/ws/src/sdks/java/container/license_scripts/pull_licenses_java.py",> line 53, in pull_from_url
    url_read = urlopen(url)
  File "/usr/lib/python3.5/urllib/request.py", line 163, in urlopen
    return opener.open(url, data, timeout)
  File "/usr/lib/python3.5/urllib/request.py", line 472, in open
    response = meth(req, response)
  File "/usr/lib/python3.5/urllib/request.py", line 582, in http_response
    'http', request, response, code, msg, hdrs)
  File "/usr/lib/python3.5/urllib/request.py", line 510, in error
    return self._call_chain(*args)
  File "/usr/lib/python3.5/urllib/request.py", line 444, in _call_chain
    result = func(*args)
  File "/usr/lib/python3.5/urllib/request.py", line 590, in http_error_default
    raise HTTPError(req.full_url, code, msg, hdrs, fp)
urllib.error.HTTPError: HTTP Error 502: Bad Gateway
ERROR:root:Invalid url for grpc-core-1.37.0: https://opensource.org/licenses/Apache-2.0. Retrying...
Traceback (most recent call last):
  File "<https://ci-beam.apache.org/job/beam_PostCommit_Java_Nexmark_Dataflow_V2_Java11/ws/src/sdks/java/container/license_scripts/pull_licenses_java.py",> line 53, in pull_from_url
    url_read = urlopen(url)
  File "/usr/lib/python3.5/urllib/request.py", line 163, in urlopen
    return opener.open(url, data, timeout)
  File "/usr/lib/python3.5/urllib/request.py", line 472, in open
    response = meth(req, response)
  File "/usr/lib/python3.5/urllib/request.py", line 582, in http_response
    'http', request, response, code, msg, hdrs)
  File "/usr/lib/python3.5/urllib/request.py", line 504, in error
    result = self._call_chain(*args)
  File "/usr/lib/python3.5/urllib/request.py", line 444, in _call_chain
    result = func(*args)
  File "/usr/lib/python3.5/urllib/request.py", line 696, in http_error_302
    return self.parent.open(new, timeout=req.timeout)
  File "/usr/lib/python3.5/urllib/request.py", line 472, in open
    response = meth(req, response)
  File "/usr/lib/python3.5/urllib/request.py", line 582, in http_response
    'http', request, response, code, msg, hdrs)
  File "/usr/lib/python3.5/urllib/request.py", line 504, in error
    result = self._call_chain(*args)
  File "/usr/lib/python3.5/urllib/request.py", line 444, in _call_chain
    result = func(*args)
  File "/usr/lib/python3.5/urllib/request.py", line 696, in http_error_302
    return self.parent.open(new, timeout=req.timeout)
  File "/usr/lib/python3.5/urllib/request.py", line 472, in open
    response = meth(req, response)
  File "/usr/lib/python3.5/urllib/request.py", line 582, in http_response
    'http', request, response, code, msg, hdrs)
  File "/usr/lib/python3.5/urllib/request.py", line 510, in error
    return self._call_chain(*args)
  File "/usr/lib/python3.5/urllib/request.py", line 444, in _call_chain
    result = func(*args)
  File "/usr/lib/python3.5/urllib/request.py", line 590, in http_error_default
    raise HTTPError(req.full_url, code, msg, hdrs, fp)
urllib.error.HTTPError: HTTP Error 502: Bad Gateway
ERROR:root:Invalid url for slf4j-api-1.7.30: http://www.opensource.org/licenses/mit-license.php. Retrying...
Traceback (most recent call last):
  File "<https://ci-beam.apache.org/job/beam_PostCommit_Java_Nexmark_Dataflow_V2_Java11/ws/src/sdks/java/container/license_scripts/pull_licenses_java.py",> line 53, in pull_from_url
    url_read = urlopen(url)
  File "/usr/lib/python3.5/urllib/request.py", line 163, in urlopen
    return opener.open(url, data, timeout)
  File "/usr/lib/python3.5/urllib/request.py", line 472, in open
    response = meth(req, response)
  File "/usr/lib/python3.5/urllib/request.py", line 582, in http_response
    'http', request, response, code, msg, hdrs)
  File "/usr/lib/python3.5/urllib/request.py", line 510, in error
    return self._call_chain(*args)
  File "/usr/lib/python3.5/urllib/request.py", line 444, in _call_chain
    result = func(*args)
  File "/usr/lib/python3.5/urllib/request.py", line 590, in http_error_default
    raise HTTPError(req.full_url, code, msg, hdrs, fp)
urllib.error.HTTPError: HTTP Error 502: Bad Gateway
ERROR:root:Invalid url for grpc-core-1.37.0: https://opensource.org/licenses/Apache-2.0. Retrying...
Traceback (most recent call last):
  File "<https://ci-beam.apache.org/job/beam_PostCommit_Java_Nexmark_Dataflow_V2_Java11/ws/src/sdks/java/container/license_scripts/pull_licenses_java.py",> line 53, in pull_from_url
    url_read = urlopen(url)
  File "/usr/lib/python3.5/urllib/request.py", line 163, in urlopen
    return opener.open(url, data, timeout)
  File "/usr/lib/python3.5/urllib/request.py", line 472, in open
    response = meth(req, response)
  File "/usr/lib/python3.5/urllib/request.py", line 582, in http_response
    'http', request, response, code, msg, hdrs)
  File "/usr/lib/python3.5/urllib/request.py", line 504, in error
    result = self._call_chain(*args)
  File "/usr/lib/python3.5/urllib/request.py", line 444, in _call_chain
    result = func(*args)
  File "/usr/lib/python3.5/urllib/request.py", line 696, in http_error_302
    return self.parent.open(new, timeout=req.timeout)
  File "/usr/lib/python3.5/urllib/request.py", line 472, in open
    response = meth(req, response)
  File "/usr/lib/python3.5/urllib/request.py", line 582, in http_response
    'http', request, response, code, msg, hdrs)
  File "/usr/lib/python3.5/urllib/request.py", line 504, in error
    result = self._call_chain(*args)
  File "/usr/lib/python3.5/urllib/request.py", line 444, in _call_chain
    result = func(*args)
  File "/usr/lib/python3.5/urllib/request.py", line 696, in http_error_302
    return self.parent.open(new, timeout=req.timeout)
  File "/usr/lib/python3.5/urllib/request.py", line 472, in open
    response = meth(req, response)
  File "/usr/lib/python3.5/urllib/request.py", line 582, in http_response
    'http', request, response, code, msg, hdrs)
  File "/usr/lib/python3.5/urllib/request.py", line 510, in error
    return self._call_chain(*args)
  File "/usr/lib/python3.5/urllib/request.py", line 444, in _call_chain
    result = func(*args)
  File "/usr/lib/python3.5/urllib/request.py", line 590, in http_error_default
    raise HTTPError(req.full_url, code, msg, hdrs, fp)
urllib.error.HTTPError: HTTP Error 502: Bad Gateway
ERROR:root:Invalid url for slf4j-api-1.7.30: http://www.opensource.org/licenses/mit-license.php. Retrying...
Traceback (most recent call last):
  File "<https://ci-beam.apache.org/job/beam_PostCommit_Java_Nexmark_Dataflow_V2_Java11/ws/src/sdks/java/container/license_scripts/pull_licenses_java.py",> line 53, in pull_from_url
    url_read = urlopen(url)
  File "/usr/lib/python3.5/urllib/request.py", line 163, in urlopen
    return opener.open(url, data, timeout)
  File "/usr/lib/python3.5/urllib/request.py", line 472, in open
    response = meth(req, response)
  File "/usr/lib/python3.5/urllib/request.py", line 582, in http_response
    'http', request, response, code, msg, hdrs)
  File "/usr/lib/python3.5/urllib/request.py", line 510, in error
    return self._call_chain(*args)
  File "/usr/lib/python3.5/urllib/request.py", line 444, in _call_chain
    result = func(*args)
  File "/usr/lib/python3.5/urllib/request.py", line 590, in http_error_default
    raise HTTPError(req.full_url, code, msg, hdrs, fp)
urllib.error.HTTPError: HTTP Error 502: Bad Gateway
ERROR:root:Invalid url for grpc-core-1.37.0: https://opensource.org/licenses/Apache-2.0. Retrying...
Traceback (most recent call last):
  File "<https://ci-beam.apache.org/job/beam_PostCommit_Java_Nexmark_Dataflow_V2_Java11/ws/src/sdks/java/container/license_scripts/pull_licenses_java.py",> line 53, in pull_from_url
    url_read = urlopen(url)
  File "/usr/lib/python3.5/urllib/request.py", line 163, in urlopen
    return opener.open(url, data, timeout)
  File "/usr/lib/python3.5/urllib/request.py", line 472, in open
    response = meth(req, response)
  File "/usr/lib/python3.5/urllib/request.py", line 582, in http_response
    'http', request, response, code, msg, hdrs)
  File "/usr/lib/python3.5/urllib/request.py", line 504, in error
    result = self._call_chain(*args)
  File "/usr/lib/python3.5/urllib/request.py", line 444, in _call_chain
    result = func(*args)
  File "/usr/lib/python3.5/urllib/request.py", line 696, in http_error_302
    return self.parent.open(new, timeout=req.timeout)
  File "/usr/lib/python3.5/urllib/request.py", line 472, in open
    response = meth(req, response)
  File "/usr/lib/python3.5/urllib/request.py", line 582, in http_response
    'http', request, response, code, msg, hdrs)
  File "/usr/lib/python3.5/urllib/request.py", line 504, in error
    result = self._call_chain(*args)
  File "/usr/lib/python3.5/urllib/request.py", line 444, in _call_chain
    result = func(*args)
  File "/usr/lib/python3.5/urllib/request.py", line 696, in http_error_302
    return self.parent.open(new, timeout=req.timeout)
  File "/usr/lib/python3.5/urllib/request.py", line 472, in open
    response = meth(req, response)
  File "/usr/lib/python3.5/urllib/request.py", line 582, in http_response
    'http', request, response, code, msg, hdrs)
  File "/usr/lib/python3.5/urllib/request.py", line 510, in error
    return self._call_chain(*args)
  File "/usr/lib/python3.5/urllib/request.py", line 444, in _call_chain
    result = func(*args)
  File "/usr/lib/python3.5/urllib/request.py", line 590, in http_error_default
    raise HTTPError(req.full_url, code, msg, hdrs, fp)
urllib.error.HTTPError: HTTP Error 502: Bad Gateway
ERROR:root:Invalid url for slf4j-api-1.7.30: http://www.opensource.org/licenses/mit-license.php. Retrying...
ERROR:root:['zstd-jni-1.4.3-1', 'grpc-api-1.37.0', 'grpc-grpclb-1.37.0', 'grpc-stub-1.37.0', 'protobuf-java-3.15.8', 'google-auth-library-credentials-0.25.2', 'checker-compat-qual-2.5.3', 'classgraph-4.8.104', 'reflectasm-1.07', 'junit-quickcheck-core-0.8', 'kryo-2.21', 'jopt-simple-4.6', 'software-and-algorithms-1.0', 'hamcrest-2.1', 'reflection-util-0.0.2', 'pcollections-2.1.2', 'zstd-jni-1.4.5-2', 'grpc-auth-1.37.0', 'grpc-protobuf-1.37.0', 'perfmark-api-0.23.0', 'protobuf-java-util-3.15.8', 'grpc-alts-1.37.0', 'google-auth-library-oauth2-http-0.25.2', 'checker-compat-qual-2.5.5', 'duct-tape-1.0.8', 'require-javadoc-0.1.0', 'kafka-1.15.1', 'minlog-1.2', 'slf4j-jdk14-1.7.30', 'plume-util-1.0.6', 'grpc-context-1.37.0', 'grpc-protobuf-lite-1.37.0', 'visible-assertions-2.1.2', 'slf4j-simple-1.7.30']
ERROR:root:**************************************** Licenses were not able to be pulled automatically for some dependencies. Please search source code of the dependencies on the internet and add "license" and "notice" (if available) field to <https://ci-beam.apache.org/job/beam_PostCommit_Java_Nexmark_Dataflow_V2_Java11/ws/src/sdks/java/container/license_scripts/dep_urls_java.yaml> for each missing license. Dependency List: [checker-compat-qual-2.5.3,checker-compat-qual-2.5.5,classgraph-4.8.104,duct-tape-1.0.8,google-auth-library-credentials-0.25.2,google-auth-library-oauth2-http-0.25.2,grpc-alts-1.37.0,grpc-api-1.37.0,grpc-auth-1.37.0,grpc-context-1.37.0,grpc-grpclb-1.37.0,grpc-protobuf-1.37.0,grpc-protobuf-lite-1.37.0,grpc-stub-1.37.0,hamcrest-2.1,jopt-simple-4.6,junit-quickcheck-core-0.8,kafka-1.15.1,kryo-2.21,minlog-1.2,pcollections-2.1.2,perfmark-api-0.23.0,plume-util-1.0.6,protobuf-java-3.15.8,protobuf-java-util-3.15.8,reflectasm-1.07,reflection-util-0.0.2,require-javadoc-0.1.0,slf4j-jdk14-1.7.30,slf4j-simple-1.7.30,software-and-algorithms-1.0,visible-assertions-2.1.2,zstd-jni-1.4.3-1,zstd-jni-1.4.5-2]
INFO:root:pull_licenses_java.py failed. It took 146.579328 seconds with 16 threads.
Traceback (most recent call last):
  File "<https://ci-beam.apache.org/job/beam_PostCommit_Java_Nexmark_Dataflow_V2_Java11/ws/src/sdks/java/container/license_scripts/pull_licenses_java.py",> line 315, in <module>
    error_msg)
RuntimeError: ('1 error(s) occurred.', ['**************************************** Licenses were not able to be pulled automatically for some dependencies. Please search source code of the dependencies on the internet and add "license" and "notice" (if available) field to <https://ci-beam.apache.org/job/beam_PostCommit_Java_Nexmark_Dataflow_V2_Java11/ws/src/sdks/java/container/license_scripts/dep_urls_java.yaml> for each missing license. Dependency List: [checker-compat-qual-2.5.3,checker-compat-qual-2.5.5,classgraph-4.8.104,duct-tape-1.0.8,google-auth-library-credentials-0.25.2,google-auth-library-oauth2-http-0.25.2,grpc-alts-1.37.0,grpc-api-1.37.0,grpc-auth-1.37.0,grpc-context-1.37.0,grpc-grpclb-1.37.0,grpc-protobuf-1.37.0,grpc-protobuf-lite-1.37.0,grpc-stub-1.37.0,hamcrest-2.1,jopt-simple-4.6,junit-quickcheck-core-0.8,kafka-1.15.1,kryo-2.21,minlog-1.2,pcollections-2.1.2,perfmark-api-0.23.0,plume-util-1.0.6,protobuf-java-3.15.8,protobuf-java-util-3.15.8,reflectasm-1.07,reflection-util-0.0.2,require-javadoc-0.1.0,slf4j-jdk14-1.7.30,slf4j-simple-1.7.30,software-and-algorithms-1.0,visible-assertions-2.1.2,zstd-jni-1.4.3-1,zstd-jni-1.4.5-2]'])

> Task :sdks:java:container:pullLicenses FAILED

FAILURE: Build failed with an exception.

* What went wrong:
Execution failed for task ':sdks:java:container:pullLicenses'.
> Process 'command './license_scripts/license_script.sh'' finished with non-zero exit value 1

* Try:
Run with --stacktrace option to get the stack trace. Run with --info or --debug option to get more log output. Run with --scan to get full insights.

* Get more help at https://help.gradle.org

Deprecated Gradle features were used in this build, making it incompatible with Gradle 7.0.
Use '--warning-mode all' to show the individual deprecation warnings.
See https://docs.gradle.org/6.8.3/userguide/command_line_interface.html#sec:command_line_warnings

BUILD FAILED in 3m 44s
122 actionable tasks: 83 executed, 37 from cache, 2 up-to-date

Publishing build scan...
https://gradle.com/s/rghjuwxyaucjq

Build step 'Invoke Gradle script' changed build result to FAILURE
Build step 'Invoke Gradle script' marked build as failure

---------------------------------------------------------------------
To unsubscribe, e-mail: builds-unsubscribe@beam.apache.org
For additional commands, e-mail: builds-help@beam.apache.org