You are viewing a plain text version of this content. The canonical link for it is here.
Posted to notification@tuscany.apache.org by Apache Jenkins Server <je...@builds.apache.org> on 2013/06/27 03:38:48 UTC

Build failed in Jenkins: Tuscany-2x » Apache Tuscany SCA iTest WS with WSPolicy #1060

See <https://builds.apache.org/job/Tuscany-2x/org.apache.tuscany.sca$itest-ws-wspolicy/1060/>

------------------------------------------
[INFO] ------------------------------------------------------------------------
[INFO] Building Apache Tuscany SCA iTest WS with WSPolicy
[INFO]    task-segment: [clean, install]
[INFO] ------------------------------------------------------------------------
[INFO] [clean:clean {execution: default-clean}]
[INFO] [enforcer:enforce {execution: enforce-plugin-versions}]
[INFO] [remote-resources:process {execution: default}]
[INFO] [resources:resources {execution: default-resources}]
[INFO] Using 'UTF-8' encoding to copy filtered resources.
[INFO] Copying 6 resources
[INFO] Copying 1 resource
[INFO] Copying 3 resources
[INFO] [compiler:compile {execution: default-compile}]
[INFO] Compiling 4 source files to <https://builds.apache.org/job/Tuscany-2x/org.apache.tuscany.sca$itest-ws-wspolicy/ws/target/classes>
[INFO] -------------------------------------------------------------
[ERROR] COMPILATION ERROR : 
[INFO] -------------------------------------------------------------
[ERROR] <https://builds.apache.org/job/Tuscany-2x/org.apache.tuscany.sca$itest-ws-wspolicy/ws/src/main/java/org/apache/tuscany/sca/binding/ws/axis2/helloworld/ServerPWCBHandler.java>:[27,29] package org.apache.ws.security does not exist

[ERROR] <https://builds.apache.org/job/Tuscany-2x/org.apache.tuscany.sca$itest-ws-wspolicy/ws/src/main/java/org/apache/tuscany/sca/binding/ws/axis2/helloworld/ServerPWCBHandler.java>:[38,12] cannot find symbol
symbol  : class WSPasswordCallback
location: class org.apache.tuscany.sca.binding.ws.axis2.helloworld.ServerPWCBHandler

[ERROR] <https://builds.apache.org/job/Tuscany-2x/org.apache.tuscany.sca$itest-ws-wspolicy/ws/src/main/java/org/apache/tuscany/sca/binding/ws/axis2/helloworld/ServerPWCBHandler.java>:[38,39] cannot find symbol
symbol  : class WSPasswordCallback
location: class org.apache.tuscany.sca.binding.ws.axis2.helloworld.ServerPWCBHandler

[ERROR] <https://builds.apache.org/job/Tuscany-2x/org.apache.tuscany.sca$itest-ws-wspolicy/ws/src/main/java/org/apache/tuscany/sca/binding/ws/axis2/helloworld/ServerPWCBHandler.java>:[42,36] cannot find symbol
symbol  : variable WSPasswordCallback
location: class org.apache.tuscany.sca.binding.ws.axis2.helloworld.ServerPWCBHandler

[ERROR] <https://builds.apache.org/job/Tuscany-2x/org.apache.tuscany.sca$itest-ws-wspolicy/ws/src/main/java/org/apache/tuscany/sca/binding/ws/axis2/helloworld/ServerPWCBHandler.java>:[49,43] cannot find symbol
symbol  : variable WSPasswordCallback
location: class org.apache.tuscany.sca.binding.ws.axis2.helloworld.ServerPWCBHandler

[INFO] 5 errors 
[INFO] -------------------------------------------------------------
[JENKINS] Archiving disabled
[INFO] ------------------------------------------------------------------------
[ERROR] BUILD FAILURE
[INFO] ------------------------------------------------------------------------
[INFO] Compilation failure

<https://builds.apache.org/job/Tuscany-2x/org.apache.tuscany.sca$itest-ws-wspolicy/ws/src/main/java/org/apache/tuscany/sca/binding/ws/axis2/helloworld/ServerPWCBHandler.java>:[27,29] package org.apache.ws.security does not exist

<https://builds.apache.org/job/Tuscany-2x/org.apache.tuscany.sca$itest-ws-wspolicy/ws/src/main/java/org/apache/tuscany/sca/binding/ws/axis2/helloworld/ServerPWCBHandler.java>:[38,12] cannot find symbol
symbol  : class WSPasswordCallback
location: class org.apache.tuscany.sca.binding.ws.axis2.helloworld.ServerPWCBHandler

<https://builds.apache.org/job/Tuscany-2x/org.apache.tuscany.sca$itest-ws-wspolicy/ws/src/main/java/org/apache/tuscany/sca/binding/ws/axis2/helloworld/ServerPWCBHandler.java>:[38,39] cannot find symbol
symbol  : class WSPasswordCallback
location: class org.apache.tuscany.sca.binding.ws.axis2.helloworld.ServerPWCBHandler

<https://builds.apache.org/job/Tuscany-2x/org.apache.tuscany.sca$itest-ws-wspolicy/ws/src/main/java/org/apache/tuscany/sca/binding/ws/axis2/helloworld/ServerPWCBHandler.java>:[42,36] cannot find symbol
symbol  : variable WSPasswordCallback
location: class org.apache.tuscany.sca.binding.ws.axis2.helloworld.ServerPWCBHandler

<https://builds.apache.org/job/Tuscany-2x/org.apache.tuscany.sca$itest-ws-wspolicy/ws/src/main/java/org/apache/tuscany/sca/binding/ws/axis2/helloworld/ServerPWCBHandler.java>:[49,43] cannot find symbol
symbol  : variable WSPasswordCallback
location: class org.apache.tuscany.sca.binding.ws.axis2.helloworld.ServerPWCBHandler


[INFO] ------------------------------------------------------------------------
[INFO] For more information, run Maven with the -e switch
[INFO] ------------------------------------------------------------------------
[INFO] Total time: 31 minutes 7 seconds
[INFO] Finished at: Thu Jun 27 01:35:39 UTC 2013
[INFO] Final Memory: 737M/910M
[INFO] ------------------------------------------------------------------------
Maven failed with error.

Build failed in Jenkins: Tuscany-2x » Apache Tuscany SCA iTest WS with WSPolicy #1075

Posted by Apache Jenkins Server <je...@builds.apache.org>.
See <https://builds.apache.org/job/Tuscany-2x/org.apache.tuscany.sca$itest-ws-wspolicy/1075/>

------------------------------------------
[INFO] ------------------------------------------------------------------------
[INFO] Building Apache Tuscany SCA iTest WS with WSPolicy
[INFO]    task-segment: [clean, install]
[INFO] ------------------------------------------------------------------------
[INFO] [clean:clean {execution: default-clean}]
[INFO] [enforcer:enforce {execution: enforce-plugin-versions}]
[INFO] [remote-resources:process {execution: default}]
[INFO] [resources:resources {execution: default-resources}]
[INFO] Using 'UTF-8' encoding to copy filtered resources.
[INFO] Copying 6 resources
[INFO] Copying 1 resource
[INFO] Copying 3 resources
[INFO] [compiler:compile {execution: default-compile}]
[INFO] Compiling 4 source files to <https://builds.apache.org/job/Tuscany-2x/org.apache.tuscany.sca$itest-ws-wspolicy/ws/target/classes>
[INFO] -------------------------------------------------------------
[ERROR] COMPILATION ERROR : 
[INFO] -------------------------------------------------------------
[ERROR] <https://builds.apache.org/job/Tuscany-2x/org.apache.tuscany.sca$itest-ws-wspolicy/ws/src/main/java/org/apache/tuscany/sca/binding/ws/axis2/helloworld/ServerPWCBHandler.java>:[27,29] package org.apache.ws.security does not exist

[ERROR] <https://builds.apache.org/job/Tuscany-2x/org.apache.tuscany.sca$itest-ws-wspolicy/ws/src/main/java/org/apache/tuscany/sca/binding/ws/axis2/helloworld/ServerPWCBHandler.java>:[38,12] cannot find symbol
symbol  : class WSPasswordCallback
location: class org.apache.tuscany.sca.binding.ws.axis2.helloworld.ServerPWCBHandler

[ERROR] <https://builds.apache.org/job/Tuscany-2x/org.apache.tuscany.sca$itest-ws-wspolicy/ws/src/main/java/org/apache/tuscany/sca/binding/ws/axis2/helloworld/ServerPWCBHandler.java>:[38,39] cannot find symbol
symbol  : class WSPasswordCallback
location: class org.apache.tuscany.sca.binding.ws.axis2.helloworld.ServerPWCBHandler

[ERROR] <https://builds.apache.org/job/Tuscany-2x/org.apache.tuscany.sca$itest-ws-wspolicy/ws/src/main/java/org/apache/tuscany/sca/binding/ws/axis2/helloworld/ServerPWCBHandler.java>:[42,36] cannot find symbol
symbol  : variable WSPasswordCallback
location: class org.apache.tuscany.sca.binding.ws.axis2.helloworld.ServerPWCBHandler

[ERROR] <https://builds.apache.org/job/Tuscany-2x/org.apache.tuscany.sca$itest-ws-wspolicy/ws/src/main/java/org/apache/tuscany/sca/binding/ws/axis2/helloworld/ServerPWCBHandler.java>:[49,43] cannot find symbol
symbol  : variable WSPasswordCallback
location: class org.apache.tuscany.sca.binding.ws.axis2.helloworld.ServerPWCBHandler

[INFO] 5 errors 
[INFO] -------------------------------------------------------------
[JENKINS] Archiving disabled
[INFO] ------------------------------------------------------------------------
[ERROR] BUILD FAILURE
[INFO] ------------------------------------------------------------------------
[INFO] Compilation failure

<https://builds.apache.org/job/Tuscany-2x/org.apache.tuscany.sca$itest-ws-wspolicy/ws/src/main/java/org/apache/tuscany/sca/binding/ws/axis2/helloworld/ServerPWCBHandler.java>:[27,29] package org.apache.ws.security does not exist

<https://builds.apache.org/job/Tuscany-2x/org.apache.tuscany.sca$itest-ws-wspolicy/ws/src/main/java/org/apache/tuscany/sca/binding/ws/axis2/helloworld/ServerPWCBHandler.java>:[38,12] cannot find symbol
symbol  : class WSPasswordCallback
location: class org.apache.tuscany.sca.binding.ws.axis2.helloworld.ServerPWCBHandler

<https://builds.apache.org/job/Tuscany-2x/org.apache.tuscany.sca$itest-ws-wspolicy/ws/src/main/java/org/apache/tuscany/sca/binding/ws/axis2/helloworld/ServerPWCBHandler.java>:[38,39] cannot find symbol
symbol  : class WSPasswordCallback
location: class org.apache.tuscany.sca.binding.ws.axis2.helloworld.ServerPWCBHandler

<https://builds.apache.org/job/Tuscany-2x/org.apache.tuscany.sca$itest-ws-wspolicy/ws/src/main/java/org/apache/tuscany/sca/binding/ws/axis2/helloworld/ServerPWCBHandler.java>:[42,36] cannot find symbol
symbol  : variable WSPasswordCallback
location: class org.apache.tuscany.sca.binding.ws.axis2.helloworld.ServerPWCBHandler

<https://builds.apache.org/job/Tuscany-2x/org.apache.tuscany.sca$itest-ws-wspolicy/ws/src/main/java/org/apache/tuscany/sca/binding/ws/axis2/helloworld/ServerPWCBHandler.java>:[49,43] cannot find symbol
symbol  : variable WSPasswordCallback
location: class org.apache.tuscany.sca.binding.ws.axis2.helloworld.ServerPWCBHandler


[INFO] ------------------------------------------------------------------------
[INFO] For more information, run Maven with the -e switch
[INFO] ------------------------------------------------------------------------
[INFO] Total time: 40 minutes 46 seconds
[INFO] Finished at: Sun Jul 14 02:16:33 UTC 2013
[INFO] Final Memory: 730M/910M
[INFO] ------------------------------------------------------------------------
Maven failed with error.

Build failed in Jenkins: Tuscany-2x » Apache Tuscany SCA iTest WS with WSPolicy #1074

Posted by Apache Jenkins Server <je...@builds.apache.org>.
See <https://builds.apache.org/job/Tuscany-2x/org.apache.tuscany.sca$itest-ws-wspolicy/1074/>

------------------------------------------
[INFO] ------------------------------------------------------------------------
[INFO] Building Apache Tuscany SCA iTest WS with WSPolicy
[INFO]    task-segment: [clean, install]
[INFO] ------------------------------------------------------------------------
[INFO] [clean:clean {execution: default-clean}]
[INFO] [enforcer:enforce {execution: enforce-plugin-versions}]
[INFO] [remote-resources:process {execution: default}]
[INFO] [resources:resources {execution: default-resources}]
[INFO] Using 'UTF-8' encoding to copy filtered resources.
[INFO] Copying 6 resources
[INFO] Copying 1 resource
[INFO] Copying 3 resources
[INFO] [compiler:compile {execution: default-compile}]
[INFO] Compiling 4 source files to <https://builds.apache.org/job/Tuscany-2x/org.apache.tuscany.sca$itest-ws-wspolicy/ws/target/classes>
[INFO] -------------------------------------------------------------
[ERROR] COMPILATION ERROR : 
[INFO] -------------------------------------------------------------
[ERROR] <https://builds.apache.org/job/Tuscany-2x/org.apache.tuscany.sca$itest-ws-wspolicy/ws/src/main/java/org/apache/tuscany/sca/binding/ws/axis2/helloworld/ServerPWCBHandler.java>:[27,29] package org.apache.ws.security does not exist

[ERROR] <https://builds.apache.org/job/Tuscany-2x/org.apache.tuscany.sca$itest-ws-wspolicy/ws/src/main/java/org/apache/tuscany/sca/binding/ws/axis2/helloworld/ServerPWCBHandler.java>:[38,12] cannot find symbol
symbol  : class WSPasswordCallback
location: class org.apache.tuscany.sca.binding.ws.axis2.helloworld.ServerPWCBHandler

[ERROR] <https://builds.apache.org/job/Tuscany-2x/org.apache.tuscany.sca$itest-ws-wspolicy/ws/src/main/java/org/apache/tuscany/sca/binding/ws/axis2/helloworld/ServerPWCBHandler.java>:[38,39] cannot find symbol
symbol  : class WSPasswordCallback
location: class org.apache.tuscany.sca.binding.ws.axis2.helloworld.ServerPWCBHandler

[ERROR] <https://builds.apache.org/job/Tuscany-2x/org.apache.tuscany.sca$itest-ws-wspolicy/ws/src/main/java/org/apache/tuscany/sca/binding/ws/axis2/helloworld/ServerPWCBHandler.java>:[42,36] cannot find symbol
symbol  : variable WSPasswordCallback
location: class org.apache.tuscany.sca.binding.ws.axis2.helloworld.ServerPWCBHandler

[ERROR] <https://builds.apache.org/job/Tuscany-2x/org.apache.tuscany.sca$itest-ws-wspolicy/ws/src/main/java/org/apache/tuscany/sca/binding/ws/axis2/helloworld/ServerPWCBHandler.java>:[49,43] cannot find symbol
symbol  : variable WSPasswordCallback
location: class org.apache.tuscany.sca.binding.ws.axis2.helloworld.ServerPWCBHandler

[INFO] 5 errors 
[INFO] -------------------------------------------------------------
[JENKINS] Archiving disabled
[INFO] ------------------------------------------------------------------------
[ERROR] BUILD FAILURE
[INFO] ------------------------------------------------------------------------
[INFO] Compilation failure

<https://builds.apache.org/job/Tuscany-2x/org.apache.tuscany.sca$itest-ws-wspolicy/ws/src/main/java/org/apache/tuscany/sca/binding/ws/axis2/helloworld/ServerPWCBHandler.java>:[27,29] package org.apache.ws.security does not exist

<https://builds.apache.org/job/Tuscany-2x/org.apache.tuscany.sca$itest-ws-wspolicy/ws/src/main/java/org/apache/tuscany/sca/binding/ws/axis2/helloworld/ServerPWCBHandler.java>:[38,12] cannot find symbol
symbol  : class WSPasswordCallback
location: class org.apache.tuscany.sca.binding.ws.axis2.helloworld.ServerPWCBHandler

<https://builds.apache.org/job/Tuscany-2x/org.apache.tuscany.sca$itest-ws-wspolicy/ws/src/main/java/org/apache/tuscany/sca/binding/ws/axis2/helloworld/ServerPWCBHandler.java>:[38,39] cannot find symbol
symbol  : class WSPasswordCallback
location: class org.apache.tuscany.sca.binding.ws.axis2.helloworld.ServerPWCBHandler

<https://builds.apache.org/job/Tuscany-2x/org.apache.tuscany.sca$itest-ws-wspolicy/ws/src/main/java/org/apache/tuscany/sca/binding/ws/axis2/helloworld/ServerPWCBHandler.java>:[42,36] cannot find symbol
symbol  : variable WSPasswordCallback
location: class org.apache.tuscany.sca.binding.ws.axis2.helloworld.ServerPWCBHandler

<https://builds.apache.org/job/Tuscany-2x/org.apache.tuscany.sca$itest-ws-wspolicy/ws/src/main/java/org/apache/tuscany/sca/binding/ws/axis2/helloworld/ServerPWCBHandler.java>:[49,43] cannot find symbol
symbol  : variable WSPasswordCallback
location: class org.apache.tuscany.sca.binding.ws.axis2.helloworld.ServerPWCBHandler


[INFO] ------------------------------------------------------------------------
[INFO] For more information, run Maven with the -e switch
[INFO] ------------------------------------------------------------------------
[INFO] Total time: 40 minutes 25 seconds
[INFO] Finished at: Thu Jul 11 02:15:23 UTC 2013
[INFO] Final Memory: 732M/910M
[INFO] ------------------------------------------------------------------------
Maven failed with error.

Build failed in Jenkins: Tuscany-2x » Apache Tuscany SCA iTest WS with WSPolicy #1073

Posted by Apache Jenkins Server <je...@builds.apache.org>.
See <https://builds.apache.org/job/Tuscany-2x/org.apache.tuscany.sca$itest-ws-wspolicy/1073/>

------------------------------------------
[INFO] ------------------------------------------------------------------------
[INFO] Building Apache Tuscany SCA iTest WS with WSPolicy
[INFO]    task-segment: [clean, install]
[INFO] ------------------------------------------------------------------------
[INFO] [clean:clean {execution: default-clean}]
[INFO] [enforcer:enforce {execution: enforce-plugin-versions}]
[INFO] [remote-resources:process {execution: default}]
[INFO] [resources:resources {execution: default-resources}]
[INFO] Using 'UTF-8' encoding to copy filtered resources.
[INFO] Copying 6 resources
[INFO] Copying 1 resource
[INFO] Copying 3 resources
[INFO] [compiler:compile {execution: default-compile}]
[INFO] Compiling 4 source files to <https://builds.apache.org/job/Tuscany-2x/org.apache.tuscany.sca$itest-ws-wspolicy/ws/target/classes>
[INFO] -------------------------------------------------------------
[ERROR] COMPILATION ERROR : 
[INFO] -------------------------------------------------------------
[ERROR] <https://builds.apache.org/job/Tuscany-2x/org.apache.tuscany.sca$itest-ws-wspolicy/ws/src/main/java/org/apache/tuscany/sca/binding/ws/axis2/helloworld/ServerPWCBHandler.java>:[27,29] package org.apache.ws.security does not exist

[ERROR] <https://builds.apache.org/job/Tuscany-2x/org.apache.tuscany.sca$itest-ws-wspolicy/ws/src/main/java/org/apache/tuscany/sca/binding/ws/axis2/helloworld/ServerPWCBHandler.java>:[38,12] cannot find symbol
symbol  : class WSPasswordCallback
location: class org.apache.tuscany.sca.binding.ws.axis2.helloworld.ServerPWCBHandler

[ERROR] <https://builds.apache.org/job/Tuscany-2x/org.apache.tuscany.sca$itest-ws-wspolicy/ws/src/main/java/org/apache/tuscany/sca/binding/ws/axis2/helloworld/ServerPWCBHandler.java>:[38,39] cannot find symbol
symbol  : class WSPasswordCallback
location: class org.apache.tuscany.sca.binding.ws.axis2.helloworld.ServerPWCBHandler

[ERROR] <https://builds.apache.org/job/Tuscany-2x/org.apache.tuscany.sca$itest-ws-wspolicy/ws/src/main/java/org/apache/tuscany/sca/binding/ws/axis2/helloworld/ServerPWCBHandler.java>:[42,36] cannot find symbol
symbol  : variable WSPasswordCallback
location: class org.apache.tuscany.sca.binding.ws.axis2.helloworld.ServerPWCBHandler

[ERROR] <https://builds.apache.org/job/Tuscany-2x/org.apache.tuscany.sca$itest-ws-wspolicy/ws/src/main/java/org/apache/tuscany/sca/binding/ws/axis2/helloworld/ServerPWCBHandler.java>:[49,43] cannot find symbol
symbol  : variable WSPasswordCallback
location: class org.apache.tuscany.sca.binding.ws.axis2.helloworld.ServerPWCBHandler

[INFO] 5 errors 
[INFO] -------------------------------------------------------------
[JENKINS] Archiving disabled
[INFO] ------------------------------------------------------------------------
[ERROR] BUILD FAILURE
[INFO] ------------------------------------------------------------------------
[INFO] Compilation failure

<https://builds.apache.org/job/Tuscany-2x/org.apache.tuscany.sca$itest-ws-wspolicy/ws/src/main/java/org/apache/tuscany/sca/binding/ws/axis2/helloworld/ServerPWCBHandler.java>:[27,29] package org.apache.ws.security does not exist

<https://builds.apache.org/job/Tuscany-2x/org.apache.tuscany.sca$itest-ws-wspolicy/ws/src/main/java/org/apache/tuscany/sca/binding/ws/axis2/helloworld/ServerPWCBHandler.java>:[38,12] cannot find symbol
symbol  : class WSPasswordCallback
location: class org.apache.tuscany.sca.binding.ws.axis2.helloworld.ServerPWCBHandler

<https://builds.apache.org/job/Tuscany-2x/org.apache.tuscany.sca$itest-ws-wspolicy/ws/src/main/java/org/apache/tuscany/sca/binding/ws/axis2/helloworld/ServerPWCBHandler.java>:[38,39] cannot find symbol
symbol  : class WSPasswordCallback
location: class org.apache.tuscany.sca.binding.ws.axis2.helloworld.ServerPWCBHandler

<https://builds.apache.org/job/Tuscany-2x/org.apache.tuscany.sca$itest-ws-wspolicy/ws/src/main/java/org/apache/tuscany/sca/binding/ws/axis2/helloworld/ServerPWCBHandler.java>:[42,36] cannot find symbol
symbol  : variable WSPasswordCallback
location: class org.apache.tuscany.sca.binding.ws.axis2.helloworld.ServerPWCBHandler

<https://builds.apache.org/job/Tuscany-2x/org.apache.tuscany.sca$itest-ws-wspolicy/ws/src/main/java/org/apache/tuscany/sca/binding/ws/axis2/helloworld/ServerPWCBHandler.java>:[49,43] cannot find symbol
symbol  : variable WSPasswordCallback
location: class org.apache.tuscany.sca.binding.ws.axis2.helloworld.ServerPWCBHandler


[INFO] ------------------------------------------------------------------------
[INFO] For more information, run Maven with the -e switch
[INFO] ------------------------------------------------------------------------
[INFO] Total time: 31 minutes 34 seconds
[INFO] Finished at: Wed Jul 10 02:53:18 UTC 2013
[INFO] Final Memory: 735M/910M
[INFO] ------------------------------------------------------------------------
Maven failed with error.

Build failed in Jenkins: Tuscany-2x » Apache Tuscany SCA iTest WS with WSPolicy #1072

Posted by Apache Jenkins Server <je...@builds.apache.org>.
See <https://builds.apache.org/job/Tuscany-2x/org.apache.tuscany.sca$itest-ws-wspolicy/1072/>

------------------------------------------
[INFO] ------------------------------------------------------------------------
[INFO] Building Apache Tuscany SCA iTest WS with WSPolicy
[INFO]    task-segment: [clean, install]
[INFO] ------------------------------------------------------------------------
[INFO] [clean:clean {execution: default-clean}]
[INFO] [enforcer:enforce {execution: enforce-plugin-versions}]
[INFO] [remote-resources:process {execution: default}]
[INFO] [resources:resources {execution: default-resources}]
[INFO] Using 'UTF-8' encoding to copy filtered resources.
[INFO] Copying 6 resources
[INFO] Copying 1 resource
[INFO] Copying 3 resources
[INFO] [compiler:compile {execution: default-compile}]
[INFO] Compiling 4 source files to <https://builds.apache.org/job/Tuscany-2x/org.apache.tuscany.sca$itest-ws-wspolicy/ws/target/classes>
[INFO] -------------------------------------------------------------
[ERROR] COMPILATION ERROR : 
[INFO] -------------------------------------------------------------
[ERROR] <https://builds.apache.org/job/Tuscany-2x/org.apache.tuscany.sca$itest-ws-wspolicy/ws/src/main/java/org/apache/tuscany/sca/binding/ws/axis2/helloworld/ServerPWCBHandler.java>:[27,29] package org.apache.ws.security does not exist

[ERROR] <https://builds.apache.org/job/Tuscany-2x/org.apache.tuscany.sca$itest-ws-wspolicy/ws/src/main/java/org/apache/tuscany/sca/binding/ws/axis2/helloworld/ServerPWCBHandler.java>:[38,12] cannot find symbol
symbol  : class WSPasswordCallback
location: class org.apache.tuscany.sca.binding.ws.axis2.helloworld.ServerPWCBHandler

[ERROR] <https://builds.apache.org/job/Tuscany-2x/org.apache.tuscany.sca$itest-ws-wspolicy/ws/src/main/java/org/apache/tuscany/sca/binding/ws/axis2/helloworld/ServerPWCBHandler.java>:[38,39] cannot find symbol
symbol  : class WSPasswordCallback
location: class org.apache.tuscany.sca.binding.ws.axis2.helloworld.ServerPWCBHandler

[ERROR] <https://builds.apache.org/job/Tuscany-2x/org.apache.tuscany.sca$itest-ws-wspolicy/ws/src/main/java/org/apache/tuscany/sca/binding/ws/axis2/helloworld/ServerPWCBHandler.java>:[42,36] cannot find symbol
symbol  : variable WSPasswordCallback
location: class org.apache.tuscany.sca.binding.ws.axis2.helloworld.ServerPWCBHandler

[ERROR] <https://builds.apache.org/job/Tuscany-2x/org.apache.tuscany.sca$itest-ws-wspolicy/ws/src/main/java/org/apache/tuscany/sca/binding/ws/axis2/helloworld/ServerPWCBHandler.java>:[49,43] cannot find symbol
symbol  : variable WSPasswordCallback
location: class org.apache.tuscany.sca.binding.ws.axis2.helloworld.ServerPWCBHandler

[INFO] 5 errors 
[INFO] -------------------------------------------------------------
[JENKINS] Archiving disabled
[INFO] ------------------------------------------------------------------------
[ERROR] BUILD FAILURE
[INFO] ------------------------------------------------------------------------
[INFO] Compilation failure

<https://builds.apache.org/job/Tuscany-2x/org.apache.tuscany.sca$itest-ws-wspolicy/ws/src/main/java/org/apache/tuscany/sca/binding/ws/axis2/helloworld/ServerPWCBHandler.java>:[27,29] package org.apache.ws.security does not exist

<https://builds.apache.org/job/Tuscany-2x/org.apache.tuscany.sca$itest-ws-wspolicy/ws/src/main/java/org/apache/tuscany/sca/binding/ws/axis2/helloworld/ServerPWCBHandler.java>:[38,12] cannot find symbol
symbol  : class WSPasswordCallback
location: class org.apache.tuscany.sca.binding.ws.axis2.helloworld.ServerPWCBHandler

<https://builds.apache.org/job/Tuscany-2x/org.apache.tuscany.sca$itest-ws-wspolicy/ws/src/main/java/org/apache/tuscany/sca/binding/ws/axis2/helloworld/ServerPWCBHandler.java>:[38,39] cannot find symbol
symbol  : class WSPasswordCallback
location: class org.apache.tuscany.sca.binding.ws.axis2.helloworld.ServerPWCBHandler

<https://builds.apache.org/job/Tuscany-2x/org.apache.tuscany.sca$itest-ws-wspolicy/ws/src/main/java/org/apache/tuscany/sca/binding/ws/axis2/helloworld/ServerPWCBHandler.java>:[42,36] cannot find symbol
symbol  : variable WSPasswordCallback
location: class org.apache.tuscany.sca.binding.ws.axis2.helloworld.ServerPWCBHandler

<https://builds.apache.org/job/Tuscany-2x/org.apache.tuscany.sca$itest-ws-wspolicy/ws/src/main/java/org/apache/tuscany/sca/binding/ws/axis2/helloworld/ServerPWCBHandler.java>:[49,43] cannot find symbol
symbol  : variable WSPasswordCallback
location: class org.apache.tuscany.sca.binding.ws.axis2.helloworld.ServerPWCBHandler


[INFO] ------------------------------------------------------------------------
[INFO] For more information, run Maven with the -e switch
[INFO] ------------------------------------------------------------------------
[INFO] Total time: 31 minutes 56 seconds
[INFO] Finished at: Tue Jul 09 03:35:36 UTC 2013
[INFO] Final Memory: 736M/910M
[INFO] ------------------------------------------------------------------------
Maven failed with error.

Build failed in Jenkins: Tuscany-2x » Apache Tuscany SCA iTest WS with WSPolicy #1071

Posted by Apache Jenkins Server <je...@builds.apache.org>.
See <https://builds.apache.org/job/Tuscany-2x/org.apache.tuscany.sca$itest-ws-wspolicy/1071/>

------------------------------------------
[INFO] ------------------------------------------------------------------------
[INFO] Building Apache Tuscany SCA iTest WS with WSPolicy
[INFO]    task-segment: [clean, install]
[INFO] ------------------------------------------------------------------------
[INFO] [clean:clean {execution: default-clean}]
[INFO] [enforcer:enforce {execution: enforce-plugin-versions}]
[INFO] [remote-resources:process {execution: default}]
[INFO] [resources:resources {execution: default-resources}]
[INFO] Using 'UTF-8' encoding to copy filtered resources.
[INFO] Copying 6 resources
[INFO] Copying 1 resource
[INFO] Copying 3 resources
[INFO] [compiler:compile {execution: default-compile}]
[INFO] Compiling 4 source files to <https://builds.apache.org/job/Tuscany-2x/org.apache.tuscany.sca$itest-ws-wspolicy/ws/target/classes>
[INFO] -------------------------------------------------------------
[ERROR] COMPILATION ERROR : 
[INFO] -------------------------------------------------------------
[ERROR] <https://builds.apache.org/job/Tuscany-2x/org.apache.tuscany.sca$itest-ws-wspolicy/ws/src/main/java/org/apache/tuscany/sca/binding/ws/axis2/helloworld/ServerPWCBHandler.java>:[27,29] package org.apache.ws.security does not exist

[ERROR] <https://builds.apache.org/job/Tuscany-2x/org.apache.tuscany.sca$itest-ws-wspolicy/ws/src/main/java/org/apache/tuscany/sca/binding/ws/axis2/helloworld/ServerPWCBHandler.java>:[38,12] cannot find symbol
symbol  : class WSPasswordCallback
location: class org.apache.tuscany.sca.binding.ws.axis2.helloworld.ServerPWCBHandler

[ERROR] <https://builds.apache.org/job/Tuscany-2x/org.apache.tuscany.sca$itest-ws-wspolicy/ws/src/main/java/org/apache/tuscany/sca/binding/ws/axis2/helloworld/ServerPWCBHandler.java>:[38,39] cannot find symbol
symbol  : class WSPasswordCallback
location: class org.apache.tuscany.sca.binding.ws.axis2.helloworld.ServerPWCBHandler

[ERROR] <https://builds.apache.org/job/Tuscany-2x/org.apache.tuscany.sca$itest-ws-wspolicy/ws/src/main/java/org/apache/tuscany/sca/binding/ws/axis2/helloworld/ServerPWCBHandler.java>:[42,36] cannot find symbol
symbol  : variable WSPasswordCallback
location: class org.apache.tuscany.sca.binding.ws.axis2.helloworld.ServerPWCBHandler

[ERROR] <https://builds.apache.org/job/Tuscany-2x/org.apache.tuscany.sca$itest-ws-wspolicy/ws/src/main/java/org/apache/tuscany/sca/binding/ws/axis2/helloworld/ServerPWCBHandler.java>:[49,43] cannot find symbol
symbol  : variable WSPasswordCallback
location: class org.apache.tuscany.sca.binding.ws.axis2.helloworld.ServerPWCBHandler

[INFO] 5 errors 
[INFO] -------------------------------------------------------------
[JENKINS] Archiving disabled
[INFO] ------------------------------------------------------------------------
[ERROR] BUILD FAILURE
[INFO] ------------------------------------------------------------------------
[INFO] Compilation failure

<https://builds.apache.org/job/Tuscany-2x/org.apache.tuscany.sca$itest-ws-wspolicy/ws/src/main/java/org/apache/tuscany/sca/binding/ws/axis2/helloworld/ServerPWCBHandler.java>:[27,29] package org.apache.ws.security does not exist

<https://builds.apache.org/job/Tuscany-2x/org.apache.tuscany.sca$itest-ws-wspolicy/ws/src/main/java/org/apache/tuscany/sca/binding/ws/axis2/helloworld/ServerPWCBHandler.java>:[38,12] cannot find symbol
symbol  : class WSPasswordCallback
location: class org.apache.tuscany.sca.binding.ws.axis2.helloworld.ServerPWCBHandler

<https://builds.apache.org/job/Tuscany-2x/org.apache.tuscany.sca$itest-ws-wspolicy/ws/src/main/java/org/apache/tuscany/sca/binding/ws/axis2/helloworld/ServerPWCBHandler.java>:[38,39] cannot find symbol
symbol  : class WSPasswordCallback
location: class org.apache.tuscany.sca.binding.ws.axis2.helloworld.ServerPWCBHandler

<https://builds.apache.org/job/Tuscany-2x/org.apache.tuscany.sca$itest-ws-wspolicy/ws/src/main/java/org/apache/tuscany/sca/binding/ws/axis2/helloworld/ServerPWCBHandler.java>:[42,36] cannot find symbol
symbol  : variable WSPasswordCallback
location: class org.apache.tuscany.sca.binding.ws.axis2.helloworld.ServerPWCBHandler

<https://builds.apache.org/job/Tuscany-2x/org.apache.tuscany.sca$itest-ws-wspolicy/ws/src/main/java/org/apache/tuscany/sca/binding/ws/axis2/helloworld/ServerPWCBHandler.java>:[49,43] cannot find symbol
symbol  : variable WSPasswordCallback
location: class org.apache.tuscany.sca.binding.ws.axis2.helloworld.ServerPWCBHandler


[INFO] ------------------------------------------------------------------------
[INFO] For more information, run Maven with the -e switch
[INFO] ------------------------------------------------------------------------
[INFO] Total time: 32 minutes 34 seconds
[INFO] Finished at: Mon Jul 08 01:58:48 UTC 2013
[INFO] Final Memory: 730M/910M
[INFO] ------------------------------------------------------------------------
Maven failed with error.

Build failed in Jenkins: Tuscany-2x » Apache Tuscany SCA iTest WS with WSPolicy #1070

Posted by Apache Jenkins Server <je...@builds.apache.org>.
See <https://builds.apache.org/job/Tuscany-2x/org.apache.tuscany.sca$itest-ws-wspolicy/1070/>

------------------------------------------
[INFO] ------------------------------------------------------------------------
[INFO] Building Apache Tuscany SCA iTest WS with WSPolicy
[INFO]    task-segment: [clean, install]
[INFO] ------------------------------------------------------------------------
[INFO] [clean:clean {execution: default-clean}]
[INFO] [enforcer:enforce {execution: enforce-plugin-versions}]
[INFO] [remote-resources:process {execution: default}]
[INFO] [resources:resources {execution: default-resources}]
[INFO] Using 'UTF-8' encoding to copy filtered resources.
[INFO] Copying 6 resources
[INFO] Copying 1 resource
[INFO] Copying 3 resources
[INFO] [compiler:compile {execution: default-compile}]
[INFO] Compiling 4 source files to <https://builds.apache.org/job/Tuscany-2x/org.apache.tuscany.sca$itest-ws-wspolicy/ws/target/classes>
[INFO] -------------------------------------------------------------
[ERROR] COMPILATION ERROR : 
[INFO] -------------------------------------------------------------
[ERROR] <https://builds.apache.org/job/Tuscany-2x/org.apache.tuscany.sca$itest-ws-wspolicy/ws/src/main/java/org/apache/tuscany/sca/binding/ws/axis2/helloworld/ServerPWCBHandler.java>:[27,29] package org.apache.ws.security does not exist

[ERROR] <https://builds.apache.org/job/Tuscany-2x/org.apache.tuscany.sca$itest-ws-wspolicy/ws/src/main/java/org/apache/tuscany/sca/binding/ws/axis2/helloworld/ServerPWCBHandler.java>:[38,12] cannot find symbol
symbol  : class WSPasswordCallback
location: class org.apache.tuscany.sca.binding.ws.axis2.helloworld.ServerPWCBHandler

[ERROR] <https://builds.apache.org/job/Tuscany-2x/org.apache.tuscany.sca$itest-ws-wspolicy/ws/src/main/java/org/apache/tuscany/sca/binding/ws/axis2/helloworld/ServerPWCBHandler.java>:[38,39] cannot find symbol
symbol  : class WSPasswordCallback
location: class org.apache.tuscany.sca.binding.ws.axis2.helloworld.ServerPWCBHandler

[ERROR] <https://builds.apache.org/job/Tuscany-2x/org.apache.tuscany.sca$itest-ws-wspolicy/ws/src/main/java/org/apache/tuscany/sca/binding/ws/axis2/helloworld/ServerPWCBHandler.java>:[42,36] cannot find symbol
symbol  : variable WSPasswordCallback
location: class org.apache.tuscany.sca.binding.ws.axis2.helloworld.ServerPWCBHandler

[ERROR] <https://builds.apache.org/job/Tuscany-2x/org.apache.tuscany.sca$itest-ws-wspolicy/ws/src/main/java/org/apache/tuscany/sca/binding/ws/axis2/helloworld/ServerPWCBHandler.java>:[49,43] cannot find symbol
symbol  : variable WSPasswordCallback
location: class org.apache.tuscany.sca.binding.ws.axis2.helloworld.ServerPWCBHandler

[INFO] 5 errors 
[INFO] -------------------------------------------------------------
[JENKINS] Archiving disabled
[INFO] ------------------------------------------------------------------------
[ERROR] BUILD FAILURE
[INFO] ------------------------------------------------------------------------
[INFO] Compilation failure

<https://builds.apache.org/job/Tuscany-2x/org.apache.tuscany.sca$itest-ws-wspolicy/ws/src/main/java/org/apache/tuscany/sca/binding/ws/axis2/helloworld/ServerPWCBHandler.java>:[27,29] package org.apache.ws.security does not exist

<https://builds.apache.org/job/Tuscany-2x/org.apache.tuscany.sca$itest-ws-wspolicy/ws/src/main/java/org/apache/tuscany/sca/binding/ws/axis2/helloworld/ServerPWCBHandler.java>:[38,12] cannot find symbol
symbol  : class WSPasswordCallback
location: class org.apache.tuscany.sca.binding.ws.axis2.helloworld.ServerPWCBHandler

<https://builds.apache.org/job/Tuscany-2x/org.apache.tuscany.sca$itest-ws-wspolicy/ws/src/main/java/org/apache/tuscany/sca/binding/ws/axis2/helloworld/ServerPWCBHandler.java>:[38,39] cannot find symbol
symbol  : class WSPasswordCallback
location: class org.apache.tuscany.sca.binding.ws.axis2.helloworld.ServerPWCBHandler

<https://builds.apache.org/job/Tuscany-2x/org.apache.tuscany.sca$itest-ws-wspolicy/ws/src/main/java/org/apache/tuscany/sca/binding/ws/axis2/helloworld/ServerPWCBHandler.java>:[42,36] cannot find symbol
symbol  : variable WSPasswordCallback
location: class org.apache.tuscany.sca.binding.ws.axis2.helloworld.ServerPWCBHandler

<https://builds.apache.org/job/Tuscany-2x/org.apache.tuscany.sca$itest-ws-wspolicy/ws/src/main/java/org/apache/tuscany/sca/binding/ws/axis2/helloworld/ServerPWCBHandler.java>:[49,43] cannot find symbol
symbol  : variable WSPasswordCallback
location: class org.apache.tuscany.sca.binding.ws.axis2.helloworld.ServerPWCBHandler


[INFO] ------------------------------------------------------------------------
[INFO] For more information, run Maven with the -e switch
[INFO] ------------------------------------------------------------------------
[INFO] Total time: 34 minutes 2 seconds
[INFO] Finished at: Sun Jul 07 01:55:18 UTC 2013
[INFO] Final Memory: 735M/910M
[INFO] ------------------------------------------------------------------------
Maven failed with error.

Build failed in Jenkins: Tuscany-2x » Apache Tuscany SCA iTest WS with WSPolicy #1069

Posted by Apache Jenkins Server <je...@builds.apache.org>.
See <https://builds.apache.org/job/Tuscany-2x/org.apache.tuscany.sca$itest-ws-wspolicy/1069/>

------------------------------------------
[INFO] ------------------------------------------------------------------------
[INFO] Building Apache Tuscany SCA iTest WS with WSPolicy
[INFO]    task-segment: [clean, install]
[INFO] ------------------------------------------------------------------------
[INFO] [clean:clean {execution: default-clean}]
[INFO] [enforcer:enforce {execution: enforce-plugin-versions}]
[INFO] [remote-resources:process {execution: default}]
[INFO] [resources:resources {execution: default-resources}]
[INFO] Using 'UTF-8' encoding to copy filtered resources.
[INFO] Copying 6 resources
[INFO] Copying 1 resource
[INFO] Copying 3 resources
[INFO] [compiler:compile {execution: default-compile}]
[INFO] Compiling 4 source files to <https://builds.apache.org/job/Tuscany-2x/org.apache.tuscany.sca$itest-ws-wspolicy/ws/target/classes>
[INFO] -------------------------------------------------------------
[ERROR] COMPILATION ERROR : 
[INFO] -------------------------------------------------------------
[ERROR] <https://builds.apache.org/job/Tuscany-2x/org.apache.tuscany.sca$itest-ws-wspolicy/ws/src/main/java/org/apache/tuscany/sca/binding/ws/axis2/helloworld/ServerPWCBHandler.java>:[27,29] package org.apache.ws.security does not exist

[ERROR] <https://builds.apache.org/job/Tuscany-2x/org.apache.tuscany.sca$itest-ws-wspolicy/ws/src/main/java/org/apache/tuscany/sca/binding/ws/axis2/helloworld/ServerPWCBHandler.java>:[38,12] cannot find symbol
symbol  : class WSPasswordCallback
location: class org.apache.tuscany.sca.binding.ws.axis2.helloworld.ServerPWCBHandler

[ERROR] <https://builds.apache.org/job/Tuscany-2x/org.apache.tuscany.sca$itest-ws-wspolicy/ws/src/main/java/org/apache/tuscany/sca/binding/ws/axis2/helloworld/ServerPWCBHandler.java>:[38,39] cannot find symbol
symbol  : class WSPasswordCallback
location: class org.apache.tuscany.sca.binding.ws.axis2.helloworld.ServerPWCBHandler

[ERROR] <https://builds.apache.org/job/Tuscany-2x/org.apache.tuscany.sca$itest-ws-wspolicy/ws/src/main/java/org/apache/tuscany/sca/binding/ws/axis2/helloworld/ServerPWCBHandler.java>:[42,36] cannot find symbol
symbol  : variable WSPasswordCallback
location: class org.apache.tuscany.sca.binding.ws.axis2.helloworld.ServerPWCBHandler

[ERROR] <https://builds.apache.org/job/Tuscany-2x/org.apache.tuscany.sca$itest-ws-wspolicy/ws/src/main/java/org/apache/tuscany/sca/binding/ws/axis2/helloworld/ServerPWCBHandler.java>:[49,43] cannot find symbol
symbol  : variable WSPasswordCallback
location: class org.apache.tuscany.sca.binding.ws.axis2.helloworld.ServerPWCBHandler

[INFO] 5 errors 
[INFO] -------------------------------------------------------------
[JENKINS] Archiving disabled
[INFO] ------------------------------------------------------------------------
[ERROR] BUILD FAILURE
[INFO] ------------------------------------------------------------------------
[INFO] Compilation failure

<https://builds.apache.org/job/Tuscany-2x/org.apache.tuscany.sca$itest-ws-wspolicy/ws/src/main/java/org/apache/tuscany/sca/binding/ws/axis2/helloworld/ServerPWCBHandler.java>:[27,29] package org.apache.ws.security does not exist

<https://builds.apache.org/job/Tuscany-2x/org.apache.tuscany.sca$itest-ws-wspolicy/ws/src/main/java/org/apache/tuscany/sca/binding/ws/axis2/helloworld/ServerPWCBHandler.java>:[38,12] cannot find symbol
symbol  : class WSPasswordCallback
location: class org.apache.tuscany.sca.binding.ws.axis2.helloworld.ServerPWCBHandler

<https://builds.apache.org/job/Tuscany-2x/org.apache.tuscany.sca$itest-ws-wspolicy/ws/src/main/java/org/apache/tuscany/sca/binding/ws/axis2/helloworld/ServerPWCBHandler.java>:[38,39] cannot find symbol
symbol  : class WSPasswordCallback
location: class org.apache.tuscany.sca.binding.ws.axis2.helloworld.ServerPWCBHandler

<https://builds.apache.org/job/Tuscany-2x/org.apache.tuscany.sca$itest-ws-wspolicy/ws/src/main/java/org/apache/tuscany/sca/binding/ws/axis2/helloworld/ServerPWCBHandler.java>:[42,36] cannot find symbol
symbol  : variable WSPasswordCallback
location: class org.apache.tuscany.sca.binding.ws.axis2.helloworld.ServerPWCBHandler

<https://builds.apache.org/job/Tuscany-2x/org.apache.tuscany.sca$itest-ws-wspolicy/ws/src/main/java/org/apache/tuscany/sca/binding/ws/axis2/helloworld/ServerPWCBHandler.java>:[49,43] cannot find symbol
symbol  : variable WSPasswordCallback
location: class org.apache.tuscany.sca.binding.ws.axis2.helloworld.ServerPWCBHandler


[INFO] ------------------------------------------------------------------------
[INFO] For more information, run Maven with the -e switch
[INFO] ------------------------------------------------------------------------
[INFO] Total time: 32 minutes 17 seconds
[INFO] Finished at: Sat Jul 06 02:02:17 UTC 2013
[INFO] Final Memory: 734M/910M
[INFO] ------------------------------------------------------------------------
Maven failed with error.

Build failed in Jenkins: Tuscany-2x » Apache Tuscany SCA iTest WS with WSPolicy #1068

Posted by Apache Jenkins Server <je...@builds.apache.org>.
See <https://builds.apache.org/job/Tuscany-2x/org.apache.tuscany.sca$itest-ws-wspolicy/1068/>

------------------------------------------
[INFO] ------------------------------------------------------------------------
[INFO] Building Apache Tuscany SCA iTest WS with WSPolicy
[INFO]    task-segment: [clean, install]
[INFO] ------------------------------------------------------------------------
[INFO] [clean:clean {execution: default-clean}]
[INFO] [enforcer:enforce {execution: enforce-plugin-versions}]
[INFO] [remote-resources:process {execution: default}]
[INFO] [resources:resources {execution: default-resources}]
[INFO] Using 'UTF-8' encoding to copy filtered resources.
[INFO] Copying 6 resources
[INFO] Copying 1 resource
[INFO] Copying 3 resources
[INFO] [compiler:compile {execution: default-compile}]
[INFO] Compiling 4 source files to <https://builds.apache.org/job/Tuscany-2x/org.apache.tuscany.sca$itest-ws-wspolicy/ws/target/classes>
[INFO] -------------------------------------------------------------
[ERROR] COMPILATION ERROR : 
[INFO] -------------------------------------------------------------
[ERROR] <https://builds.apache.org/job/Tuscany-2x/org.apache.tuscany.sca$itest-ws-wspolicy/ws/src/main/java/org/apache/tuscany/sca/binding/ws/axis2/helloworld/ServerPWCBHandler.java>:[27,29] package org.apache.ws.security does not exist

[ERROR] <https://builds.apache.org/job/Tuscany-2x/org.apache.tuscany.sca$itest-ws-wspolicy/ws/src/main/java/org/apache/tuscany/sca/binding/ws/axis2/helloworld/ServerPWCBHandler.java>:[38,12] cannot find symbol
symbol  : class WSPasswordCallback
location: class org.apache.tuscany.sca.binding.ws.axis2.helloworld.ServerPWCBHandler

[ERROR] <https://builds.apache.org/job/Tuscany-2x/org.apache.tuscany.sca$itest-ws-wspolicy/ws/src/main/java/org/apache/tuscany/sca/binding/ws/axis2/helloworld/ServerPWCBHandler.java>:[38,39] cannot find symbol
symbol  : class WSPasswordCallback
location: class org.apache.tuscany.sca.binding.ws.axis2.helloworld.ServerPWCBHandler

[ERROR] <https://builds.apache.org/job/Tuscany-2x/org.apache.tuscany.sca$itest-ws-wspolicy/ws/src/main/java/org/apache/tuscany/sca/binding/ws/axis2/helloworld/ServerPWCBHandler.java>:[42,36] cannot find symbol
symbol  : variable WSPasswordCallback
location: class org.apache.tuscany.sca.binding.ws.axis2.helloworld.ServerPWCBHandler

[ERROR] <https://builds.apache.org/job/Tuscany-2x/org.apache.tuscany.sca$itest-ws-wspolicy/ws/src/main/java/org/apache/tuscany/sca/binding/ws/axis2/helloworld/ServerPWCBHandler.java>:[49,43] cannot find symbol
symbol  : variable WSPasswordCallback
location: class org.apache.tuscany.sca.binding.ws.axis2.helloworld.ServerPWCBHandler

[INFO] 5 errors 
[INFO] -------------------------------------------------------------
[JENKINS] Archiving disabled
[INFO] ------------------------------------------------------------------------
[ERROR] BUILD FAILURE
[INFO] ------------------------------------------------------------------------
[INFO] Compilation failure

<https://builds.apache.org/job/Tuscany-2x/org.apache.tuscany.sca$itest-ws-wspolicy/ws/src/main/java/org/apache/tuscany/sca/binding/ws/axis2/helloworld/ServerPWCBHandler.java>:[27,29] package org.apache.ws.security does not exist

<https://builds.apache.org/job/Tuscany-2x/org.apache.tuscany.sca$itest-ws-wspolicy/ws/src/main/java/org/apache/tuscany/sca/binding/ws/axis2/helloworld/ServerPWCBHandler.java>:[38,12] cannot find symbol
symbol  : class WSPasswordCallback
location: class org.apache.tuscany.sca.binding.ws.axis2.helloworld.ServerPWCBHandler

<https://builds.apache.org/job/Tuscany-2x/org.apache.tuscany.sca$itest-ws-wspolicy/ws/src/main/java/org/apache/tuscany/sca/binding/ws/axis2/helloworld/ServerPWCBHandler.java>:[38,39] cannot find symbol
symbol  : class WSPasswordCallback
location: class org.apache.tuscany.sca.binding.ws.axis2.helloworld.ServerPWCBHandler

<https://builds.apache.org/job/Tuscany-2x/org.apache.tuscany.sca$itest-ws-wspolicy/ws/src/main/java/org/apache/tuscany/sca/binding/ws/axis2/helloworld/ServerPWCBHandler.java>:[42,36] cannot find symbol
symbol  : variable WSPasswordCallback
location: class org.apache.tuscany.sca.binding.ws.axis2.helloworld.ServerPWCBHandler

<https://builds.apache.org/job/Tuscany-2x/org.apache.tuscany.sca$itest-ws-wspolicy/ws/src/main/java/org/apache/tuscany/sca/binding/ws/axis2/helloworld/ServerPWCBHandler.java>:[49,43] cannot find symbol
symbol  : variable WSPasswordCallback
location: class org.apache.tuscany.sca.binding.ws.axis2.helloworld.ServerPWCBHandler


[INFO] ------------------------------------------------------------------------
[INFO] For more information, run Maven with the -e switch
[INFO] ------------------------------------------------------------------------
[INFO] Total time: 31 minutes 30 seconds
[INFO] Finished at: Fri Jul 05 01:11:37 UTC 2013
[INFO] Final Memory: 735M/887M
[INFO] ------------------------------------------------------------------------
Maven failed with error.

Build failed in Jenkins: Tuscany-2x » Apache Tuscany SCA iTest WS with WSPolicy #1067

Posted by Apache Jenkins Server <je...@builds.apache.org>.
See <https://builds.apache.org/job/Tuscany-2x/org.apache.tuscany.sca$itest-ws-wspolicy/1067/>

------------------------------------------
[INFO] ------------------------------------------------------------------------
[INFO] Building Apache Tuscany SCA iTest WS with WSPolicy
[INFO]    task-segment: [clean, install]
[INFO] ------------------------------------------------------------------------
[INFO] [clean:clean {execution: default-clean}]
[INFO] [enforcer:enforce {execution: enforce-plugin-versions}]
[INFO] [remote-resources:process {execution: default}]
[INFO] [resources:resources {execution: default-resources}]
[INFO] Using 'UTF-8' encoding to copy filtered resources.
[INFO] Copying 6 resources
[INFO] Copying 1 resource
[INFO] Copying 3 resources
[INFO] [compiler:compile {execution: default-compile}]
[INFO] Compiling 4 source files to <https://builds.apache.org/job/Tuscany-2x/org.apache.tuscany.sca$itest-ws-wspolicy/ws/target/classes>
[INFO] -------------------------------------------------------------
[ERROR] COMPILATION ERROR : 
[INFO] -------------------------------------------------------------
[ERROR] <https://builds.apache.org/job/Tuscany-2x/org.apache.tuscany.sca$itest-ws-wspolicy/ws/src/main/java/org/apache/tuscany/sca/binding/ws/axis2/helloworld/ServerPWCBHandler.java>:[27,29] package org.apache.ws.security does not exist

[ERROR] <https://builds.apache.org/job/Tuscany-2x/org.apache.tuscany.sca$itest-ws-wspolicy/ws/src/main/java/org/apache/tuscany/sca/binding/ws/axis2/helloworld/ServerPWCBHandler.java>:[38,12] cannot find symbol
symbol  : class WSPasswordCallback
location: class org.apache.tuscany.sca.binding.ws.axis2.helloworld.ServerPWCBHandler

[ERROR] <https://builds.apache.org/job/Tuscany-2x/org.apache.tuscany.sca$itest-ws-wspolicy/ws/src/main/java/org/apache/tuscany/sca/binding/ws/axis2/helloworld/ServerPWCBHandler.java>:[38,39] cannot find symbol
symbol  : class WSPasswordCallback
location: class org.apache.tuscany.sca.binding.ws.axis2.helloworld.ServerPWCBHandler

[ERROR] <https://builds.apache.org/job/Tuscany-2x/org.apache.tuscany.sca$itest-ws-wspolicy/ws/src/main/java/org/apache/tuscany/sca/binding/ws/axis2/helloworld/ServerPWCBHandler.java>:[42,36] cannot find symbol
symbol  : variable WSPasswordCallback
location: class org.apache.tuscany.sca.binding.ws.axis2.helloworld.ServerPWCBHandler

[ERROR] <https://builds.apache.org/job/Tuscany-2x/org.apache.tuscany.sca$itest-ws-wspolicy/ws/src/main/java/org/apache/tuscany/sca/binding/ws/axis2/helloworld/ServerPWCBHandler.java>:[49,43] cannot find symbol
symbol  : variable WSPasswordCallback
location: class org.apache.tuscany.sca.binding.ws.axis2.helloworld.ServerPWCBHandler

[INFO] 5 errors 
[INFO] -------------------------------------------------------------
[JENKINS] Archiving disabled
[INFO] ------------------------------------------------------------------------
[ERROR] BUILD FAILURE
[INFO] ------------------------------------------------------------------------
[INFO] Compilation failure

<https://builds.apache.org/job/Tuscany-2x/org.apache.tuscany.sca$itest-ws-wspolicy/ws/src/main/java/org/apache/tuscany/sca/binding/ws/axis2/helloworld/ServerPWCBHandler.java>:[27,29] package org.apache.ws.security does not exist

<https://builds.apache.org/job/Tuscany-2x/org.apache.tuscany.sca$itest-ws-wspolicy/ws/src/main/java/org/apache/tuscany/sca/binding/ws/axis2/helloworld/ServerPWCBHandler.java>:[38,12] cannot find symbol
symbol  : class WSPasswordCallback
location: class org.apache.tuscany.sca.binding.ws.axis2.helloworld.ServerPWCBHandler

<https://builds.apache.org/job/Tuscany-2x/org.apache.tuscany.sca$itest-ws-wspolicy/ws/src/main/java/org/apache/tuscany/sca/binding/ws/axis2/helloworld/ServerPWCBHandler.java>:[38,39] cannot find symbol
symbol  : class WSPasswordCallback
location: class org.apache.tuscany.sca.binding.ws.axis2.helloworld.ServerPWCBHandler

<https://builds.apache.org/job/Tuscany-2x/org.apache.tuscany.sca$itest-ws-wspolicy/ws/src/main/java/org/apache/tuscany/sca/binding/ws/axis2/helloworld/ServerPWCBHandler.java>:[42,36] cannot find symbol
symbol  : variable WSPasswordCallback
location: class org.apache.tuscany.sca.binding.ws.axis2.helloworld.ServerPWCBHandler

<https://builds.apache.org/job/Tuscany-2x/org.apache.tuscany.sca$itest-ws-wspolicy/ws/src/main/java/org/apache/tuscany/sca/binding/ws/axis2/helloworld/ServerPWCBHandler.java>:[49,43] cannot find symbol
symbol  : variable WSPasswordCallback
location: class org.apache.tuscany.sca.binding.ws.axis2.helloworld.ServerPWCBHandler


[INFO] ------------------------------------------------------------------------
[INFO] For more information, run Maven with the -e switch
[INFO] ------------------------------------------------------------------------
[INFO] Total time: 32 minutes 3 seconds
[INFO] Finished at: Thu Jul 04 01:37:24 UTC 2013
[INFO] Final Memory: 733M/910M
[INFO] ------------------------------------------------------------------------
Maven failed with error.

Build failed in Jenkins: Tuscany-2x » Apache Tuscany SCA iTest WS with WSPolicy #1066

Posted by Apache Jenkins Server <je...@builds.apache.org>.
See <https://builds.apache.org/job/Tuscany-2x/org.apache.tuscany.sca$itest-ws-wspolicy/1066/>

------------------------------------------
[INFO] ------------------------------------------------------------------------
[INFO] Building Apache Tuscany SCA iTest WS with WSPolicy
[INFO]    task-segment: [clean, install]
[INFO] ------------------------------------------------------------------------
[INFO] [clean:clean {execution: default-clean}]
[INFO] [enforcer:enforce {execution: enforce-plugin-versions}]
[INFO] [remote-resources:process {execution: default}]
[INFO] [resources:resources {execution: default-resources}]
[INFO] Using 'UTF-8' encoding to copy filtered resources.
[INFO] Copying 6 resources
[INFO] Copying 1 resource
[INFO] Copying 3 resources
[INFO] [compiler:compile {execution: default-compile}]
[INFO] Compiling 4 source files to <https://builds.apache.org/job/Tuscany-2x/org.apache.tuscany.sca$itest-ws-wspolicy/ws/target/classes>
[INFO] -------------------------------------------------------------
[ERROR] COMPILATION ERROR : 
[INFO] -------------------------------------------------------------
[ERROR] <https://builds.apache.org/job/Tuscany-2x/org.apache.tuscany.sca$itest-ws-wspolicy/ws/src/main/java/org/apache/tuscany/sca/binding/ws/axis2/helloworld/ServerPWCBHandler.java>:[27,29] package org.apache.ws.security does not exist

[ERROR] <https://builds.apache.org/job/Tuscany-2x/org.apache.tuscany.sca$itest-ws-wspolicy/ws/src/main/java/org/apache/tuscany/sca/binding/ws/axis2/helloworld/ServerPWCBHandler.java>:[38,12] cannot find symbol
symbol  : class WSPasswordCallback
location: class org.apache.tuscany.sca.binding.ws.axis2.helloworld.ServerPWCBHandler

[ERROR] <https://builds.apache.org/job/Tuscany-2x/org.apache.tuscany.sca$itest-ws-wspolicy/ws/src/main/java/org/apache/tuscany/sca/binding/ws/axis2/helloworld/ServerPWCBHandler.java>:[38,39] cannot find symbol
symbol  : class WSPasswordCallback
location: class org.apache.tuscany.sca.binding.ws.axis2.helloworld.ServerPWCBHandler

[ERROR] <https://builds.apache.org/job/Tuscany-2x/org.apache.tuscany.sca$itest-ws-wspolicy/ws/src/main/java/org/apache/tuscany/sca/binding/ws/axis2/helloworld/ServerPWCBHandler.java>:[42,36] cannot find symbol
symbol  : variable WSPasswordCallback
location: class org.apache.tuscany.sca.binding.ws.axis2.helloworld.ServerPWCBHandler

[ERROR] <https://builds.apache.org/job/Tuscany-2x/org.apache.tuscany.sca$itest-ws-wspolicy/ws/src/main/java/org/apache/tuscany/sca/binding/ws/axis2/helloworld/ServerPWCBHandler.java>:[49,43] cannot find symbol
symbol  : variable WSPasswordCallback
location: class org.apache.tuscany.sca.binding.ws.axis2.helloworld.ServerPWCBHandler

[INFO] 5 errors 
[INFO] -------------------------------------------------------------
[JENKINS] Archiving disabled
[INFO] ------------------------------------------------------------------------
[ERROR] BUILD FAILURE
[INFO] ------------------------------------------------------------------------
[INFO] Compilation failure

<https://builds.apache.org/job/Tuscany-2x/org.apache.tuscany.sca$itest-ws-wspolicy/ws/src/main/java/org/apache/tuscany/sca/binding/ws/axis2/helloworld/ServerPWCBHandler.java>:[27,29] package org.apache.ws.security does not exist

<https://builds.apache.org/job/Tuscany-2x/org.apache.tuscany.sca$itest-ws-wspolicy/ws/src/main/java/org/apache/tuscany/sca/binding/ws/axis2/helloworld/ServerPWCBHandler.java>:[38,12] cannot find symbol
symbol  : class WSPasswordCallback
location: class org.apache.tuscany.sca.binding.ws.axis2.helloworld.ServerPWCBHandler

<https://builds.apache.org/job/Tuscany-2x/org.apache.tuscany.sca$itest-ws-wspolicy/ws/src/main/java/org/apache/tuscany/sca/binding/ws/axis2/helloworld/ServerPWCBHandler.java>:[38,39] cannot find symbol
symbol  : class WSPasswordCallback
location: class org.apache.tuscany.sca.binding.ws.axis2.helloworld.ServerPWCBHandler

<https://builds.apache.org/job/Tuscany-2x/org.apache.tuscany.sca$itest-ws-wspolicy/ws/src/main/java/org/apache/tuscany/sca/binding/ws/axis2/helloworld/ServerPWCBHandler.java>:[42,36] cannot find symbol
symbol  : variable WSPasswordCallback
location: class org.apache.tuscany.sca.binding.ws.axis2.helloworld.ServerPWCBHandler

<https://builds.apache.org/job/Tuscany-2x/org.apache.tuscany.sca$itest-ws-wspolicy/ws/src/main/java/org/apache/tuscany/sca/binding/ws/axis2/helloworld/ServerPWCBHandler.java>:[49,43] cannot find symbol
symbol  : variable WSPasswordCallback
location: class org.apache.tuscany.sca.binding.ws.axis2.helloworld.ServerPWCBHandler


[INFO] ------------------------------------------------------------------------
[INFO] For more information, run Maven with the -e switch
[INFO] ------------------------------------------------------------------------
[INFO] Total time: 42 minutes 13 seconds
[INFO] Finished at: Wed Jul 03 02:24:18 UTC 2013
[INFO] Final Memory: 737M/910M
[INFO] ------------------------------------------------------------------------
Maven failed with error.

Build failed in Jenkins: Tuscany-2x » Apache Tuscany SCA iTest WS with WSPolicy #1065

Posted by Apache Jenkins Server <je...@builds.apache.org>.
See <https://builds.apache.org/job/Tuscany-2x/org.apache.tuscany.sca$itest-ws-wspolicy/1065/>

------------------------------------------
[INFO] ------------------------------------------------------------------------
[INFO] Building Apache Tuscany SCA iTest WS with WSPolicy
[INFO]    task-segment: [clean, install]
[INFO] ------------------------------------------------------------------------
[INFO] [clean:clean {execution: default-clean}]
[INFO] [enforcer:enforce {execution: enforce-plugin-versions}]
[INFO] [remote-resources:process {execution: default}]
[INFO] [resources:resources {execution: default-resources}]
[INFO] Using 'UTF-8' encoding to copy filtered resources.
[INFO] Copying 6 resources
[INFO] Copying 1 resource
[INFO] Copying 3 resources
[INFO] [compiler:compile {execution: default-compile}]
[INFO] Compiling 4 source files to <https://builds.apache.org/job/Tuscany-2x/org.apache.tuscany.sca$itest-ws-wspolicy/ws/target/classes>
[INFO] -------------------------------------------------------------
[ERROR] COMPILATION ERROR : 
[INFO] -------------------------------------------------------------
[ERROR] <https://builds.apache.org/job/Tuscany-2x/org.apache.tuscany.sca$itest-ws-wspolicy/ws/src/main/java/org/apache/tuscany/sca/binding/ws/axis2/helloworld/ServerPWCBHandler.java>:[27,29] package org.apache.ws.security does not exist

[ERROR] <https://builds.apache.org/job/Tuscany-2x/org.apache.tuscany.sca$itest-ws-wspolicy/ws/src/main/java/org/apache/tuscany/sca/binding/ws/axis2/helloworld/ServerPWCBHandler.java>:[38,12] cannot find symbol
symbol  : class WSPasswordCallback
location: class org.apache.tuscany.sca.binding.ws.axis2.helloworld.ServerPWCBHandler

[ERROR] <https://builds.apache.org/job/Tuscany-2x/org.apache.tuscany.sca$itest-ws-wspolicy/ws/src/main/java/org/apache/tuscany/sca/binding/ws/axis2/helloworld/ServerPWCBHandler.java>:[38,39] cannot find symbol
symbol  : class WSPasswordCallback
location: class org.apache.tuscany.sca.binding.ws.axis2.helloworld.ServerPWCBHandler

[ERROR] <https://builds.apache.org/job/Tuscany-2x/org.apache.tuscany.sca$itest-ws-wspolicy/ws/src/main/java/org/apache/tuscany/sca/binding/ws/axis2/helloworld/ServerPWCBHandler.java>:[42,36] cannot find symbol
symbol  : variable WSPasswordCallback
location: class org.apache.tuscany.sca.binding.ws.axis2.helloworld.ServerPWCBHandler

[ERROR] <https://builds.apache.org/job/Tuscany-2x/org.apache.tuscany.sca$itest-ws-wspolicy/ws/src/main/java/org/apache/tuscany/sca/binding/ws/axis2/helloworld/ServerPWCBHandler.java>:[49,43] cannot find symbol
symbol  : variable WSPasswordCallback
location: class org.apache.tuscany.sca.binding.ws.axis2.helloworld.ServerPWCBHandler

[INFO] 5 errors 
[INFO] -------------------------------------------------------------
[JENKINS] Archiving disabled
[INFO] ------------------------------------------------------------------------
[ERROR] BUILD FAILURE
[INFO] ------------------------------------------------------------------------
[INFO] Compilation failure

<https://builds.apache.org/job/Tuscany-2x/org.apache.tuscany.sca$itest-ws-wspolicy/ws/src/main/java/org/apache/tuscany/sca/binding/ws/axis2/helloworld/ServerPWCBHandler.java>:[27,29] package org.apache.ws.security does not exist

<https://builds.apache.org/job/Tuscany-2x/org.apache.tuscany.sca$itest-ws-wspolicy/ws/src/main/java/org/apache/tuscany/sca/binding/ws/axis2/helloworld/ServerPWCBHandler.java>:[38,12] cannot find symbol
symbol  : class WSPasswordCallback
location: class org.apache.tuscany.sca.binding.ws.axis2.helloworld.ServerPWCBHandler

<https://builds.apache.org/job/Tuscany-2x/org.apache.tuscany.sca$itest-ws-wspolicy/ws/src/main/java/org/apache/tuscany/sca/binding/ws/axis2/helloworld/ServerPWCBHandler.java>:[38,39] cannot find symbol
symbol  : class WSPasswordCallback
location: class org.apache.tuscany.sca.binding.ws.axis2.helloworld.ServerPWCBHandler

<https://builds.apache.org/job/Tuscany-2x/org.apache.tuscany.sca$itest-ws-wspolicy/ws/src/main/java/org/apache/tuscany/sca/binding/ws/axis2/helloworld/ServerPWCBHandler.java>:[42,36] cannot find symbol
symbol  : variable WSPasswordCallback
location: class org.apache.tuscany.sca.binding.ws.axis2.helloworld.ServerPWCBHandler

<https://builds.apache.org/job/Tuscany-2x/org.apache.tuscany.sca$itest-ws-wspolicy/ws/src/main/java/org/apache/tuscany/sca/binding/ws/axis2/helloworld/ServerPWCBHandler.java>:[49,43] cannot find symbol
symbol  : variable WSPasswordCallback
location: class org.apache.tuscany.sca.binding.ws.axis2.helloworld.ServerPWCBHandler


[INFO] ------------------------------------------------------------------------
[INFO] For more information, run Maven with the -e switch
[INFO] ------------------------------------------------------------------------
[INFO] Total time: 32 minutes 28 seconds
[INFO] Finished at: Tue Jul 02 02:42:06 UTC 2013
[INFO] Final Memory: 729M/910M
[INFO] ------------------------------------------------------------------------
Maven failed with error.

Build failed in Jenkins: Tuscany-2x » Apache Tuscany SCA iTest WS with WSPolicy #1064

Posted by Apache Jenkins Server <je...@builds.apache.org>.
See <https://builds.apache.org/job/Tuscany-2x/org.apache.tuscany.sca$itest-ws-wspolicy/1064/>

------------------------------------------
[INFO] ------------------------------------------------------------------------
[INFO] Building Apache Tuscany SCA iTest WS with WSPolicy
[INFO]    task-segment: [clean, install]
[INFO] ------------------------------------------------------------------------
[INFO] [clean:clean {execution: default-clean}]
[INFO] [enforcer:enforce {execution: enforce-plugin-versions}]
[INFO] [remote-resources:process {execution: default}]
[INFO] [resources:resources {execution: default-resources}]
[INFO] Using 'UTF-8' encoding to copy filtered resources.
[INFO] Copying 6 resources
[INFO] Copying 1 resource
[INFO] Copying 3 resources
[INFO] [compiler:compile {execution: default-compile}]
[INFO] Compiling 4 source files to <https://builds.apache.org/job/Tuscany-2x/org.apache.tuscany.sca$itest-ws-wspolicy/ws/target/classes>
[INFO] -------------------------------------------------------------
[ERROR] COMPILATION ERROR : 
[INFO] -------------------------------------------------------------
[ERROR] <https://builds.apache.org/job/Tuscany-2x/org.apache.tuscany.sca$itest-ws-wspolicy/ws/src/main/java/org/apache/tuscany/sca/binding/ws/axis2/helloworld/ServerPWCBHandler.java>:[27,29] package org.apache.ws.security does not exist

[ERROR] <https://builds.apache.org/job/Tuscany-2x/org.apache.tuscany.sca$itest-ws-wspolicy/ws/src/main/java/org/apache/tuscany/sca/binding/ws/axis2/helloworld/ServerPWCBHandler.java>:[38,12] cannot find symbol
symbol  : class WSPasswordCallback
location: class org.apache.tuscany.sca.binding.ws.axis2.helloworld.ServerPWCBHandler

[ERROR] <https://builds.apache.org/job/Tuscany-2x/org.apache.tuscany.sca$itest-ws-wspolicy/ws/src/main/java/org/apache/tuscany/sca/binding/ws/axis2/helloworld/ServerPWCBHandler.java>:[38,39] cannot find symbol
symbol  : class WSPasswordCallback
location: class org.apache.tuscany.sca.binding.ws.axis2.helloworld.ServerPWCBHandler

[ERROR] <https://builds.apache.org/job/Tuscany-2x/org.apache.tuscany.sca$itest-ws-wspolicy/ws/src/main/java/org/apache/tuscany/sca/binding/ws/axis2/helloworld/ServerPWCBHandler.java>:[42,36] cannot find symbol
symbol  : variable WSPasswordCallback
location: class org.apache.tuscany.sca.binding.ws.axis2.helloworld.ServerPWCBHandler

[ERROR] <https://builds.apache.org/job/Tuscany-2x/org.apache.tuscany.sca$itest-ws-wspolicy/ws/src/main/java/org/apache/tuscany/sca/binding/ws/axis2/helloworld/ServerPWCBHandler.java>:[49,43] cannot find symbol
symbol  : variable WSPasswordCallback
location: class org.apache.tuscany.sca.binding.ws.axis2.helloworld.ServerPWCBHandler

[INFO] 5 errors 
[INFO] -------------------------------------------------------------
[JENKINS] Archiving disabled
[INFO] ------------------------------------------------------------------------
[ERROR] BUILD FAILURE
[INFO] ------------------------------------------------------------------------
[INFO] Compilation failure

<https://builds.apache.org/job/Tuscany-2x/org.apache.tuscany.sca$itest-ws-wspolicy/ws/src/main/java/org/apache/tuscany/sca/binding/ws/axis2/helloworld/ServerPWCBHandler.java>:[27,29] package org.apache.ws.security does not exist

<https://builds.apache.org/job/Tuscany-2x/org.apache.tuscany.sca$itest-ws-wspolicy/ws/src/main/java/org/apache/tuscany/sca/binding/ws/axis2/helloworld/ServerPWCBHandler.java>:[38,12] cannot find symbol
symbol  : class WSPasswordCallback
location: class org.apache.tuscany.sca.binding.ws.axis2.helloworld.ServerPWCBHandler

<https://builds.apache.org/job/Tuscany-2x/org.apache.tuscany.sca$itest-ws-wspolicy/ws/src/main/java/org/apache/tuscany/sca/binding/ws/axis2/helloworld/ServerPWCBHandler.java>:[38,39] cannot find symbol
symbol  : class WSPasswordCallback
location: class org.apache.tuscany.sca.binding.ws.axis2.helloworld.ServerPWCBHandler

<https://builds.apache.org/job/Tuscany-2x/org.apache.tuscany.sca$itest-ws-wspolicy/ws/src/main/java/org/apache/tuscany/sca/binding/ws/axis2/helloworld/ServerPWCBHandler.java>:[42,36] cannot find symbol
symbol  : variable WSPasswordCallback
location: class org.apache.tuscany.sca.binding.ws.axis2.helloworld.ServerPWCBHandler

<https://builds.apache.org/job/Tuscany-2x/org.apache.tuscany.sca$itest-ws-wspolicy/ws/src/main/java/org/apache/tuscany/sca/binding/ws/axis2/helloworld/ServerPWCBHandler.java>:[49,43] cannot find symbol
symbol  : variable WSPasswordCallback
location: class org.apache.tuscany.sca.binding.ws.axis2.helloworld.ServerPWCBHandler


[INFO] ------------------------------------------------------------------------
[INFO] For more information, run Maven with the -e switch
[INFO] ------------------------------------------------------------------------
[INFO] Total time: 32 minutes 51 seconds
[INFO] Finished at: Mon Jul 01 01:37:43 UTC 2013
[INFO] Final Memory: 732M/910M
[INFO] ------------------------------------------------------------------------
Maven failed with error.

Build failed in Jenkins: Tuscany-2x » Apache Tuscany SCA iTest WS with WSPolicy #1063

Posted by Apache Jenkins Server <je...@builds.apache.org>.
See <https://builds.apache.org/job/Tuscany-2x/org.apache.tuscany.sca$itest-ws-wspolicy/1063/>

------------------------------------------
[INFO] ------------------------------------------------------------------------
[INFO] Building Apache Tuscany SCA iTest WS with WSPolicy
[INFO]    task-segment: [clean, install]
[INFO] ------------------------------------------------------------------------
[INFO] [clean:clean {execution: default-clean}]
[INFO] [enforcer:enforce {execution: enforce-plugin-versions}]
[INFO] [remote-resources:process {execution: default}]
[INFO] [resources:resources {execution: default-resources}]
[INFO] Using 'UTF-8' encoding to copy filtered resources.
[INFO] Copying 6 resources
[INFO] Copying 1 resource
[INFO] Copying 3 resources
[INFO] [compiler:compile {execution: default-compile}]
[INFO] Compiling 4 source files to <https://builds.apache.org/job/Tuscany-2x/org.apache.tuscany.sca$itest-ws-wspolicy/ws/target/classes>
[INFO] -------------------------------------------------------------
[ERROR] COMPILATION ERROR : 
[INFO] -------------------------------------------------------------
[ERROR] <https://builds.apache.org/job/Tuscany-2x/org.apache.tuscany.sca$itest-ws-wspolicy/ws/src/main/java/org/apache/tuscany/sca/binding/ws/axis2/helloworld/ServerPWCBHandler.java>:[27,29] package org.apache.ws.security does not exist

[ERROR] <https://builds.apache.org/job/Tuscany-2x/org.apache.tuscany.sca$itest-ws-wspolicy/ws/src/main/java/org/apache/tuscany/sca/binding/ws/axis2/helloworld/ServerPWCBHandler.java>:[38,12] cannot find symbol
symbol  : class WSPasswordCallback
location: class org.apache.tuscany.sca.binding.ws.axis2.helloworld.ServerPWCBHandler

[ERROR] <https://builds.apache.org/job/Tuscany-2x/org.apache.tuscany.sca$itest-ws-wspolicy/ws/src/main/java/org/apache/tuscany/sca/binding/ws/axis2/helloworld/ServerPWCBHandler.java>:[38,39] cannot find symbol
symbol  : class WSPasswordCallback
location: class org.apache.tuscany.sca.binding.ws.axis2.helloworld.ServerPWCBHandler

[ERROR] <https://builds.apache.org/job/Tuscany-2x/org.apache.tuscany.sca$itest-ws-wspolicy/ws/src/main/java/org/apache/tuscany/sca/binding/ws/axis2/helloworld/ServerPWCBHandler.java>:[42,36] cannot find symbol
symbol  : variable WSPasswordCallback
location: class org.apache.tuscany.sca.binding.ws.axis2.helloworld.ServerPWCBHandler

[ERROR] <https://builds.apache.org/job/Tuscany-2x/org.apache.tuscany.sca$itest-ws-wspolicy/ws/src/main/java/org/apache/tuscany/sca/binding/ws/axis2/helloworld/ServerPWCBHandler.java>:[49,43] cannot find symbol
symbol  : variable WSPasswordCallback
location: class org.apache.tuscany.sca.binding.ws.axis2.helloworld.ServerPWCBHandler

[INFO] 5 errors 
[INFO] -------------------------------------------------------------
[JENKINS] Archiving disabled
[INFO] ------------------------------------------------------------------------
[ERROR] BUILD FAILURE
[INFO] ------------------------------------------------------------------------
[INFO] Compilation failure

<https://builds.apache.org/job/Tuscany-2x/org.apache.tuscany.sca$itest-ws-wspolicy/ws/src/main/java/org/apache/tuscany/sca/binding/ws/axis2/helloworld/ServerPWCBHandler.java>:[27,29] package org.apache.ws.security does not exist

<https://builds.apache.org/job/Tuscany-2x/org.apache.tuscany.sca$itest-ws-wspolicy/ws/src/main/java/org/apache/tuscany/sca/binding/ws/axis2/helloworld/ServerPWCBHandler.java>:[38,12] cannot find symbol
symbol  : class WSPasswordCallback
location: class org.apache.tuscany.sca.binding.ws.axis2.helloworld.ServerPWCBHandler

<https://builds.apache.org/job/Tuscany-2x/org.apache.tuscany.sca$itest-ws-wspolicy/ws/src/main/java/org/apache/tuscany/sca/binding/ws/axis2/helloworld/ServerPWCBHandler.java>:[38,39] cannot find symbol
symbol  : class WSPasswordCallback
location: class org.apache.tuscany.sca.binding.ws.axis2.helloworld.ServerPWCBHandler

<https://builds.apache.org/job/Tuscany-2x/org.apache.tuscany.sca$itest-ws-wspolicy/ws/src/main/java/org/apache/tuscany/sca/binding/ws/axis2/helloworld/ServerPWCBHandler.java>:[42,36] cannot find symbol
symbol  : variable WSPasswordCallback
location: class org.apache.tuscany.sca.binding.ws.axis2.helloworld.ServerPWCBHandler

<https://builds.apache.org/job/Tuscany-2x/org.apache.tuscany.sca$itest-ws-wspolicy/ws/src/main/java/org/apache/tuscany/sca/binding/ws/axis2/helloworld/ServerPWCBHandler.java>:[49,43] cannot find symbol
symbol  : variable WSPasswordCallback
location: class org.apache.tuscany.sca.binding.ws.axis2.helloworld.ServerPWCBHandler


[INFO] ------------------------------------------------------------------------
[INFO] For more information, run Maven with the -e switch
[INFO] ------------------------------------------------------------------------
[INFO] Total time: 34 minutes 32 seconds
[INFO] Finished at: Sun Jun 30 01:37:57 UTC 2013
[INFO] Final Memory: 735M/910M
[INFO] ------------------------------------------------------------------------
Maven failed with error.

Build failed in Jenkins: Tuscany-2x » Apache Tuscany SCA iTest WS with WSPolicy #1062

Posted by Apache Jenkins Server <je...@builds.apache.org>.
See <https://builds.apache.org/job/Tuscany-2x/org.apache.tuscany.sca$itest-ws-wspolicy/1062/>

------------------------------------------
[INFO] ------------------------------------------------------------------------
[INFO] Building Apache Tuscany SCA iTest WS with WSPolicy
[INFO]    task-segment: [clean, install]
[INFO] ------------------------------------------------------------------------
[INFO] [clean:clean {execution: default-clean}]
[INFO] [enforcer:enforce {execution: enforce-plugin-versions}]
[INFO] [remote-resources:process {execution: default}]
[INFO] [resources:resources {execution: default-resources}]
[INFO] Using 'UTF-8' encoding to copy filtered resources.
[INFO] Copying 6 resources
[INFO] Copying 1 resource
[INFO] Copying 3 resources
[INFO] [compiler:compile {execution: default-compile}]
[INFO] Compiling 4 source files to <https://builds.apache.org/job/Tuscany-2x/org.apache.tuscany.sca$itest-ws-wspolicy/ws/target/classes>
[INFO] -------------------------------------------------------------
[ERROR] COMPILATION ERROR : 
[INFO] -------------------------------------------------------------
[ERROR] <https://builds.apache.org/job/Tuscany-2x/org.apache.tuscany.sca$itest-ws-wspolicy/ws/src/main/java/org/apache/tuscany/sca/binding/ws/axis2/helloworld/ServerPWCBHandler.java>:[27,29] package org.apache.ws.security does not exist

[ERROR] <https://builds.apache.org/job/Tuscany-2x/org.apache.tuscany.sca$itest-ws-wspolicy/ws/src/main/java/org/apache/tuscany/sca/binding/ws/axis2/helloworld/ServerPWCBHandler.java>:[38,12] cannot find symbol
symbol  : class WSPasswordCallback
location: class org.apache.tuscany.sca.binding.ws.axis2.helloworld.ServerPWCBHandler

[ERROR] <https://builds.apache.org/job/Tuscany-2x/org.apache.tuscany.sca$itest-ws-wspolicy/ws/src/main/java/org/apache/tuscany/sca/binding/ws/axis2/helloworld/ServerPWCBHandler.java>:[38,39] cannot find symbol
symbol  : class WSPasswordCallback
location: class org.apache.tuscany.sca.binding.ws.axis2.helloworld.ServerPWCBHandler

[ERROR] <https://builds.apache.org/job/Tuscany-2x/org.apache.tuscany.sca$itest-ws-wspolicy/ws/src/main/java/org/apache/tuscany/sca/binding/ws/axis2/helloworld/ServerPWCBHandler.java>:[42,36] cannot find symbol
symbol  : variable WSPasswordCallback
location: class org.apache.tuscany.sca.binding.ws.axis2.helloworld.ServerPWCBHandler

[ERROR] <https://builds.apache.org/job/Tuscany-2x/org.apache.tuscany.sca$itest-ws-wspolicy/ws/src/main/java/org/apache/tuscany/sca/binding/ws/axis2/helloworld/ServerPWCBHandler.java>:[49,43] cannot find symbol
symbol  : variable WSPasswordCallback
location: class org.apache.tuscany.sca.binding.ws.axis2.helloworld.ServerPWCBHandler

[INFO] 5 errors 
[INFO] -------------------------------------------------------------
[JENKINS] Archiving disabled
[INFO] ------------------------------------------------------------------------
[ERROR] BUILD FAILURE
[INFO] ------------------------------------------------------------------------
[INFO] Compilation failure

<https://builds.apache.org/job/Tuscany-2x/org.apache.tuscany.sca$itest-ws-wspolicy/ws/src/main/java/org/apache/tuscany/sca/binding/ws/axis2/helloworld/ServerPWCBHandler.java>:[27,29] package org.apache.ws.security does not exist

<https://builds.apache.org/job/Tuscany-2x/org.apache.tuscany.sca$itest-ws-wspolicy/ws/src/main/java/org/apache/tuscany/sca/binding/ws/axis2/helloworld/ServerPWCBHandler.java>:[38,12] cannot find symbol
symbol  : class WSPasswordCallback
location: class org.apache.tuscany.sca.binding.ws.axis2.helloworld.ServerPWCBHandler

<https://builds.apache.org/job/Tuscany-2x/org.apache.tuscany.sca$itest-ws-wspolicy/ws/src/main/java/org/apache/tuscany/sca/binding/ws/axis2/helloworld/ServerPWCBHandler.java>:[38,39] cannot find symbol
symbol  : class WSPasswordCallback
location: class org.apache.tuscany.sca.binding.ws.axis2.helloworld.ServerPWCBHandler

<https://builds.apache.org/job/Tuscany-2x/org.apache.tuscany.sca$itest-ws-wspolicy/ws/src/main/java/org/apache/tuscany/sca/binding/ws/axis2/helloworld/ServerPWCBHandler.java>:[42,36] cannot find symbol
symbol  : variable WSPasswordCallback
location: class org.apache.tuscany.sca.binding.ws.axis2.helloworld.ServerPWCBHandler

<https://builds.apache.org/job/Tuscany-2x/org.apache.tuscany.sca$itest-ws-wspolicy/ws/src/main/java/org/apache/tuscany/sca/binding/ws/axis2/helloworld/ServerPWCBHandler.java>:[49,43] cannot find symbol
symbol  : variable WSPasswordCallback
location: class org.apache.tuscany.sca.binding.ws.axis2.helloworld.ServerPWCBHandler


[INFO] ------------------------------------------------------------------------
[INFO] For more information, run Maven with the -e switch
[INFO] ------------------------------------------------------------------------
[INFO] Total time: 33 minutes 32 seconds
[INFO] Finished at: Sat Jun 29 01:29:39 UTC 2013
[INFO] Final Memory: 731M/910M
[INFO] ------------------------------------------------------------------------
Maven failed with error.

Build failed in Jenkins: Tuscany-2x » Apache Tuscany SCA iTest WS with WSPolicy #1061

Posted by Apache Jenkins Server <je...@builds.apache.org>.
See <https://builds.apache.org/job/Tuscany-2x/org.apache.tuscany.sca$itest-ws-wspolicy/1061/>

------------------------------------------
[INFO] ------------------------------------------------------------------------
[INFO] Building Apache Tuscany SCA iTest WS with WSPolicy
[INFO]    task-segment: [clean, install]
[INFO] ------------------------------------------------------------------------
[INFO] [clean:clean {execution: default-clean}]
[INFO] [enforcer:enforce {execution: enforce-plugin-versions}]
[INFO] [remote-resources:process {execution: default}]
[INFO] [resources:resources {execution: default-resources}]
[INFO] Using 'UTF-8' encoding to copy filtered resources.
[INFO] Copying 6 resources
[INFO] Copying 1 resource
[INFO] Copying 3 resources
[INFO] [compiler:compile {execution: default-compile}]
[INFO] Compiling 4 source files to <https://builds.apache.org/job/Tuscany-2x/org.apache.tuscany.sca$itest-ws-wspolicy/ws/target/classes>
[INFO] -------------------------------------------------------------
[ERROR] COMPILATION ERROR : 
[INFO] -------------------------------------------------------------
[ERROR] <https://builds.apache.org/job/Tuscany-2x/org.apache.tuscany.sca$itest-ws-wspolicy/ws/src/main/java/org/apache/tuscany/sca/binding/ws/axis2/helloworld/ServerPWCBHandler.java>:[27,29] package org.apache.ws.security does not exist

[ERROR] <https://builds.apache.org/job/Tuscany-2x/org.apache.tuscany.sca$itest-ws-wspolicy/ws/src/main/java/org/apache/tuscany/sca/binding/ws/axis2/helloworld/ServerPWCBHandler.java>:[38,12] cannot find symbol
symbol  : class WSPasswordCallback
location: class org.apache.tuscany.sca.binding.ws.axis2.helloworld.ServerPWCBHandler

[ERROR] <https://builds.apache.org/job/Tuscany-2x/org.apache.tuscany.sca$itest-ws-wspolicy/ws/src/main/java/org/apache/tuscany/sca/binding/ws/axis2/helloworld/ServerPWCBHandler.java>:[38,39] cannot find symbol
symbol  : class WSPasswordCallback
location: class org.apache.tuscany.sca.binding.ws.axis2.helloworld.ServerPWCBHandler

[ERROR] <https://builds.apache.org/job/Tuscany-2x/org.apache.tuscany.sca$itest-ws-wspolicy/ws/src/main/java/org/apache/tuscany/sca/binding/ws/axis2/helloworld/ServerPWCBHandler.java>:[42,36] cannot find symbol
symbol  : variable WSPasswordCallback
location: class org.apache.tuscany.sca.binding.ws.axis2.helloworld.ServerPWCBHandler

[ERROR] <https://builds.apache.org/job/Tuscany-2x/org.apache.tuscany.sca$itest-ws-wspolicy/ws/src/main/java/org/apache/tuscany/sca/binding/ws/axis2/helloworld/ServerPWCBHandler.java>:[49,43] cannot find symbol
symbol  : variable WSPasswordCallback
location: class org.apache.tuscany.sca.binding.ws.axis2.helloworld.ServerPWCBHandler

[INFO] 5 errors 
[INFO] -------------------------------------------------------------
[JENKINS] Archiving disabled
[INFO] ------------------------------------------------------------------------
[ERROR] BUILD FAILURE
[INFO] ------------------------------------------------------------------------
[INFO] Compilation failure

<https://builds.apache.org/job/Tuscany-2x/org.apache.tuscany.sca$itest-ws-wspolicy/ws/src/main/java/org/apache/tuscany/sca/binding/ws/axis2/helloworld/ServerPWCBHandler.java>:[27,29] package org.apache.ws.security does not exist

<https://builds.apache.org/job/Tuscany-2x/org.apache.tuscany.sca$itest-ws-wspolicy/ws/src/main/java/org/apache/tuscany/sca/binding/ws/axis2/helloworld/ServerPWCBHandler.java>:[38,12] cannot find symbol
symbol  : class WSPasswordCallback
location: class org.apache.tuscany.sca.binding.ws.axis2.helloworld.ServerPWCBHandler

<https://builds.apache.org/job/Tuscany-2x/org.apache.tuscany.sca$itest-ws-wspolicy/ws/src/main/java/org/apache/tuscany/sca/binding/ws/axis2/helloworld/ServerPWCBHandler.java>:[38,39] cannot find symbol
symbol  : class WSPasswordCallback
location: class org.apache.tuscany.sca.binding.ws.axis2.helloworld.ServerPWCBHandler

<https://builds.apache.org/job/Tuscany-2x/org.apache.tuscany.sca$itest-ws-wspolicy/ws/src/main/java/org/apache/tuscany/sca/binding/ws/axis2/helloworld/ServerPWCBHandler.java>:[42,36] cannot find symbol
symbol  : variable WSPasswordCallback
location: class org.apache.tuscany.sca.binding.ws.axis2.helloworld.ServerPWCBHandler

<https://builds.apache.org/job/Tuscany-2x/org.apache.tuscany.sca$itest-ws-wspolicy/ws/src/main/java/org/apache/tuscany/sca/binding/ws/axis2/helloworld/ServerPWCBHandler.java>:[49,43] cannot find symbol
symbol  : variable WSPasswordCallback
location: class org.apache.tuscany.sca.binding.ws.axis2.helloworld.ServerPWCBHandler


[INFO] ------------------------------------------------------------------------
[INFO] For more information, run Maven with the -e switch
[INFO] ------------------------------------------------------------------------
[INFO] Total time: 32 minutes 53 seconds
[INFO] Finished at: Fri Jun 28 01:49:09 UTC 2013
[INFO] Final Memory: 735M/910M
[INFO] ------------------------------------------------------------------------
Maven failed with error.