You are viewing a plain text version of this content. The canonical link for it is here.
Posted to commits@tuscany.apache.org by Apache Hudson Server <hu...@hudson.apache.org> on 2010/11/08 02:23:19 UTC
Build failed in Hudson: Tuscany-2x #927
See <https://hudson.apache.org/hudson/job/Tuscany-2x/927/>
------------------------------------------
[...truncated 57014 lines...]
[INFO] Copying 0 resource
[INFO] Copying 3 resources
[INFO] [compiler:compile {execution: default-compile}]
[INFO] No sources to compile
[INFO] [resources:testResources {execution: default-testResources}]
[INFO] Using 'UTF-8' encoding to copy filtered resources.
[INFO] Copying 2 resources
[INFO] Copying 3 resources
[INFO] [dependency:unpack {execution: unpack}]
[INFO] Configured Artifact: org.apache.tuscany.sca:oasis-javacaa-contributions:2.0-SNAPSHOT:zip
[INFO] snapshot org.apache.tuscany.sca:oasis-javacaa-contributions:2.0-SNAPSHOT: checking for updates from oasis.contributions
[INFO] snapshot org.apache.tuscany.sca:oasis-javacaa-contributions:2.0-SNAPSHOT: checking for updates from apache.snapshots
Downloading: http://svn.apache.org/repos/asf/tuscany/maven/org/apache/tuscany/sca/oasis-javacaa-contributions/2.0-SNAPSHOT/oasis-javacaa-contributions-2.0-SNAPSHOT.zip
[INFO] Configured Artifact: org.apache.tuscany.sca:tuscany-otests-sca-j-caa-tests:2.0-SNAPSHOT:jar
[INFO] Unpacking /home/hudson/.m2/repository/org/apache/tuscany/sca/oasis-javacaa-contributions/2.0-SNAPSHOT/oasis-javacaa-contributions-2.0-SNAPSHOT.zip to
<https://hudson.apache.org/hudson/job/Tuscany-2x/ws/sca-2x/testing/compliance-tests/java-caa/target/oasis-contributions>
with includes null and excludes:null
[INFO] Unpacking /home/hudson/.m2/repository/org/apache/tuscany/sca/tuscany-otests-sca-j-caa-tests/2.0-SNAPSHOT/tuscany-otests-sca-j-caa-tests-2.0-SNAPSHOT.jar to
<https://hudson.apache.org/hudson/job/Tuscany-2x/ws/sca-2x/testing/compliance-tests/java-caa/target/test-classes>
with includes null and excludes:commons-logging.properties,oasis-sca-tests.properties,tuscany-oasis-sca-tests-errors.properties
[INFO] [compiler:testCompile {execution: default-testCompile}]
[INFO] Compiling 1 source file to <https://hudson.apache.org/hudson/job/Tuscany-2x/ws/sca-2x/testing/compliance-tests/java-caa/target/test-classes>
[INFO] -------------------------------------------------------------
[ERROR] COMPILATION ERROR :
[INFO] -------------------------------------------------------------
[ERROR] <https://hudson.apache.org/hudson/job/Tuscany-2x/ws/sca-2x/testing/compliance-tests/java-caa/src/test/java/org/apache/tuscany/sca/otest/TuscanyRuntimeBridge.java>:[36,17] package testClient does not exist
[ERROR] <https://hudson.apache.org/hudson/job/Tuscany-2x/ws/sca-2x/testing/compliance-tests/java-caa/src/test/java/org/apache/tuscany/sca/otest/TuscanyRuntimeBridge.java>:[37,13] package client does not exist
[ERROR] <https://hudson.apache.org/hudson/job/Tuscany-2x/ws/sca-2x/testing/compliance-tests/java-caa/src/test/java/org/apache/tuscany/sca/otest/TuscanyRuntimeBridge.java>:[43,45] cannot find symbol
symbol: class RuntimeBridge
public class TuscanyRuntimeBridge implements RuntimeBridge {
[ERROR] <https://hudson.apache.org/hudson/job/Tuscany-2x/ws/sca-2x/testing/compliance-tests/java-caa/src/test/java/org/apache/tuscany/sca/otest/TuscanyRuntimeBridge.java>:[215,26] cannot find symbol
symbol : class TestException_Exception
location: class org.apache.tuscany.sca.otest.TuscanyRuntimeBridge
[ERROR] <https://hudson.apache.org/hudson/job/Tuscany-2x/ws/sca-2x/testing/compliance-tests/java-caa/src/test/java/org/apache/tuscany/sca/otest/TuscanyRuntimeBridge.java>:[216,12] cannot find symbol
symbol : class TestException_Exception
location: class org.apache.tuscany.sca.otest.TuscanyRuntimeBridge
[ERROR] <https://hudson.apache.org/hudson/job/Tuscany-2x/ws/sca-2x/testing/compliance-tests/java-caa/src/test/java/org/apache/tuscany/sca/otest/TuscanyRuntimeBridge.java>:[216,42] cannot find symbol
symbol : class TestException_Exception
location: class org.apache.tuscany.sca.otest.TuscanyRuntimeBridge
[INFO] 6 errors
[INFO] -------------------------------------------------------------
[HUDSON] Archiving <https://hudson.apache.org/hudson/job/Tuscany-2x/ws/sca-2x/testing/compliance-tests/java-caa/pom.xml> to /home/hudson/hudson/jobs/Tuscany-2x/modules/org.apache.tuscany.sca$tuscany-compliance-test-java-caa/builds/2010-11-08_00-33-27/archive/org.apache.tuscany.sca/tuscany-compliance-test-java-caa/2.0-SNAPSHOT/pom.xml
[INFO] ------------------------------------------------------------------------
[ERROR] BUILD FAILURE
[INFO] ------------------------------------------------------------------------
[INFO] Compilation failure
<https://hudson.apache.org/hudson/job/Tuscany-2x/ws/sca-2x/testing/compliance-tests/java-caa/src/test/java/org/apache/tuscany/sca/otest/TuscanyRuntimeBridge.java>:[36,17] package testClient does not exist
<https://hudson.apache.org/hudson/job/Tuscany-2x/ws/sca-2x/testing/compliance-tests/java-caa/src/test/java/org/apache/tuscany/sca/otest/TuscanyRuntimeBridge.java>:[37,13] package client does not exist
<https://hudson.apache.org/hudson/job/Tuscany-2x/ws/sca-2x/testing/compliance-tests/java-caa/src/test/java/org/apache/tuscany/sca/otest/TuscanyRuntimeBridge.java>:[43,45] cannot find symbol
symbol: class RuntimeBridge
public class TuscanyRuntimeBridge implements RuntimeBridge {
<https://hudson.apache.org/hudson/job/Tuscany-2x/ws/sca-2x/testing/compliance-tests/java-caa/src/test/java/org/apache/tuscany/sca/otest/TuscanyRuntimeBridge.java>:[215,26] cannot find symbol
symbol : class TestException_Exception
location: class org.apache.tuscany.sca.otest.TuscanyRuntimeBridge
<https://hudson.apache.org/hudson/job/Tuscany-2x/ws/sca-2x/testing/compliance-tests/java-caa/src/test/java/org/apache/tuscany/sca/otest/TuscanyRuntimeBridge.java>:[216,12] cannot find symbol
symbol : class TestException_Exception
location: class org.apache.tuscany.sca.otest.TuscanyRuntimeBridge
<https://hudson.apache.org/hudson/job/Tuscany-2x/ws/sca-2x/testing/compliance-tests/java-caa/src/test/java/org/apache/tuscany/sca/otest/TuscanyRuntimeBridge.java>:[216,42] cannot find symbol
symbol : class TestException_Exception
location: class org.apache.tuscany.sca.otest.TuscanyRuntimeBridge
[INFO] ------------------------------------------------------------------------
[INFO] For more information, run Maven with the -e switch
[INFO] ------------------------------------------------------------------------
[INFO] Total time: 49 minutes 29 seconds
[INFO] Finished at: Mon Nov 08 01:23:06 UTC 2010
[INFO] Final Memory: 213M/740M
[INFO] ------------------------------------------------------------------------
Sending e-mails to: commits@tuscany.apache.org
channel stopped
2010-11-08 01:23:08.944::INFO: Shutdown hook executing
2010-11-08 01:23:08.944::INFO: Shutdown hook complete
2010-11-08 01:23:09.944::INFO: Shutdown hook complete
2010-11-08 01:23:10.944::INFO: Shutdown hook complete
2010-11-08 01:23:11.944::INFO: Shutdown hook complete
2010-11-08 01:23:12.945::INFO: Shutdown hook complete
2010-11-08 01:23:13.945::INFO: Shutdown hook complete
2010-11-08 01:23:15.447::WARN: failed org.mortbay.jetty.plugin.Jetty6PluginWebAppContext@296b4b{/helloworld-jsf,<https://hudson.apache.org/hudson/job/Tuscany-2x/ws/sca-2x/samples/learning-more/implementation-web/helloworld-jsf/src/main/webapp}>
java.lang.LinkageError: loader constraint violation: loader (instance of org/mortbay/jetty/webapp/WebAppClassLoader) previously initiated loading for a different type with name "javax/el/ExpressionFactory"
at java.lang.ClassLoader.defineClass1(Native Method)
at java.lang.ClassLoader.defineClassCond(ClassLoader.java:632)
at java.lang.ClassLoader.defineClass(ClassLoader.java:616)
at java.security.SecureClassLoader.defineClass(SecureClassLoader.java:141)
at java.net.URLClassLoader.defineClass(URLClassLoader.java:283)
at java.net.URLClassLoader.access$000(URLClassLoader.java:58)
at java.net.URLClassLoader$1.run(URLClassLoader.java:197)
at java.security.AccessController.doPrivileged(Native Method)
at java.net.URLClassLoader.findClass(URLClassLoader.java:190)
at org.mortbay.jetty.webapp.WebAppClassLoader.loadClass(WebAppClassLoader.java:392)
at org.mortbay.jetty.webapp.WebAppClassLoader.loadClass(WebAppClassLoader.java:363)
at java.lang.Class.getDeclaredMethods0(Native Method)
at java.lang.Class.privateGetDeclaredMethods(Class.java:2427)
at java.lang.Class.getDeclaredMethods(Class.java:1791)
at org.apache.myfaces.config.annotation.NoInjectionAnnotationLifecycleProvider.destroyInstance(NoInjectionAnnotationLifecycleProvider.java:90)
at org.apache.myfaces.webapp.AbstractMyFacesListener.doPreDestroy(AbstractMyFacesListener.java:59)
at org.apache.myfaces.webapp.StartupServletContextListener.doPredestroy(StartupServletContextListener.java:123)
at org.apache.myfaces.webapp.StartupServletContextListener.contextDestroyed(StartupServletContextListener.java:104)
at org.mortbay.jetty.handler.ContextHandler.doStop(ContextHandler.java:599)
at org.mortbay.jetty.webapp.WebAppContext.doStop(WebAppContext.java:504)
at org.mortbay.jetty.plugin.Jetty6PluginWebAppContext.doStop(Jetty6PluginWebAppContext.java:132)
at org.mortbay.component.AbstractLifeCycle.stop(AbstractLifeCycle.java:78)
at org.mortbay.jetty.handler.HandlerCollection.doStop(HandlerCollection.java:169)
at org.mortbay.component.AbstractLifeCycle.stop(AbstractLifeCycle.java:78)
at org.mortbay.jetty.handler.HandlerCollection.doStop(HandlerCollection.java:169)
at org.mortbay.component.AbstractLifeCycle.stop(AbstractLifeCycle.java:78)
at org.mortbay.jetty.handler.HandlerWrapper.doStop(HandlerWrapper.java:142)
at org.mortbay.jetty.Server.doStop(Server.java:283)
at org.mortbay.component.AbstractLifeCycle.stop(AbstractLifeCycle.java:78)
at org.mortbay.jetty.Server$ShutdownHookThread.run(Server.java:561)
2010-11-08 01:23:15.448::WARN: failed ContextHandlerCollection@647f02
java.lang.LinkageError: loader constraint violation: loader (instance of org/mortbay/jetty/webapp/WebAppClassLoader) previously initiated loading for a different type with name "javax/el/ExpressionFactory"
at java.lang.ClassLoader.defineClass1(Native Method)
at java.lang.ClassLoader.defineClassCond(ClassLoader.java:632)
at java.lang.ClassLoader.defineClass(ClassLoader.java:616)
at java.security.SecureClassLoader.defineClass(SecureClassLoader.java:141)
at java.net.URLClassLoader.defineClass(URLClassLoader.java:283)
at java.net.URLClassLoader.access$000(URLClassLoader.java:58)
at java.net.URLClassLoader$1.run(URLClassLoader.java:197)
at java.security.AccessController.doPrivileged(Native Method)
at java.net.URLClassLoader.findClass(URLClassLoader.java:190)
at org.mortbay.jetty.webapp.WebAppClassLoader.loadClass(WebAppClassLoader.java:392)
at org.mortbay.jetty.webapp.WebAppClassLoader.loadClass(WebAppClassLoader.java:363)
at java.lang.Class.getDeclaredMethods0(Native Method)
at java.lang.Class.privateGetDeclaredMethods(Class.java:2427)
at java.lang.Class.getDeclaredMethods(Class.java:1791)
at org.apache.myfaces.config.annotation.NoInjectionAnnotationLifecycleProvider.destroyInstance(NoInjectionAnnotationLifecycleProvider.java:90)
at org.apache.myfaces.webapp.AbstractMyFacesListener.doPreDestroy(AbstractMyFacesListener.java:59)
at org.apache.myfaces.webapp.StartupServletContextListener.doPredestroy(StartupServletContextListener.java:123)
at org.apache.myfaces.webapp.StartupServletContextListener.contextDestroyed(StartupServletContextListener.java:104)
at org.mortbay.jetty.handler.ContextHandler.doStop(ContextHandler.java:599)
at org.mortbay.jetty.webapp.WebAppContext.doStop(WebAppContext.java:504)
at org.mortbay.jetty.plugin.Jetty6PluginWebAppContext.doStop(Jetty6PluginWebAppContext.java:132)
at org.mortbay.component.AbstractLifeCycle.stop(AbstractLifeCycle.java:78)
at org.mortbay.jetty.handler.HandlerCollection.doStop(HandlerCollection.java:169)
at org.mortbay.component.AbstractLifeCycle.stop(AbstractLifeCycle.java:78)
at org.mortbay.jetty.handler.HandlerCollection.doStop(HandlerCollection.java:169)
at org.mortbay.component.AbstractLifeCycle.stop(AbstractLifeCycle.java:78)
at org.mortbay.jetty.handler.HandlerWrapper.doStop(HandlerWrapper.java:142)
at org.mortbay.jetty.Server.doStop(Server.java:283)
at org.mortbay.component.AbstractLifeCycle.stop(AbstractLifeCycle.java:78)
at org.mortbay.jetty.Server$ShutdownHookThread.run(Server.java:561)
2010-11-08 01:23:15.448::WARN: failed HandlerCollection@1ce96fa
java.lang.LinkageError: loader constraint violation: loader (instance of org/mortbay/jetty/webapp/WebAppClassLoader) previously initiated loading for a different type with name "javax/el/ExpressionFactory"
at java.lang.ClassLoader.defineClass1(Native Method)
at java.lang.ClassLoader.defineClassCond(ClassLoader.java:632)
at java.lang.ClassLoader.defineClass(ClassLoader.java:616)
at java.security.SecureClassLoader.defineClass(SecureClassLoader.java:141)
at java.net.URLClassLoader.defineClass(URLClassLoader.java:283)
at java.net.URLClassLoader.access$000(URLClassLoader.java:58)
at java.net.URLClassLoader$1.run(URLClassLoader.java:197)
at java.security.AccessController.doPrivileged(Native Method)
at java.net.URLClassLoader.findClass(URLClassLoader.java:190)
at org.mortbay.jetty.webapp.WebAppClassLoader.loadClass(WebAppClassLoader.java:392)
at org.mortbay.jetty.webapp.WebAppClassLoader.loadClass(WebAppClassLoader.java:363)
at java.lang.Class.getDeclaredMethods0(Native Method)
at java.lang.Class.privateGetDeclaredMethods(Class.java:2427)
at java.lang.Class.getDeclaredMethods(Class.java:1791)
at org.apache.myfaces.config.annotation.NoInjectionAnnotationLifecycleProvider.destroyInstance(NoInjectionAnnotationLifecycleProvider.java:90)
at org.apache.myfaces.webapp.AbstractMyFacesListener.doPreDestroy(AbstractMyFacesListener.java:59)
at org.apache.myfaces.webapp.StartupServletContextListener.doPredestroy(StartupServletContextListener.java:123)
at org.apache.myfaces.webapp.StartupServletContextListener.contextDestroyed(StartupServletContextListener.java:104)
at org.mortbay.jetty.handler.ContextHandler.doStop(ContextHandler.java:599)
at org.mortbay.jetty.webapp.WebAppContext.doStop(WebAppContext.java:504)
at org.mortbay.jetty.plugin.Jetty6PluginWebAppContext.doStop(Jetty6PluginWebAppContext.java:132)
at org.mortbay.component.AbstractLifeCycle.stop(AbstractLifeCycle.java:78)
at org.mortbay.jetty.handler.HandlerCollection.doStop(HandlerCollection.java:169)
at org.mortbay.component.AbstractLifeCycle.stop(AbstractLifeCycle.java:78)
at org.mortbay.jetty.handler.HandlerCollection.doStop(HandlerCollection.java:169)
at org.mortbay.component.AbstractLifeCycle.stop(AbstractLifeCycle.java:78)
at org.mortbay.jetty.handler.HandlerWrapper.doStop(HandlerWrapper.java:142)
at org.mortbay.jetty.Server.doStop(Server.java:283)
at org.mortbay.component.AbstractLifeCycle.stop(AbstractLifeCycle.java:78)
at org.mortbay.jetty.Server$ShutdownHookThread.run(Server.java:561)
2010-11-08 01:23:15.448::WARN: failed Server@1953a58
java.lang.LinkageError: loader constraint violation: loader (instance of org/mortbay/jetty/webapp/WebAppClassLoader) previously initiated loading for a different type with name "javax/el/ExpressionFactory"
at java.lang.ClassLoader.defineClass1(Native Method)
at java.lang.ClassLoader.defineClassCond(ClassLoader.java:632)
at java.lang.ClassLoader.defineClass(ClassLoader.java:616)
at java.security.SecureClassLoader.defineClass(SecureClassLoader.java:141)
at java.net.URLClassLoader.defineClass(URLClassLoader.java:283)
at java.net.URLClassLoader.access$000(URLClassLoader.java:58)
at java.net.URLClassLoader$1.run(URLClassLoader.java:197)
at java.security.AccessController.doPrivileged(Native Method)
at java.net.URLClassLoader.findClass(URLClassLoader.java:190)
at org.mortbay.jetty.webapp.WebAppClassLoader.loadClass(WebAppClassLoader.java:392)
at org.mortbay.jetty.webapp.WebAppClassLoader.loadClass(WebAppClassLoader.java:363)
at java.lang.Class.getDeclaredMethods0(Native Method)
at java.lang.Class.privateGetDeclaredMethods(Class.java:2427)
at java.lang.Class.getDeclaredMethods(Class.java:1791)
at org.apache.myfaces.config.annotation.NoInjectionAnnotationLifecycleProvider.destroyInstance(NoInjectionAnnotationLifecycleProvider.java:90)
at org.apache.myfaces.webapp.AbstractMyFacesListener.doPreDestroy(AbstractMyFacesListener.java:59)
at org.apache.myfaces.webapp.StartupServletContextListener.doPredestroy(StartupServletContextListener.java:123)
at org.apache.myfaces.webapp.StartupServletContextListener.contextDestroyed(StartupServletContextListener.java:104)
at org.mortbay.jetty.handler.ContextHandler.doStop(ContextHandler.java:599)
at org.mortbay.jetty.webapp.WebAppContext.doStop(WebAppContext.java:504)
at org.mortbay.jetty.plugin.Jetty6PluginWebAppContext.doStop(Jetty6PluginWebAppContext.java:132)
at org.mortbay.component.AbstractLifeCycle.stop(AbstractLifeCycle.java:78)
at org.mortbay.jetty.handler.HandlerCollection.doStop(HandlerCollection.java:169)
at org.mortbay.component.AbstractLifeCycle.stop(AbstractLifeCycle.java:78)
at org.mortbay.jetty.handler.HandlerCollection.doStop(HandlerCollection.java:169)
at org.mortbay.component.AbstractLifeCycle.stop(AbstractLifeCycle.java:78)
at org.mortbay.jetty.handler.HandlerWrapper.doStop(HandlerWrapper.java:142)
at org.mortbay.jetty.Server.doStop(Server.java:283)
at org.mortbay.component.AbstractLifeCycle.stop(AbstractLifeCycle.java:78)
at org.mortbay.jetty.Server$ShutdownHookThread.run(Server.java:561)
Exception in thread "Shutdown" java.lang.LinkageError: loader constraint violation: loader (instance of org/mortbay/jetty/webapp/WebAppClassLoader) previously initiated loading for a different type with name "javax/el/ExpressionFactory"
at java.lang.ClassLoader.defineClass1(Native Method)
at java.lang.ClassLoader.defineClassCond(ClassLoader.java:632)
at java.lang.ClassLoader.defineClass(ClassLoader.java:616)
at java.security.SecureClassLoader.defineClass(SecureClassLoader.java:141)
at java.net.URLClassLoader.defineClass(URLClassLoader.java:283)
at java.net.URLClassLoader.access$000(URLClassLoader.java:58)
at java.net.URLClassLoader$1.run(URLClassLoader.java:197)
at java.security.AccessController.doPrivileged(Native Method)
at java.net.URLClassLoader.findClass(URLClassLoader.java:190)
at org.mortbay.jetty.webapp.WebAppClassLoader.loadClass(WebAppClassLoader.java:392)
at org.mortbay.jetty.webapp.WebAppClassLoader.loadClass(WebAppClassLoader.java:363)
at java.lang.Class.getDeclaredMethods0(Native Method)
at java.lang.Class.privateGetDeclaredMethods(Class.java:2427)
at java.lang.Class.getDeclaredMethods(Class.java:1791)
at org.apache.myfaces.config.annotation.NoInjectionAnnotationLifecycleProvider.destroyInstance(NoInjectionAnnotationLifecycleProvider.java:90)
at org.apache.myfaces.webapp.AbstractMyFacesListener.doPreDestroy(AbstractMyFacesListener.java:59)
at org.apache.myfaces.webapp.StartupServletContextListener.doPredestroy(StartupServletContextListener.java:123)
at org.apache.myfaces.webapp.StartupServletContextListener.contextDestroyed(StartupServletContextListener.java:104)
at org.mortbay.jetty.handler.ContextHandler.doStop(ContextHandler.java:599)
at org.mortbay.jetty.webapp.WebAppContext.doStop(WebAppContext.java:504)
at org.mortbay.jetty.plugin.Jetty6PluginWebAppContext.doStop(Jetty6PluginWebAppContext.java:132)
at org.mortbay.component.AbstractLifeCycle.stop(AbstractLifeCycle.java:78)
at org.mortbay.jetty.handler.HandlerCollection.doStop(HandlerCollection.java:169)
at org.mortbay.component.AbstractLifeCycle.stop(AbstractLifeCycle.java:78)
at org.mortbay.jetty.handler.HandlerCollection.doStop(HandlerCollection.java:169)
at org.mortbay.component.AbstractLifeCycle.stop(AbstractLifeCycle.java:78)
at org.mortbay.jetty.handler.HandlerWrapper.doStop(HandlerWrapper.java:142)
at org.mortbay.jetty.Server.doStop(Server.java:283)
at org.mortbay.component.AbstractLifeCycle.stop(AbstractLifeCycle.java:78)
at org.mortbay.jetty.Server$ShutdownHookThread.run(Server.java:561)
Hudson build is back to normal : Tuscany-2x #930
Posted by Apache Hudson Server <hu...@hudson.apache.org>.
See <https://hudson.apache.org/hudson/job/Tuscany-2x/930/>
Build failed in Hudson: Tuscany-2x #929
Posted by Apache Hudson Server <hu...@hudson.apache.org>.
See <https://hudson.apache.org/hudson/job/Tuscany-2x/929/changes>
Changes:
[slaws] Correct to call the right launcher
[slaws] TUSCANY-3751 - now 1.0.7 of the maven-bundle-plugin is released I can remove the snapshot and turn the enforcer back on (merge from beta1)
[slaws] Top level notice tidying (merge from beta1)
[slaws] TUSCANY-3756 - from the JIRA this is the "leave them but remove most of the detail and refer to the web page " option. (merge from beta1)
[slaws] TUSCANY-3674 - Add some rudimentary function to the helloworld apps so that the very first time user at least has a chance of working out what's going on. (merge from beta1)
[slaws] TUSCANY-3727 - fix binding-ws which jars so that it doesn't have base Tuscany jars. So we have binding-rmi and binding-ws as examples now. It this works we'll fix the rest for the next release. Also, for compliance tests, ensure that the phase of the unpack allows the local error message file to take precedence
[slaws] TUSCANY-3753 - remove large target files from samples.
[slaws] TUSCANY-3749 - Beta1 changes (merge from beta1 branch)
[slaws] Correct relative location of contribution
[bdaniel] remove unused dependency on asm
------------------------------------------
[...truncated 34987 lines...]
[java] Caused by: org.oasisopen.sca.ServiceUnavailableException: org.apache.tuscany.sca.core.scope.TargetInitializationException: org.apache.tuscany.sca.implementation.java.invocation.EventInvocationException: Exception thrown by event method [calculate]
[java] at org.apache.tuscany.sca.core.scope.impl.CompositeScopeContainer.getWrapper(CompositeScopeContainer.java:62)
[java] at org.apache.tuscany.sca.core.scope.impl.CompositeScopeContainer.start(CompositeScopeContainer.java:81)
[java] at org.apache.tuscany.sca.core.assembly.impl.CompositeActivatorImpl.start(CompositeActivatorImpl.java:543)
[java] at org.apache.tuscany.sca.core.assembly.impl.CompositeActivatorImpl.start(CompositeActivatorImpl.java:345)
[java] at org.apache.tuscany.sca.node.impl.NodeImpl.start(NodeImpl.java:146)
[java] ... 2 more
[java] Caused by: org.apache.tuscany.sca.core.scope.TargetInitializationException: org.apache.tuscany.sca.implementation.java.invocation.EventInvocationException: Exception thrown by event method [calculate]
[java] at org.apache.tuscany.sca.implementation.java.context.ReflectiveInstanceWrapper.start(ReflectiveInstanceWrapper.java:57)
[java] at org.apache.tuscany.sca.core.scope.impl.CompositeScopeContainer.getWrapper(CompositeScopeContainer.java:60)
[java] ... 6 more
[java] Caused by: org.apache.tuscany.sca.implementation.java.invocation.EventInvocationException: Exception thrown by event method [calculate]
[java] at org.apache.tuscany.sca.implementation.java.invocation.MethodEventInvoker.invokeEvent(MethodEventInvoker.java:52)
[java] at org.apache.tuscany.sca.implementation.java.context.ReflectiveInstanceWrapper.start(ReflectiveInstanceWrapper.java:50)
[java] ... 7 more
[java] Caused by: org.apache.tuscany.sca.host.http.ServletMappingException: java.net.BindException: Address already in use
[java] at org.apache.tuscany.sca.http.jetty.JettyServer.addServletMapping(JettyServer.java:291)
[java] at org.apache.tuscany.sca.http.jetty.JettyServer.addServletMapping(JettyServer.java:212)
[java] at org.apache.tuscany.sca.host.http.DefaultServletHostExtensionPoint$LazyServletHost.addServletMapping(DefaultServletHostExtensionPoint.java:124)
[java] at org.apache.tuscany.sca.binding.ws.axis2.provider.Axis2ServiceBindingProvider.start(Axis2ServiceBindingProvider.java:204)
[java] at org.apache.tuscany.sca.core.invocation.impl.AsyncJDKInvocationHandler$2.run(AsyncJDKInvocationHandler.java:473)
[java] at java.security.AccessController.doPrivileged(Native Method)
[java] at org.apache.tuscany.sca.core.invocation.impl.AsyncJDKInvocationHandler.startEndpoint(AsyncJDKInvocationHandler.java:471)
[java] at org.apache.tuscany.sca.core.invocation.impl.AsyncJDKInvocationHandler.getAsyncCallback(AsyncJDKInvocationHandler.java:452)
[java] at org.apache.tuscany.sca.core.invocation.impl.AsyncJDKInvocationHandler.invokeAsync(AsyncJDKInvocationHandler.java:305)
[java] at org.apache.tuscany.sca.core.invocation.impl.AsyncJDKInvocationHandler.doInvokeSync(AsyncJDKInvocationHandler.java:225)
[java] at org.apache.tuscany.sca.core.invocation.impl.AsyncJDKInvocationHandler.invoke(AsyncJDKInvocationHandler.java:160)
[java] at $Proxy12.calculate(Unknown Source)
[java] at calculator.CalculatorServiceProxyImpl.calculate(CalculatorServiceProxyImpl.java:60)
[java] at calculator.CalculatorServiceProxyImpl.calculate(CalculatorServiceProxyImpl.java:51)
[java] at sun.reflect.NativeMethodAccessorImpl.invoke0(Native Method)
[java] at sun.reflect.NativeMethodAccessorImpl.invoke(NativeMethodAccessorImpl.java:39)
[java] at sun.reflect.DelegatingMethodAccessorImpl.invoke(DelegatingMethodAccessorImpl.java:25)
[java] at java.lang.reflect.Method.invoke(Method.java:597)
[java] at org.apache.tuscany.sca.implementation.java.invocation.JavaImplementationInvoker.invoke(JavaImplementationInvoker.java:158)
[java] at org.apache.tuscany.sca.binding.sca.provider.SCABindingInvoker.invoke(SCABindingInvoker.java:88)
[java] at org.apache.tuscany.sca.core.invocation.impl.JDKInvocationHandler.invoke(JDKInvocationHandler.java:298)
[java] at org.apache.tuscany.sca.core.invocation.impl.JDKInvocationHandler.invoke(JDKInvocationHandler.java:254)
[java] at org.apache.tuscany.sca.core.invocation.impl.JDKInvocationHandler.invoke(JDKInvocationHandler.java:114)
[java] at org.apache.tuscany.sca.core.invocation.impl.AsyncJDKInvocationHandler.doInvokeSync(AsyncJDKInvocationHandler.java:238)
[java] at org.apache.tuscany.sca.core.invocation.impl.AsyncJDKInvocationHandler.invoke(AsyncJDKInvocationHandler.java:160)
[java] at $Proxy11.calculate(Unknown Source)
[java] at calculator.CalculatorClient.calculate(CalculatorClient.java:44)
[java] at sun.reflect.NativeMethodAccessorImpl.invoke0(Native Method)
[java] at sun.reflect.NativeMethodAccessorImpl.invoke(NativeMethodAccessorImpl.java:39)
[java] at sun.reflect.DelegatingMethodAccessorImpl.invoke(DelegatingMethodAccessorImpl.java:25)
[java] at java.lang.reflect.Method.invoke(Method.java:597)
[java] at org.apache.tuscany.sca.implementation.java.invocation.MethodEventInvoker.invokeEvent(MethodEventInvoker.java:43)
[java] ... 8 more
[java] Caused by: java.net.BindException: Address already in use
[java] at sun.nio.ch.Net.bind(Native Method)
[java] at sun.nio.ch.ServerSocketChannelImpl.bind(ServerSocketChannelImpl.java:119)
[java] at sun.nio.ch.ServerSocketAdaptor.bind(ServerSocketAdaptor.java:59)
[java] at org.mortbay.jetty.nio.SelectChannelConnector.open(SelectChannelConnector.java:216)
[java] at org.mortbay.jetty.nio.SelectChannelConnector.doStart(SelectChannelConnector.java:315)
[java] at org.mortbay.component.AbstractLifeCycle.start(AbstractLifeCycle.java:50)
[java] at org.mortbay.jetty.Server.doStart(Server.java:235)
[java] at org.mortbay.component.AbstractLifeCycle.start(AbstractLifeCycle.java:50)
[java] at org.apache.tuscany.sca.http.jetty.JettyServer.addServletMapping(JettyServer.java:284)
[java] ... 39 more
[HUDSON] Archiving <https://hudson.apache.org/hudson/job/Tuscany-2x/ws/sca-2x/testing/itest/distribution/launcher-embedded-jse/pom.xml> to /home/hudson/hudson/jobs/Tuscany-2x/modules/org.apache.tuscany.sca$itest-distribution-launcher-embedded-jse/builds/2010-11-09_13-49-35/archive/org.apache.tuscany.sca/itest-distribution-launcher-embedded-jse/2.0-SNAPSHOT/pom.xml
[HUDSON] Archiving <https://hudson.apache.org/hudson/job/Tuscany-2x/ws/sca-2x/testing/itest/distribution/launcher-embedded-jse/target/itest-distribution-launcher-embedded-jse-2.0-SNAPSHOT.jar> to /home/hudson/hudson/jobs/Tuscany-2x/modules/org.apache.tuscany.sca$itest-distribution-launcher-embedded-jse/builds/2010-11-09_13-49-35/archive/org.apache.tuscany.sca/itest-distribution-launcher-embedded-jse/2.0-SNAPSHOT/itest-distribution-launcher-embedded-jse-2.0-SNAPSHOT.jar
[INFO] ------------------------------------------------------------------------
[ERROR] BUILD ERROR
[INFO] ------------------------------------------------------------------------
[INFO] An Ant BuildException has occured: The following error occurred while executing this line:
<https://hudson.apache.org/hudson/job/Tuscany-2x/ws/sca-2x/testing/itest/distribution/launcher-embedded-jse/build.xml>:52: The following error occurred while executing this line:
<https://hudson.apache.org/hudson/job/Tuscany-2x/ws/sca-2x/distribution/all/target/apache-tuscany-sca-all-2.0-SNAPSHOT.dir/tuscany-sca-2.0-SNAPSHOT/samples/running-tuscany/embedded-jse/build.xml>:125: Java returned: 1
[INFO] ------------------------------------------------------------------------
[INFO] For more information, run Maven with the -e switch
[INFO] ------------------------------------------------------------------------
[INFO] Total time: 36 minutes 27 seconds
[INFO] Finished at: Tue Nov 09 14:26:12 UTC 2010
[INFO] Final Memory: 172M/749M
[INFO] ------------------------------------------------------------------------
Waiting for Hudson to finish collecting data
Sending e-mails to: commits@tuscany.apache.org
Sending e-mails to: commits@tuscany.apache.org
Sending e-mails to: commits@tuscany.apache.org
Sending e-mails to: commits@tuscany.apache.org
Sending e-mails to: commits@tuscany.apache.org
channel stopped
2010-11-09 14:26:15.886::INFO: Shutdown hook executing
2010-11-09 14:26:15.886::INFO: Shutdown hook complete
2010-11-09 14:26:16.886::INFO: Shutdown hook complete
2010-11-09 14:26:17.886::INFO: Shutdown hook complete
2010-11-09 14:26:18.886::INFO: Shutdown hook complete
2010-11-09 14:26:19.886::INFO: Shutdown hook complete
2010-11-09 14:26:20.887::INFO: Shutdown hook complete
2010-11-09 14:26:22.389::WARN: failed org.mortbay.jetty.plugin.Jetty6PluginWebAppContext@187e0e9{/helloworld-jsf,<https://hudson.apache.org/hudson/job/Tuscany-2x/ws/sca-2x/samples/learning-more/implementation-web/helloworld-jsf/src/main/webapp}>
java.lang.LinkageError: loader constraint violation: loader (instance of org/mortbay/jetty/webapp/WebAppClassLoader) previously initiated loading for a different type with name "javax/el/ExpressionFactory"
at java.lang.ClassLoader.defineClass1(Native Method)
at java.lang.ClassLoader.defineClassCond(ClassLoader.java:632)
at java.lang.ClassLoader.defineClass(ClassLoader.java:616)
at java.security.SecureClassLoader.defineClass(SecureClassLoader.java:141)
at java.net.URLClassLoader.defineClass(URLClassLoader.java:283)
at java.net.URLClassLoader.access$000(URLClassLoader.java:58)
at java.net.URLClassLoader$1.run(URLClassLoader.java:197)
at java.security.AccessController.doPrivileged(Native Method)
at java.net.URLClassLoader.findClass(URLClassLoader.java:190)
at org.mortbay.jetty.webapp.WebAppClassLoader.loadClass(WebAppClassLoader.java:392)
at org.mortbay.jetty.webapp.WebAppClassLoader.loadClass(WebAppClassLoader.java:363)
at java.lang.Class.getDeclaredMethods0(Native Method)
at java.lang.Class.privateGetDeclaredMethods(Class.java:2427)
at java.lang.Class.getDeclaredMethods(Class.java:1791)
at org.apache.myfaces.config.annotation.NoInjectionAnnotationLifecycleProvider.destroyInstance(NoInjectionAnnotationLifecycleProvider.java:90)
at org.apache.myfaces.webapp.AbstractMyFacesListener.doPreDestroy(AbstractMyFacesListener.java:59)
at org.apache.myfaces.webapp.StartupServletContextListener.doPredestroy(StartupServletContextListener.java:123)
at org.apache.myfaces.webapp.StartupServletContextListener.contextDestroyed(StartupServletContextListener.java:104)
at org.mortbay.jetty.handler.ContextHandler.doStop(ContextHandler.java:599)
at org.mortbay.jetty.webapp.WebAppContext.doStop(WebAppContext.java:504)
at org.mortbay.jetty.plugin.Jetty6PluginWebAppContext.doStop(Jetty6PluginWebAppContext.java:132)
at org.mortbay.component.AbstractLifeCycle.stop(AbstractLifeCycle.java:78)
at org.mortbay.jetty.handler.HandlerCollection.doStop(HandlerCollection.java:169)
at org.mortbay.component.AbstractLifeCycle.stop(AbstractLifeCycle.java:78)
at org.mortbay.jetty.handler.HandlerCollection.doStop(HandlerCollection.java:169)
at org.mortbay.component.AbstractLifeCycle.stop(AbstractLifeCycle.java:78)
at org.mortbay.jetty.handler.HandlerWrapper.doStop(HandlerWrapper.java:142)
at org.mortbay.jetty.Server.doStop(Server.java:283)
at org.mortbay.component.AbstractLifeCycle.stop(AbstractLifeCycle.java:78)
at org.mortbay.jetty.Server$ShutdownHookThread.run(Server.java:561)
2010-11-09 14:26:22.390::WARN: failed ContextHandlerCollection@a82907
java.lang.LinkageError: loader constraint violation: loader (instance of org/mortbay/jetty/webapp/WebAppClassLoader) previously initiated loading for a different type with name "javax/el/ExpressionFactory"
at java.lang.ClassLoader.defineClass1(Native Method)
at java.lang.ClassLoader.defineClassCond(ClassLoader.java:632)
at java.lang.ClassLoader.defineClass(ClassLoader.java:616)
at java.security.SecureClassLoader.defineClass(SecureClassLoader.java:141)
at java.net.URLClassLoader.defineClass(URLClassLoader.java:283)
at java.net.URLClassLoader.access$000(URLClassLoader.java:58)
at java.net.URLClassLoader$1.run(URLClassLoader.java:197)
at java.security.AccessController.doPrivileged(Native Method)
at java.net.URLClassLoader.findClass(URLClassLoader.java:190)
at org.mortbay.jetty.webapp.WebAppClassLoader.loadClass(WebAppClassLoader.java:392)
at org.mortbay.jetty.webapp.WebAppClassLoader.loadClass(WebAppClassLoader.java:363)
at java.lang.Class.getDeclaredMethods0(Native Method)
at java.lang.Class.privateGetDeclaredMethods(Class.java:2427)
at java.lang.Class.getDeclaredMethods(Class.java:1791)
at org.apache.myfaces.config.annotation.NoInjectionAnnotationLifecycleProvider.destroyInstance(NoInjectionAnnotationLifecycleProvider.java:90)
at org.apache.myfaces.webapp.AbstractMyFacesListener.doPreDestroy(AbstractMyFacesListener.java:59)
at org.apache.myfaces.webapp.StartupServletContextListener.doPredestroy(StartupServletContextListener.java:123)
at org.apache.myfaces.webapp.StartupServletContextListener.contextDestroyed(StartupServletContextListener.java:104)
at org.mortbay.jetty.handler.ContextHandler.doStop(ContextHandler.java:599)
at org.mortbay.jetty.webapp.WebAppContext.doStop(WebAppContext.java:504)
at org.mortbay.jetty.plugin.Jetty6PluginWebAppContext.doStop(Jetty6PluginWebAppContext.java:132)
at org.mortbay.component.AbstractLifeCycle.stop(AbstractLifeCycle.java:78)
at org.mortbay.jetty.handler.HandlerCollection.doStop(HandlerCollection.java:169)
at org.mortbay.component.AbstractLifeCycle.stop(AbstractLifeCycle.java:78)
at org.mortbay.jetty.handler.HandlerCollection.doStop(HandlerCollection.java:169)
at org.mortbay.component.AbstractLifeCycle.stop(AbstractLifeCycle.java:78)
at org.mortbay.jetty.handler.HandlerWrapper.doStop(HandlerWrapper.java:142)
at org.mortbay.jetty.Server.doStop(Server.java:283)
at org.mortbay.component.AbstractLifeCycle.stop(AbstractLifeCycle.java:78)
at org.mortbay.jetty.Server$ShutdownHookThread.run(Server.java:561)
2010-11-09 14:26:22.390::WARN: failed HandlerCollection@1d962f
java.lang.LinkageError: loader constraint violation: loader (instance of org/mortbay/jetty/webapp/WebAppClassLoader) previously initiated loading for a different type with name "javax/el/ExpressionFactory"
at java.lang.ClassLoader.defineClass1(Native Method)
at java.lang.ClassLoader.defineClassCond(ClassLoader.java:632)
at java.lang.ClassLoader.defineClass(ClassLoader.java:616)
at java.security.SecureClassLoader.defineClass(SecureClassLoader.java:141)
at java.net.URLClassLoader.defineClass(URLClassLoader.java:283)
at java.net.URLClassLoader.access$000(URLClassLoader.java:58)
at java.net.URLClassLoader$1.run(URLClassLoader.java:197)
at java.security.AccessController.doPrivileged(Native Method)
at java.net.URLClassLoader.findClass(URLClassLoader.java:190)
at org.mortbay.jetty.webapp.WebAppClassLoader.loadClass(WebAppClassLoader.java:392)
at org.mortbay.jetty.webapp.WebAppClassLoader.loadClass(WebAppClassLoader.java:363)
at java.lang.Class.getDeclaredMethods0(Native Method)
at java.lang.Class.privateGetDeclaredMethods(Class.java:2427)
at java.lang.Class.getDeclaredMethods(Class.java:1791)
at org.apache.myfaces.config.annotation.NoInjectionAnnotationLifecycleProvider.destroyInstance(NoInjectionAnnotationLifecycleProvider.java:90)
at org.apache.myfaces.webapp.AbstractMyFacesListener.doPreDestroy(AbstractMyFacesListener.java:59)
at org.apache.myfaces.webapp.StartupServletContextListener.doPredestroy(StartupServletContextListener.java:123)
at org.apache.myfaces.webapp.StartupServletContextListener.contextDestroyed(StartupServletContextListener.java:104)
at org.mortbay.jetty.handler.ContextHandler.doStop(ContextHandler.java:599)
at org.mortbay.jetty.webapp.WebAppContext.doStop(WebAppContext.java:504)
at org.mortbay.jetty.plugin.Jetty6PluginWebAppContext.doStop(Jetty6PluginWebAppContext.java:132)
at org.mortbay.component.AbstractLifeCycle.stop(AbstractLifeCycle.java:78)
at org.mortbay.jetty.handler.HandlerCollection.doStop(HandlerCollection.java:169)
at org.mortbay.component.AbstractLifeCycle.stop(AbstractLifeCycle.java:78)
at org.mortbay.jetty.handler.HandlerCollection.doStop(HandlerCollection.java:169)
at org.mortbay.component.AbstractLifeCycle.stop(AbstractLifeCycle.java:78)
at org.mortbay.jetty.handler.HandlerWrapper.doStop(HandlerWrapper.java:142)
at org.mortbay.jetty.Server.doStop(Server.java:283)
at org.mortbay.component.AbstractLifeCycle.stop(AbstractLifeCycle.java:78)
at org.mortbay.jetty.Server$ShutdownHookThread.run(Server.java:561)
2010-11-09 14:26:22.391::WARN: failed Server@817674
java.lang.LinkageError: loader constraint violation: loader (instance of org/mortbay/jetty/webapp/WebAppClassLoader) previously initiated loading for a different type with name "javax/el/ExpressionFactory"
at java.lang.ClassLoader.defineClass1(Native Method)
at java.lang.ClassLoader.defineClassCond(ClassLoader.java:632)
at java.lang.ClassLoader.defineClass(ClassLoader.java:616)
at java.security.SecureClassLoader.defineClass(SecureClassLoader.java:141)
at java.net.URLClassLoader.defineClass(URLClassLoader.java:283)
at java.net.URLClassLoader.access$000(URLClassLoader.java:58)
at java.net.URLClassLoader$1.run(URLClassLoader.java:197)
at java.security.AccessController.doPrivileged(Native Method)
at java.net.URLClassLoader.findClass(URLClassLoader.java:190)
at org.mortbay.jetty.webapp.WebAppClassLoader.loadClass(WebAppClassLoader.java:392)
at org.mortbay.jetty.webapp.WebAppClassLoader.loadClass(WebAppClassLoader.java:363)
at java.lang.Class.getDeclaredMethods0(Native Method)
at java.lang.Class.privateGetDeclaredMethods(Class.java:2427)
at java.lang.Class.getDeclaredMethods(Class.java:1791)
at org.apache.myfaces.config.annotation.NoInjectionAnnotationLifecycleProvider.destroyInstance(NoInjectionAnnotationLifecycleProvider.java:90)
at org.apache.myfaces.webapp.AbstractMyFacesListener.doPreDestroy(AbstractMyFacesListener.java:59)
at org.apache.myfaces.webapp.StartupServletContextListener.doPredestroy(StartupServletContextListener.java:123)
at org.apache.myfaces.webapp.StartupServletContextListener.contextDestroyed(StartupServletContextListener.java:104)
at org.mortbay.jetty.handler.ContextHandler.doStop(ContextHandler.java:599)
at org.mortbay.jetty.webapp.WebAppContext.doStop(WebAppContext.java:504)
at org.mortbay.jetty.plugin.Jetty6PluginWebAppContext.doStop(Jetty6PluginWebAppContext.java:132)
at org.mortbay.component.AbstractLifeCycle.stop(AbstractLifeCycle.java:78)
at org.mortbay.jetty.handler.HandlerCollection.doStop(HandlerCollection.java:169)
at org.mortbay.component.AbstractLifeCycle.stop(AbstractLifeCycle.java:78)
at org.mortbay.jetty.handler.HandlerCollection.doStop(HandlerCollection.java:169)
at org.mortbay.component.AbstractLifeCycle.stop(AbstractLifeCycle.java:78)
at org.mortbay.jetty.handler.HandlerWrapper.doStop(HandlerWrapper.java:142)
at org.mortbay.jetty.Server.doStop(Server.java:283)
at org.mortbay.component.AbstractLifeCycle.stop(AbstractLifeCycle.java:78)
at org.mortbay.jetty.Server$ShutdownHookThread.run(Server.java:561)
Exception in thread "Shutdown" java.lang.LinkageError: loader constraint violation: loader (instance of org/mortbay/jetty/webapp/WebAppClassLoader) previously initiated loading for a different type with name "javax/el/ExpressionFactory"
at java.lang.ClassLoader.defineClass1(Native Method)
at java.lang.ClassLoader.defineClassCond(ClassLoader.java:632)
at java.lang.ClassLoader.defineClass(ClassLoader.java:616)
at java.security.SecureClassLoader.defineClass(SecureClassLoader.java:141)
at java.net.URLClassLoader.defineClass(URLClassLoader.java:283)
at java.net.URLClassLoader.access$000(URLClassLoader.java:58)
at java.net.URLClassLoader$1.run(URLClassLoader.java:197)
at java.security.AccessController.doPrivileged(Native Method)
at java.net.URLClassLoader.findClass(URLClassLoader.java:190)
at org.mortbay.jetty.webapp.WebAppClassLoader.loadClass(WebAppClassLoader.java:392)
at org.mortbay.jetty.webapp.WebAppClassLoader.loadClass(WebAppClassLoader.java:363)
at java.lang.Class.getDeclaredMethods0(Native Method)
at java.lang.Class.privateGetDeclaredMethods(Class.java:2427)
at java.lang.Class.getDeclaredMethods(Class.java:1791)
at org.apache.myfaces.config.annotation.NoInjectionAnnotationLifecycleProvider.destroyInstance(NoInjectionAnnotationLifecycleProvider.java:90)
at org.apache.myfaces.webapp.AbstractMyFacesListener.doPreDestroy(AbstractMyFacesListener.java:59)
at org.apache.myfaces.webapp.StartupServletContextListener.doPredestroy(StartupServletContextListener.java:123)
at org.apache.myfaces.webapp.StartupServletContextListener.contextDestroyed(StartupServletContextListener.java:104)
at org.mortbay.jetty.handler.ContextHandler.doStop(ContextHandler.java:599)
at org.mortbay.jetty.webapp.WebAppContext.doStop(WebAppContext.java:504)
at org.mortbay.jetty.plugin.Jetty6PluginWebAppContext.doStop(Jetty6PluginWebAppContext.java:132)
at org.mortbay.component.AbstractLifeCycle.stop(AbstractLifeCycle.java:78)
at org.mortbay.jetty.handler.HandlerCollection.doStop(HandlerCollection.java:169)
at org.mortbay.component.AbstractLifeCycle.stop(AbstractLifeCycle.java:78)
at org.mortbay.jetty.handler.HandlerCollection.doStop(HandlerCollection.java:169)
at org.mortbay.component.AbstractLifeCycle.stop(AbstractLifeCycle.java:78)
at org.mortbay.jetty.handler.HandlerWrapper.doStop(HandlerWrapper.java:142)
at org.mortbay.jetty.Server.doStop(Server.java:283)
at org.mortbay.component.AbstractLifeCycle.stop(AbstractLifeCycle.java:78)
at org.mortbay.jetty.Server$ShutdownHookThread.run(Server.java:561)
Build failed in Hudson: Tuscany-2x #928
Posted by Apache Hudson Server <hu...@hudson.apache.org>.
See <https://hudson.apache.org/hudson/job/Tuscany-2x/928/changes>
Changes:
[slaws] Flip to remotable so that it doesn't mess up the samples when running in eclipse.
[slaws] Catch up with an error message fix in the runtime
[slaws] Fix typo in comment
[bdaniel] Fix paths in build.xml for implementation.script sample
[bdaniel] Fix up build.xml file for maven-osgi-junit sample
------------------------------------------
[...truncated 57256 lines...]
[INFO] [compiler:compile {execution: default-compile}]
[INFO] No sources to compile
[INFO] [resources:testResources {execution: default-testResources}]
[INFO] Using 'UTF-8' encoding to copy filtered resources.
[INFO] Copying 2 resources
[INFO] Copying 3 resources
[INFO] [dependency:unpack {execution: unpack}]
[INFO] Configured Artifact: org.apache.tuscany.sca:oasis-javacaa-contributions:2.0-SNAPSHOT:zip
[INFO] snapshot org.apache.tuscany.sca:oasis-javacaa-contributions:2.0-SNAPSHOT: checking for updates from oasis.contributions
[INFO] snapshot org.apache.tuscany.sca:oasis-javacaa-contributions:2.0-SNAPSHOT: checking for updates from apache.snapshots
Downloading: http://svn.apache.org/repos/asf/tuscany/maven/org/apache/tuscany/sca/oasis-javacaa-contributions/2.0-SNAPSHOT/oasis-javacaa-contributions-2.0-SNAPSHOT.zip
[INFO] Configured Artifact: org.apache.tuscany.sca:tuscany-otests-sca-j-caa-tests:2.0-SNAPSHOT:jar
[INFO] Unpacking /home/hudson/.m2/repository/org/apache/tuscany/sca/oasis-javacaa-contributions/2.0-SNAPSHOT/oasis-javacaa-contributions-2.0-SNAPSHOT.zip to
<https://hudson.apache.org/hudson/job/Tuscany-2x/ws/sca-2x/testing/compliance-tests/java-caa/target/oasis-contributions>
with includes null and excludes:null
[INFO] Unpacking /home/hudson/.m2/repository/org/apache/tuscany/sca/tuscany-otests-sca-j-caa-tests/2.0-SNAPSHOT/tuscany-otests-sca-j-caa-tests-2.0-SNAPSHOT.jar to
<https://hudson.apache.org/hudson/job/Tuscany-2x/ws/sca-2x/testing/compliance-tests/java-caa/target/test-classes>
with includes null and excludes:commons-logging.properties,oasis-sca-tests.properties,tuscany-oasis-sca-tests-errors.properties
[INFO] [compiler:testCompile {execution: default-testCompile}]
[INFO] Compiling 1 source file to <https://hudson.apache.org/hudson/job/Tuscany-2x/ws/sca-2x/testing/compliance-tests/java-caa/target/test-classes>
[INFO] -------------------------------------------------------------
[ERROR] COMPILATION ERROR :
[INFO] -------------------------------------------------------------
[ERROR] <https://hudson.apache.org/hudson/job/Tuscany-2x/ws/sca-2x/testing/compliance-tests/java-caa/src/test/java/org/apache/tuscany/sca/otest/TuscanyRuntimeBridge.java>:[36,17] package testClient does not exist
[ERROR] <https://hudson.apache.org/hudson/job/Tuscany-2x/ws/sca-2x/testing/compliance-tests/java-caa/src/test/java/org/apache/tuscany/sca/otest/TuscanyRuntimeBridge.java>:[37,13] package client does not exist
[ERROR] <https://hudson.apache.org/hudson/job/Tuscany-2x/ws/sca-2x/testing/compliance-tests/java-caa/src/test/java/org/apache/tuscany/sca/otest/TuscanyRuntimeBridge.java>:[43,45] cannot find symbol
symbol: class RuntimeBridge
public class TuscanyRuntimeBridge implements RuntimeBridge {
[ERROR] <https://hudson.apache.org/hudson/job/Tuscany-2x/ws/sca-2x/testing/compliance-tests/java-caa/src/test/java/org/apache/tuscany/sca/otest/TuscanyRuntimeBridge.java>:[215,26] cannot find symbol
symbol : class TestException_Exception
location: class org.apache.tuscany.sca.otest.TuscanyRuntimeBridge
[ERROR] <https://hudson.apache.org/hudson/job/Tuscany-2x/ws/sca-2x/testing/compliance-tests/java-caa/src/test/java/org/apache/tuscany/sca/otest/TuscanyRuntimeBridge.java>:[216,12] cannot find symbol
symbol : class TestException_Exception
location: class org.apache.tuscany.sca.otest.TuscanyRuntimeBridge
[ERROR] <https://hudson.apache.org/hudson/job/Tuscany-2x/ws/sca-2x/testing/compliance-tests/java-caa/src/test/java/org/apache/tuscany/sca/otest/TuscanyRuntimeBridge.java>:[216,42] cannot find symbol
symbol : class TestException_Exception
location: class org.apache.tuscany.sca.otest.TuscanyRuntimeBridge
[INFO] 6 errors
[INFO] -------------------------------------------------------------
[HUDSON] Archiving <https://hudson.apache.org/hudson/job/Tuscany-2x/ws/sca-2x/testing/compliance-tests/java-caa/pom.xml> to /home/hudson/hudson/jobs/Tuscany-2x/modules/org.apache.tuscany.sca$tuscany-compliance-test-java-caa/builds/2010-11-09_01-19-16/archive/org.apache.tuscany.sca/tuscany-compliance-test-java-caa/2.0-SNAPSHOT/pom.xml
[INFO] ------------------------------------------------------------------------
[ERROR] BUILD FAILURE
[INFO] ------------------------------------------------------------------------
[INFO] Compilation failure
<https://hudson.apache.org/hudson/job/Tuscany-2x/ws/sca-2x/testing/compliance-tests/java-caa/src/test/java/org/apache/tuscany/sca/otest/TuscanyRuntimeBridge.java>:[36,17] package testClient does not exist
<https://hudson.apache.org/hudson/job/Tuscany-2x/ws/sca-2x/testing/compliance-tests/java-caa/src/test/java/org/apache/tuscany/sca/otest/TuscanyRuntimeBridge.java>:[37,13] package client does not exist
<https://hudson.apache.org/hudson/job/Tuscany-2x/ws/sca-2x/testing/compliance-tests/java-caa/src/test/java/org/apache/tuscany/sca/otest/TuscanyRuntimeBridge.java>:[43,45] cannot find symbol
symbol: class RuntimeBridge
public class TuscanyRuntimeBridge implements RuntimeBridge {
<https://hudson.apache.org/hudson/job/Tuscany-2x/ws/sca-2x/testing/compliance-tests/java-caa/src/test/java/org/apache/tuscany/sca/otest/TuscanyRuntimeBridge.java>:[215,26] cannot find symbol
symbol : class TestException_Exception
location: class org.apache.tuscany.sca.otest.TuscanyRuntimeBridge
<https://hudson.apache.org/hudson/job/Tuscany-2x/ws/sca-2x/testing/compliance-tests/java-caa/src/test/java/org/apache/tuscany/sca/otest/TuscanyRuntimeBridge.java>:[216,12] cannot find symbol
symbol : class TestException_Exception
location: class org.apache.tuscany.sca.otest.TuscanyRuntimeBridge
<https://hudson.apache.org/hudson/job/Tuscany-2x/ws/sca-2x/testing/compliance-tests/java-caa/src/test/java/org/apache/tuscany/sca/otest/TuscanyRuntimeBridge.java>:[216,42] cannot find symbol
symbol : class TestException_Exception
location: class org.apache.tuscany.sca.otest.TuscanyRuntimeBridge
[INFO] ------------------------------------------------------------------------
[INFO] For more information, run Maven with the -e switch
[INFO] ------------------------------------------------------------------------
[INFO] Total time: 49 minutes 43 seconds
[INFO] Finished at: Tue Nov 09 02:09:09 UTC 2010
[INFO] Final Memory: 212M/737M
[INFO] ------------------------------------------------------------------------
Sending e-mails to: commits@tuscany.apache.org
Sending e-mails to: commits@tuscany.apache.org
Sending e-mails to: commits@tuscany.apache.org
channel stopped
2010-11-09 02:09:11.118::INFO: Shutdown hook executing
2010-11-09 02:09:11.118::INFO: Shutdown hook complete
2010-11-09 02:09:12.118::INFO: Shutdown hook complete
2010-11-09 02:09:13.118::INFO: Shutdown hook complete
2010-11-09 02:09:14.118::INFO: Shutdown hook complete
2010-11-09 02:09:15.118::INFO: Shutdown hook complete
2010-11-09 02:09:16.118::INFO: Shutdown hook complete
2010-11-09 02:09:17.621::WARN: failed org.mortbay.jetty.plugin.Jetty6PluginWebAppContext@173cfbf{/helloworld-jsf,<https://hudson.apache.org/hudson/job/Tuscany-2x/ws/sca-2x/samples/learning-more/implementation-web/helloworld-jsf/src/main/webapp}>
java.lang.LinkageError: loader constraint violation: loader (instance of org/mortbay/jetty/webapp/WebAppClassLoader) previously initiated loading for a different type with name "javax/el/ExpressionFactory"
at java.lang.ClassLoader.defineClass1(Native Method)
at java.lang.ClassLoader.defineClassCond(ClassLoader.java:632)
at java.lang.ClassLoader.defineClass(ClassLoader.java:616)
at java.security.SecureClassLoader.defineClass(SecureClassLoader.java:141)
at java.net.URLClassLoader.defineClass(URLClassLoader.java:283)
at java.net.URLClassLoader.access$000(URLClassLoader.java:58)
at java.net.URLClassLoader$1.run(URLClassLoader.java:197)
at java.security.AccessController.doPrivileged(Native Method)
at java.net.URLClassLoader.findClass(URLClassLoader.java:190)
at org.mortbay.jetty.webapp.WebAppClassLoader.loadClass(WebAppClassLoader.java:392)
at org.mortbay.jetty.webapp.WebAppClassLoader.loadClass(WebAppClassLoader.java:363)
at java.lang.Class.getDeclaredMethods0(Native Method)
at java.lang.Class.privateGetDeclaredMethods(Class.java:2427)
at java.lang.Class.getDeclaredMethods(Class.java:1791)
at org.apache.myfaces.config.annotation.NoInjectionAnnotationLifecycleProvider.destroyInstance(NoInjectionAnnotationLifecycleProvider.java:90)
at org.apache.myfaces.webapp.AbstractMyFacesListener.doPreDestroy(AbstractMyFacesListener.java:59)
at org.apache.myfaces.webapp.StartupServletContextListener.doPredestroy(StartupServletContextListener.java:123)
at org.apache.myfaces.webapp.StartupServletContextListener.contextDestroyed(StartupServletContextListener.java:104)
at org.mortbay.jetty.handler.ContextHandler.doStop(ContextHandler.java:599)
at org.mortbay.jetty.webapp.WebAppContext.doStop(WebAppContext.java:504)
at org.mortbay.jetty.plugin.Jetty6PluginWebAppContext.doStop(Jetty6PluginWebAppContext.java:132)
at org.mortbay.component.AbstractLifeCycle.stop(AbstractLifeCycle.java:78)
at org.mortbay.jetty.handler.HandlerCollection.doStop(HandlerCollection.java:169)
at org.mortbay.component.AbstractLifeCycle.stop(AbstractLifeCycle.java:78)
at org.mortbay.jetty.handler.HandlerCollection.doStop(HandlerCollection.java:169)
at org.mortbay.component.AbstractLifeCycle.stop(AbstractLifeCycle.java:78)
at org.mortbay.jetty.handler.HandlerWrapper.doStop(HandlerWrapper.java:142)
at org.mortbay.jetty.Server.doStop(Server.java:283)
at org.mortbay.component.AbstractLifeCycle.stop(AbstractLifeCycle.java:78)
at org.mortbay.jetty.Server$ShutdownHookThread.run(Server.java:561)
2010-11-09 02:09:17.621::WARN: failed ContextHandlerCollection@1b22b83
java.lang.LinkageError: loader constraint violation: loader (instance of org/mortbay/jetty/webapp/WebAppClassLoader) previously initiated loading for a different type with name "javax/el/ExpressionFactory"
at java.lang.ClassLoader.defineClass1(Native Method)
at java.lang.ClassLoader.defineClassCond(ClassLoader.java:632)
at java.lang.ClassLoader.defineClass(ClassLoader.java:616)
at java.security.SecureClassLoader.defineClass(SecureClassLoader.java:141)
at java.net.URLClassLoader.defineClass(URLClassLoader.java:283)
at java.net.URLClassLoader.access$000(URLClassLoader.java:58)
at java.net.URLClassLoader$1.run(URLClassLoader.java:197)
at java.security.AccessController.doPrivileged(Native Method)
at java.net.URLClassLoader.findClass(URLClassLoader.java:190)
at org.mortbay.jetty.webapp.WebAppClassLoader.loadClass(WebAppClassLoader.java:392)
at org.mortbay.jetty.webapp.WebAppClassLoader.loadClass(WebAppClassLoader.java:363)
at java.lang.Class.getDeclaredMethods0(Native Method)
at java.lang.Class.privateGetDeclaredMethods(Class.java:2427)
at java.lang.Class.getDeclaredMethods(Class.java:1791)
at org.apache.myfaces.config.annotation.NoInjectionAnnotationLifecycleProvider.destroyInstance(NoInjectionAnnotationLifecycleProvider.java:90)
at org.apache.myfaces.webapp.AbstractMyFacesListener.doPreDestroy(AbstractMyFacesListener.java:59)
at org.apache.myfaces.webapp.StartupServletContextListener.doPredestroy(StartupServletContextListener.java:123)
at org.apache.myfaces.webapp.StartupServletContextListener.contextDestroyed(StartupServletContextListener.java:104)
at org.mortbay.jetty.handler.ContextHandler.doStop(ContextHandler.java:599)
at org.mortbay.jetty.webapp.WebAppContext.doStop(WebAppContext.java:504)
at org.mortbay.jetty.plugin.Jetty6PluginWebAppContext.doStop(Jetty6PluginWebAppContext.java:132)
at org.mortbay.component.AbstractLifeCycle.stop(AbstractLifeCycle.java:78)
at org.mortbay.jetty.handler.HandlerCollection.doStop(HandlerCollection.java:169)
at org.mortbay.component.AbstractLifeCycle.stop(AbstractLifeCycle.java:78)
at org.mortbay.jetty.handler.HandlerCollection.doStop(HandlerCollection.java:169)
at org.mortbay.component.AbstractLifeCycle.stop(AbstractLifeCycle.java:78)
at org.mortbay.jetty.handler.HandlerWrapper.doStop(HandlerWrapper.java:142)
at org.mortbay.jetty.Server.doStop(Server.java:283)
at org.mortbay.component.AbstractLifeCycle.stop(AbstractLifeCycle.java:78)
at org.mortbay.jetty.Server$ShutdownHookThread.run(Server.java:561)
2010-11-09 02:09:17.621::WARN: failed HandlerCollection@46d376
java.lang.LinkageError: loader constraint violation: loader (instance of org/mortbay/jetty/webapp/WebAppClassLoader) previously initiated loading for a different type with name "javax/el/ExpressionFactory"
at java.lang.ClassLoader.defineClass1(Native Method)
at java.lang.ClassLoader.defineClassCond(ClassLoader.java:632)
at java.lang.ClassLoader.defineClass(ClassLoader.java:616)
at java.security.SecureClassLoader.defineClass(SecureClassLoader.java:141)
at java.net.URLClassLoader.defineClass(URLClassLoader.java:283)
at java.net.URLClassLoader.access$000(URLClassLoader.java:58)
at java.net.URLClassLoader$1.run(URLClassLoader.java:197)
at java.security.AccessController.doPrivileged(Native Method)
at java.net.URLClassLoader.findClass(URLClassLoader.java:190)
at org.mortbay.jetty.webapp.WebAppClassLoader.loadClass(WebAppClassLoader.java:392)
at org.mortbay.jetty.webapp.WebAppClassLoader.loadClass(WebAppClassLoader.java:363)
at java.lang.Class.getDeclaredMethods0(Native Method)
at java.lang.Class.privateGetDeclaredMethods(Class.java:2427)
at java.lang.Class.getDeclaredMethods(Class.java:1791)
at org.apache.myfaces.config.annotation.NoInjectionAnnotationLifecycleProvider.destroyInstance(NoInjectionAnnotationLifecycleProvider.java:90)
at org.apache.myfaces.webapp.AbstractMyFacesListener.doPreDestroy(AbstractMyFacesListener.java:59)
at org.apache.myfaces.webapp.StartupServletContextListener.doPredestroy(StartupServletContextListener.java:123)
at org.apache.myfaces.webapp.StartupServletContextListener.contextDestroyed(StartupServletContextListener.java:104)
at org.mortbay.jetty.handler.ContextHandler.doStop(ContextHandler.java:599)
at org.mortbay.jetty.webapp.WebAppContext.doStop(WebAppContext.java:504)
at org.mortbay.jetty.plugin.Jetty6PluginWebAppContext.doStop(Jetty6PluginWebAppContext.java:132)
at org.mortbay.component.AbstractLifeCycle.stop(AbstractLifeCycle.java:78)
at org.mortbay.jetty.handler.HandlerCollection.doStop(HandlerCollection.java:169)
at org.mortbay.component.AbstractLifeCycle.stop(AbstractLifeCycle.java:78)
at org.mortbay.jetty.handler.HandlerCollection.doStop(HandlerCollection.java:169)
at org.mortbay.component.AbstractLifeCycle.stop(AbstractLifeCycle.java:78)
at org.mortbay.jetty.handler.HandlerWrapper.doStop(HandlerWrapper.java:142)
at org.mortbay.jetty.Server.doStop(Server.java:283)
at org.mortbay.component.AbstractLifeCycle.stop(AbstractLifeCycle.java:78)
at org.mortbay.jetty.Server$ShutdownHookThread.run(Server.java:561)
2010-11-09 02:09:17.622::WARN: failed Server@160f115
java.lang.LinkageError: loader constraint violation: loader (instance of org/mortbay/jetty/webapp/WebAppClassLoader) previously initiated loading for a different type with name "javax/el/ExpressionFactory"
at java.lang.ClassLoader.defineClass1(Native Method)
at java.lang.ClassLoader.defineClassCond(ClassLoader.java:632)
at java.lang.ClassLoader.defineClass(ClassLoader.java:616)
at java.security.SecureClassLoader.defineClass(SecureClassLoader.java:141)
at java.net.URLClassLoader.defineClass(URLClassLoader.java:283)
at java.net.URLClassLoader.access$000(URLClassLoader.java:58)
at java.net.URLClassLoader$1.run(URLClassLoader.java:197)
at java.security.AccessController.doPrivileged(Native Method)
at java.net.URLClassLoader.findClass(URLClassLoader.java:190)
at org.mortbay.jetty.webapp.WebAppClassLoader.loadClass(WebAppClassLoader.java:392)
at org.mortbay.jetty.webapp.WebAppClassLoader.loadClass(WebAppClassLoader.java:363)
at java.lang.Class.getDeclaredMethods0(Native Method)
at java.lang.Class.privateGetDeclaredMethods(Class.java:2427)
at java.lang.Class.getDeclaredMethods(Class.java:1791)
at org.apache.myfaces.config.annotation.NoInjectionAnnotationLifecycleProvider.destroyInstance(NoInjectionAnnotationLifecycleProvider.java:90)
at org.apache.myfaces.webapp.AbstractMyFacesListener.doPreDestroy(AbstractMyFacesListener.java:59)
at org.apache.myfaces.webapp.StartupServletContextListener.doPredestroy(StartupServletContextListener.java:123)
at org.apache.myfaces.webapp.StartupServletContextListener.contextDestroyed(StartupServletContextListener.java:104)
at org.mortbay.jetty.handler.ContextHandler.doStop(ContextHandler.java:599)
at org.mortbay.jetty.webapp.WebAppContext.doStop(WebAppContext.java:504)
at org.mortbay.jetty.plugin.Jetty6PluginWebAppContext.doStop(Jetty6PluginWebAppContext.java:132)
at org.mortbay.component.AbstractLifeCycle.stop(AbstractLifeCycle.java:78)
at org.mortbay.jetty.handler.HandlerCollection.doStop(HandlerCollection.java:169)
at org.mortbay.component.AbstractLifeCycle.stop(AbstractLifeCycle.java:78)
at org.mortbay.jetty.handler.HandlerCollection.doStop(HandlerCollection.java:169)
at org.mortbay.component.AbstractLifeCycle.stop(AbstractLifeCycle.java:78)
at org.mortbay.jetty.handler.HandlerWrapper.doStop(HandlerWrapper.java:142)
at org.mortbay.jetty.Server.doStop(Server.java:283)
at org.mortbay.component.AbstractLifeCycle.stop(AbstractLifeCycle.java:78)
at org.mortbay.jetty.Server$ShutdownHookThread.run(Server.java:561)
Exception in thread "Shutdown" java.lang.LinkageError: loader constraint violation: loader (instance of org/mortbay/jetty/webapp/WebAppClassLoader) previously initiated loading for a different type with name "javax/el/ExpressionFactory"
at java.lang.ClassLoader.defineClass1(Native Method)
at java.lang.ClassLoader.defineClassCond(ClassLoader.java:632)
at java.lang.ClassLoader.defineClass(ClassLoader.java:616)
at java.security.SecureClassLoader.defineClass(SecureClassLoader.java:141)
at java.net.URLClassLoader.defineClass(URLClassLoader.java:283)
at java.net.URLClassLoader.access$000(URLClassLoader.java:58)
at java.net.URLClassLoader$1.run(URLClassLoader.java:197)
at java.security.AccessController.doPrivileged(Native Method)
at java.net.URLClassLoader.findClass(URLClassLoader.java:190)
at org.mortbay.jetty.webapp.WebAppClassLoader.loadClass(WebAppClassLoader.java:392)
at org.mortbay.jetty.webapp.WebAppClassLoader.loadClass(WebAppClassLoader.java:363)
at java.lang.Class.getDeclaredMethods0(Native Method)
at java.lang.Class.privateGetDeclaredMethods(Class.java:2427)
at java.lang.Class.getDeclaredMethods(Class.java:1791)
at org.apache.myfaces.config.annotation.NoInjectionAnnotationLifecycleProvider.destroyInstance(NoInjectionAnnotationLifecycleProvider.java:90)
at org.apache.myfaces.webapp.AbstractMyFacesListener.doPreDestroy(AbstractMyFacesListener.java:59)
at org.apache.myfaces.webapp.StartupServletContextListener.doPredestroy(StartupServletContextListener.java:123)
at org.apache.myfaces.webapp.StartupServletContextListener.contextDestroyed(StartupServletContextListener.java:104)
at org.mortbay.jetty.handler.ContextHandler.doStop(ContextHandler.java:599)
at org.mortbay.jetty.webapp.WebAppContext.doStop(WebAppContext.java:504)
at org.mortbay.jetty.plugin.Jetty6PluginWebAppContext.doStop(Jetty6PluginWebAppContext.java:132)
at org.mortbay.component.AbstractLifeCycle.stop(AbstractLifeCycle.java:78)
at org.mortbay.jetty.handler.HandlerCollection.doStop(HandlerCollection.java:169)
at org.mortbay.component.AbstractLifeCycle.stop(AbstractLifeCycle.java:78)
at org.mortbay.jetty.handler.HandlerCollection.doStop(HandlerCollection.java:169)
at org.mortbay.component.AbstractLifeCycle.stop(AbstractLifeCycle.java:78)
at org.mortbay.jetty.handler.HandlerWrapper.doStop(HandlerWrapper.java:142)
at org.mortbay.jetty.Server.doStop(Server.java:283)
at org.mortbay.component.AbstractLifeCycle.stop(AbstractLifeCycle.java:78)
at org.mortbay.jetty.Server$ShutdownHookThread.run(Server.java:561)