You are viewing a plain text version of this content. The canonical link for it is here.
Posted to builds@solr.apache.org by Apache Jenkins Server <je...@builds.apache.org> on 2026/06/04 09:28:09 UTC
[JENKINS] Solr » Solr-Test-10.x - Build # 1662 - Still Failing!
Build: https://ci-builds.apache.org/job/Solr/job/Solr-Test-10.x/1662/
All tests passed
Build Log:
[...truncated 1406 lines...]
BUILD FAILED in 16m 13s
151 actionable tasks: 151 executed
Publishing Build Scan to Develocity...
https://develocity.apache.org/s/abfqvm6uplcjo
Build step 'Invoke Gradle script' changed build result to FAILURE
Build step 'Invoke Gradle script' marked build as failure
Archiving artifacts
Recording test results
[Checks API] No suitable checks publisher found.
Email was triggered for: Failure - Any
Sending email for trigger: Failure - Any
[JENKINS] Solr » Solr-Test-10.x - Build # 1666 - Still Failing!
Posted by Apache Jenkins Server <je...@builds.apache.org>.
Build: https://ci-builds.apache.org/job/Solr/job/Solr-Test-10.x/1666/
All tests passed
Build Log:
[...truncated 1403 lines...]
BUILD FAILED in 16m 30s
151 actionable tasks: 151 executed
Publishing Build Scan to Develocity...
https://develocity.apache.org/s/lxn74fyhnb4kw
Build step 'Invoke Gradle script' changed build result to FAILURE
Build step 'Invoke Gradle script' marked build as failure
Archiving artifacts
Recording test results
[Checks API] No suitable checks publisher found.
Email was triggered for: Failure - Any
Sending email for trigger: Failure - Any
[JENKINS] Solr » Solr-Test-10.x - Build # 1665 - Still Failing!
Posted by Apache Jenkins Server <je...@builds.apache.org>.
Build: https://ci-builds.apache.org/job/Solr/job/Solr-Test-10.x/1665/
All tests passed
Build Log:
[...truncated 1403 lines...]
BUILD FAILED in 16m 47s
151 actionable tasks: 151 executed
Publishing Build Scan to Develocity...
https://develocity.apache.org/s/f6ryxuwukqhe2
Build step 'Invoke Gradle script' changed build result to FAILURE
Build step 'Invoke Gradle script' marked build as failure
Archiving artifacts
Recording test results
[Checks API] No suitable checks publisher found.
Email was triggered for: Failure - Any
Sending email for trigger: Failure - Any
[JENKINS] Solr » Solr-Test-10.x - Build # 1664 - Still Failing!
Posted by Apache Jenkins Server <je...@builds.apache.org>.
Build: https://ci-builds.apache.org/job/Solr/job/Solr-Test-10.x/1664/
All tests passed
Build Log:
[...truncated 1404 lines...]
BUILD FAILED in 16m 52s
151 actionable tasks: 151 executed
Publishing Build Scan to Develocity...
https://develocity.apache.org/s/g5bz2xcc56uvo
Build step 'Invoke Gradle script' changed build result to FAILURE
Build step 'Invoke Gradle script' marked build as failure
Archiving artifacts
Recording test results
[Checks API] No suitable checks publisher found.
Email was triggered for: Failure - Any
Sending email for trigger: Failure - Any
[JENKINS] Solr » Solr-Test-10.x - Build # 1663 - Still Failing!
Posted by Apache Jenkins Server <je...@builds.apache.org>.
Build: https://ci-builds.apache.org/job/Solr/job/Solr-Test-10.x/1663/
All tests passed
Build Log:
[...truncated 1406 lines...]
BUILD FAILED in 16m 47s
151 actionable tasks: 151 executed
Publishing Build Scan to Develocity...
https://develocity.apache.org/s/3evp5mzz2hhua
Build step 'Invoke Gradle script' changed build result to FAILURE
Build step 'Invoke Gradle script' marked build as failure
Archiving artifacts
Recording test results
[Checks API] No suitable checks publisher found.
Email was triggered for: Failure - Any
Sending email for trigger: Failure - Any