You are viewing a plain text version of this content. The canonical link for it is here.
Posted to dev@lucene.apache.org by Policeman Jenkins Server <je...@thetaphi.de> on 2017/07/09 14:53:47 UTC

[JENKINS-EA] Lucene-Solr-7.x-Linux (64bit/jdk-9-ea+175) - Build # 43 - Unstable!

Build: https://jenkins.thetaphi.de/job/Lucene-Solr-7.x-Linux/43/
Java: 64bit/jdk-9-ea+175 -XX:+UseCompressedOops -XX:+UseG1GC --illegal-access=deny

1 tests failed.
FAILED:  org.apache.solr.cloud.DocValuesNotIndexedTest.testGroupingDVOnly

Error Message:
Unexpected number of elements in the group for intGSF: 6

Stack Trace:
java.lang.AssertionError: Unexpected number of elements in the group for intGSF: 6
	at __randomizedtesting.SeedInfo.seed([5C576950CF96A9B6:C7EC070882CE9BE8]:0)
	at org.junit.Assert.fail(Assert.java:93)
	at org.apache.solr.cloud.DocValuesNotIndexedTest.testGroupingDVOnly(DocValuesNotIndexedTest.java:376)
	at java.base/jdk.internal.reflect.NativeMethodAccessorImpl.invoke0(Native Method)
	at java.base/jdk.internal.reflect.NativeMethodAccessorImpl.invoke(NativeMethodAccessorImpl.java:62)
	at java.base/jdk.internal.reflect.DelegatingMethodAccessorImpl.invoke(DelegatingMethodAccessorImpl.java:43)
	at java.base/java.lang.reflect.Method.invoke(Method.java:564)
	at com.carrotsearch.randomizedtesting.RandomizedRunner.invoke(RandomizedRunner.java:1713)
	at com.carrotsearch.randomizedtesting.RandomizedRunner$8.evaluate(RandomizedRunner.java:907)
	at com.carrotsearch.randomizedtesting.RandomizedRunner$9.evaluate(RandomizedRunner.java:943)
	at com.carrotsearch.randomizedtesting.RandomizedRunner$10.evaluate(RandomizedRunner.java:957)
	at com.carrotsearch.randomizedtesting.rules.SystemPropertiesRestoreRule$1.evaluate(SystemPropertiesRestoreRule.java:57)
	at org.apache.lucene.util.TestRuleSetupTeardownChained$1.evaluate(TestRuleSetupTeardownChained.java:49)
	at org.apache.lucene.util.AbstractBeforeAfterRule$1.evaluate(AbstractBeforeAfterRule.java:45)
	at org.apache.lucene.util.TestRuleThreadAndTestName$1.evaluate(TestRuleThreadAndTestName.java:48)
	at org.apache.lucene.util.TestRuleIgnoreAfterMaxFailures$1.evaluate(TestRuleIgnoreAfterMaxFailures.java:64)
	at org.apache.lucene.util.TestRuleMarkFailure$1.evaluate(TestRuleMarkFailure.java:47)
	at com.carrotsearch.randomizedtesting.rules.StatementAdapter.evaluate(StatementAdapter.java:36)
	at com.carrotsearch.randomizedtesting.ThreadLeakControl$StatementRunner.run(ThreadLeakControl.java:368)
	at com.carrotsearch.randomizedtesting.ThreadLeakControl.forkTimeoutingTask(ThreadLeakControl.java:817)
	at com.carrotsearch.randomizedtesting.ThreadLeakControl$3.evaluate(ThreadLeakControl.java:468)
	at com.carrotsearch.randomizedtesting.RandomizedRunner.runSingleTest(RandomizedRunner.java:916)
	at com.carrotsearch.randomizedtesting.RandomizedRunner$5.evaluate(RandomizedRunner.java:802)
	at com.carrotsearch.randomizedtesting.RandomizedRunner$6.evaluate(RandomizedRunner.java:852)
	at com.carrotsearch.randomizedtesting.RandomizedRunner$7.evaluate(RandomizedRunner.java:863)
	at com.carrotsearch.randomizedtesting.rules.StatementAdapter.evaluate(StatementAdapter.java:36)
	at com.carrotsearch.randomizedtesting.rules.SystemPropertiesRestoreRule$1.evaluate(SystemPropertiesRestoreRule.java:57)
	at org.apache.lucene.util.AbstractBeforeAfterRule$1.evaluate(AbstractBeforeAfterRule.java:45)
	at com.carrotsearch.randomizedtesting.rules.StatementAdapter.evaluate(StatementAdapter.java:36)
	at org.apache.lucene.util.TestRuleStoreClassName$1.evaluate(TestRuleStoreClassName.java:41)
	at com.carrotsearch.randomizedtesting.rules.NoShadowingOrOverridesOnMethodsRule$1.evaluate(NoShadowingOrOverridesOnMethodsRule.java:40)
	at com.carrotsearch.randomizedtesting.rules.NoShadowingOrOverridesOnMethodsRule$1.evaluate(NoShadowingOrOverridesOnMethodsRule.java:40)
	at com.carrotsearch.randomizedtesting.rules.StatementAdapter.evaluate(StatementAdapter.java:36)
	at com.carrotsearch.randomizedtesting.rules.StatementAdapter.evaluate(StatementAdapter.java:36)
	at org.apache.lucene.util.TestRuleAssertionsRequired$1.evaluate(TestRuleAssertionsRequired.java:53)
	at org.apache.lucene.util.TestRuleMarkFailure$1.evaluate(TestRuleMarkFailure.java:47)
	at org.apache.lucene.util.TestRuleIgnoreAfterMaxFailures$1.evaluate(TestRuleIgnoreAfterMaxFailures.java:64)
	at org.apache.lucene.util.TestRuleIgnoreTestSuites$1.evaluate(TestRuleIgnoreTestSuites.java:54)
	at com.carrotsearch.randomizedtesting.rules.StatementAdapter.evaluate(StatementAdapter.java:36)
	at com.carrotsearch.randomizedtesting.ThreadLeakControl$StatementRunner.run(ThreadLeakControl.java:368)
	at java.base/java.lang.Thread.run(Thread.java:844)




Build Log:
[...truncated 11138 lines...]
   [junit4] Suite: org.apache.solr.cloud.DocValuesNotIndexedTest
   [junit4]   2> Creating dataDir: /home/jenkins/workspace/Lucene-Solr-7.x-Linux/solr/build/solr-core/test/J1/temp/solr.cloud.DocValuesNotIndexedTest_5C576950CF96A9B6-001/init-core-data-001
   [junit4]   2> 288299 WARN  (SUITE-DocValuesNotIndexedTest-seed#[5C576950CF96A9B6]-worker) [    ] o.a.s.SolrTestCaseJ4 startTrackingSearchers: numOpens=2 numCloses=2
   [junit4]   2> 288299 INFO  (SUITE-DocValuesNotIndexedTest-seed#[5C576950CF96A9B6]-worker) [    ] o.a.s.SolrTestCaseJ4 Using TrieFields (NUMERIC_POINTS_SYSPROP=false) w/NUMERIC_DOCVALUES_SYSPROP=false
   [junit4]   2> 288304 INFO  (SUITE-DocValuesNotIndexedTest-seed#[5C576950CF96A9B6]-worker) [    ] o.a.s.SolrTestCaseJ4 Randomized ssl (true) and clientAuth (false) via: @org.apache.solr.util.RandomizeSSL(reason="", ssl=0.0/0.0, value=0.0/0.0, clientAuth=0.0/0.0)
   [junit4]   2> 288304 INFO  (SUITE-DocValuesNotIndexedTest-seed#[5C576950CF96A9B6]-worker) [    ] o.a.s.c.MiniSolrCloudCluster Starting cluster of 2 servers in /home/jenkins/workspace/Lucene-Solr-7.x-Linux/solr/build/solr-core/test/J1/temp/solr.cloud.DocValuesNotIndexedTest_5C576950CF96A9B6-001/tempDir-001
   [junit4]   2> 288305 INFO  (SUITE-DocValuesNotIndexedTest-seed#[5C576950CF96A9B6]-worker) [    ] o.a.s.c.ZkTestServer STARTING ZK TEST SERVER
   [junit4]   2> 288308 INFO  (Thread-1157) [    ] o.a.s.c.ZkTestServer client port:0.0.0.0/0.0.0.0:0
   [junit4]   2> 288308 INFO  (Thread-1157) [    ] o.a.s.c.ZkTestServer Starting server
   [junit4]   2> 288324 ERROR (Thread-1157) [    ] o.a.z.s.ZooKeeperServer ZKShutdownHandler is not registered, so ZooKeeper server won't take any action on ERROR or SHUTDOWN server state changes
   [junit4]   2> 288408 INFO  (SUITE-DocValuesNotIndexedTest-seed#[5C576950CF96A9B6]-worker) [    ] o.a.s.c.ZkTestServer start zk server on port:46323
   [junit4]   2> 288421 INFO  (jetty-launcher-387-thread-1) [    ] o.e.j.s.Server jetty-9.3.14.v20161028
   [junit4]   2> 288423 INFO  (jetty-launcher-387-thread-2) [    ] o.e.j.s.Server jetty-9.3.14.v20161028
   [junit4]   2> 288430 INFO  (jetty-launcher-387-thread-1) [    ] o.e.j.s.h.ContextHandler Started o.e.j.s.ServletContextHandler@568c1687{/solr,null,AVAILABLE}
   [junit4]   2> 288432 INFO  (jetty-launcher-387-thread-1) [    ] o.e.j.s.AbstractConnector Started ServerConnector@48c91bc2{SSL,[ssl, http/1.1]}{127.0.0.1:46819}
   [junit4]   2> 288432 INFO  (jetty-launcher-387-thread-1) [    ] o.e.j.s.Server Started @289651ms
   [junit4]   2> 288433 INFO  (jetty-launcher-387-thread-1) [    ] o.a.s.c.s.e.JettySolrRunner Jetty properties: {hostContext=/solr, hostPort=46819}
   [junit4]   2> 288433 ERROR (jetty-launcher-387-thread-1) [    ] o.a.s.s.StartupLoggingUtils Missing Java Option solr.log.dir. Logging may be missing or incomplete.
   [junit4]   2> 288433 INFO  (jetty-launcher-387-thread-1) [    ] o.a.s.s.SolrDispatchFilter  ___      _       Welcome to Apache Solr? version 7.1.0
   [junit4]   2> 288433 INFO  (jetty-launcher-387-thread-1) [    ] o.a.s.s.SolrDispatchFilter / __| ___| |_ _   Starting in cloud mode on port null
   [junit4]   2> 288433 INFO  (jetty-launcher-387-thread-1) [    ] o.a.s.s.SolrDispatchFilter \__ \/ _ \ | '_|  Install dir: null, Default config dir: null
   [junit4]   2> 288433 INFO  (jetty-launcher-387-thread-1) [    ] o.a.s.s.SolrDispatchFilter |___/\___/_|_|    Start time: 2017-07-09T14:09:52.830416Z
   [junit4]   2> 288456 INFO  (jetty-launcher-387-thread-2) [    ] o.e.j.s.h.ContextHandler Started o.e.j.s.ServletContextHandler@2c96e096{/solr,null,AVAILABLE}
   [junit4]   2> 288456 INFO  (jetty-launcher-387-thread-2) [    ] o.e.j.s.AbstractConnector Started ServerConnector@39928fc8{SSL,[ssl, http/1.1]}{127.0.0.1:45993}
   [junit4]   2> 288456 INFO  (jetty-launcher-387-thread-2) [    ] o.e.j.s.Server Started @289675ms
   [junit4]   2> 288456 INFO  (jetty-launcher-387-thread-2) [    ] o.a.s.c.s.e.JettySolrRunner Jetty properties: {hostContext=/solr, hostPort=45993}
   [junit4]   2> 288457 ERROR (jetty-launcher-387-thread-2) [    ] o.a.s.s.StartupLoggingUtils Missing Java Option solr.log.dir. Logging may be missing or incomplete.
   [junit4]   2> 288457 INFO  (jetty-launcher-387-thread-2) [    ] o.a.s.s.SolrDispatchFilter  ___      _       Welcome to Apache Solr? version 7.1.0
   [junit4]   2> 288457 INFO  (jetty-launcher-387-thread-2) [    ] o.a.s.s.SolrDispatchFilter / __| ___| |_ _   Starting in cloud mode on port null
   [junit4]   2> 288457 INFO  (jetty-launcher-387-thread-2) [    ] o.a.s.s.SolrDispatchFilter \__ \/ _ \ | '_|  Install dir: null, Default config dir: null
   [junit4]   2> 288457 INFO  (jetty-launcher-387-thread-2) [    ] o.a.s.s.SolrDispatchFilter |___/\___/_|_|    Start time: 2017-07-09T14:09:52.854308Z
   [junit4]   2> 288471 INFO  (jetty-launcher-387-thread-1) [    ] o.a.s.s.SolrDispatchFilter solr.xml found in ZooKeeper. Loading...
   [junit4]   2> 288477 INFO  (jetty-launcher-387-thread-2) [    ] o.a.s.s.SolrDispatchFilter solr.xml found in ZooKeeper. Loading...
   [junit4]   2> 288490 INFO  (jetty-launcher-387-thread-2) [    ] o.a.s.c.ZkContainer Zookeeper client=127.0.0.1:46323/solr
   [junit4]   2> 288492 INFO  (jetty-launcher-387-thread-1) [    ] o.a.s.c.ZkContainer Zookeeper client=127.0.0.1:46323/solr
   [junit4]   2> 288524 INFO  (jetty-launcher-387-thread-2) [    ] o.a.s.c.Overseer Overseer (id=null) closing
   [junit4]   2> 288527 INFO  (jetty-launcher-387-thread-2) [    ] o.a.s.c.OverseerElectionContext I am going to be the leader 127.0.0.1:45993_solr
   [junit4]   2> 288527 INFO  (jetty-launcher-387-thread-2) [    ] o.a.s.c.Overseer Overseer (id=98278401160380422-127.0.0.1:45993_solr-n_0000000000) starting
   [junit4]   2> 288531 INFO  (jetty-launcher-387-thread-2) [    ] o.a.s.c.ZkController Register node as live in ZooKeeper:/live_nodes/127.0.0.1:45993_solr
   [junit4]   2> 288540 INFO  (zkCallback-399-thread-1) [    ] o.a.s.c.c.ZkStateReader Updated live nodes from ZooKeeper... (0) -> (1)
   [junit4]   2> 288566 INFO  (jetty-launcher-387-thread-2) [    ] o.a.s.m.r.SolrJmxReporter JMX monitoring for 'solr_45993.solr.node' (registry 'solr.node') enabled at server: com.sun.jmx.mbeanserver.JmxMBeanServer@25958cde
   [junit4]   2> 288569 INFO  (jetty-launcher-387-thread-2) [    ] o.a.s.m.r.SolrJmxReporter JMX monitoring for 'solr_45993.solr.jvm' (registry 'solr.jvm') enabled at server: com.sun.jmx.mbeanserver.JmxMBeanServer@25958cde
   [junit4]   2> 288569 INFO  (jetty-launcher-387-thread-2) [    ] o.a.s.m.r.SolrJmxReporter JMX monitoring for 'solr_45993.solr.jetty' (registry 'solr.jetty') enabled at server: com.sun.jmx.mbeanserver.JmxMBeanServer@25958cde
   [junit4]   2> 288570 INFO  (jetty-launcher-387-thread-2) [    ] o.a.s.c.CorePropertiesLocator Found 0 core definitions underneath /home/jenkins/workspace/Lucene-Solr-7.x-Linux/solr/build/solr-core/test/J1/temp/solr.cloud.DocValuesNotIndexedTest_5C576950CF96A9B6-001/tempDir-001/node2/.
   [junit4]   2> 288573 INFO  (jetty-launcher-387-thread-1) [    ] o.a.s.c.c.ZkStateReader Updated live nodes from ZooKeeper... (0) -> (1)
   [junit4]   2> 288574 INFO  (jetty-launcher-387-thread-1) [    ] o.a.s.c.Overseer Overseer (id=null) closing
   [junit4]   2> 288575 INFO  (jetty-launcher-387-thread-1) [    ] o.a.s.c.ZkController Register node as live in ZooKeeper:/live_nodes/127.0.0.1:46819_solr
   [junit4]   2> 288596 INFO  (zkCallback-398-thread-1) [    ] o.a.s.c.c.ZkStateReader Updated live nodes from ZooKeeper... (1) -> (2)
   [junit4]   2> 288596 INFO  (zkCallback-399-thread-2) [    ] o.a.s.c.c.ZkStateReader Updated live nodes from ZooKeeper... (1) -> (2)
   [junit4]   2> 288625 INFO  (jetty-launcher-387-thread-1) [    ] o.a.s.m.r.SolrJmxReporter JMX monitoring for 'solr_46819.solr.node' (registry 'solr.node') enabled at server: com.sun.jmx.mbeanserver.JmxMBeanServer@25958cde
   [junit4]   2> 288627 INFO  (jetty-launcher-387-thread-1) [    ] o.a.s.m.r.SolrJmxReporter JMX monitoring for 'solr_46819.solr.jvm' (registry 'solr.jvm') enabled at server: com.sun.jmx.mbeanserver.JmxMBeanServer@25958cde
   [junit4]   2> 288627 INFO  (jetty-launcher-387-thread-1) [    ] o.a.s.m.r.SolrJmxReporter JMX monitoring for 'solr_46819.solr.jetty' (registry 'solr.jetty') enabled at server: com.sun.jmx.mbeanserver.JmxMBeanServer@25958cde
   [junit4]   2> 288628 INFO  (jetty-launcher-387-thread-1) [    ] o.a.s.c.CorePropertiesLocator Found 0 core definitions underneath /home/jenkins/workspace/Lucene-Solr-7.x-Linux/solr/build/solr-core/test/J1/temp/solr.cloud.DocValuesNotIndexedTest_5C576950CF96A9B6-001/tempDir-001/node1/.
   [junit4]   2> 288669 INFO  (SUITE-DocValuesNotIndexedTest-seed#[5C576950CF96A9B6]-worker) [    ] o.a.s.c.c.ZkStateReader Updated live nodes from ZooKeeper... (0) -> (2)
   [junit4]   2> 288670 INFO  (SUITE-DocValuesNotIndexedTest-seed#[5C576950CF96A9B6]-worker) [    ] o.a.s.c.s.i.ZkClientClusterStateProvider Cluster at 127.0.0.1:46323/solr ready
   [junit4]   2> 288688 INFO  (qtp639735455-3344) [    ] o.a.s.h.a.CollectionsHandler Invoked Collection Action :create with params replicationFactor=1&collection.configName=conf1&maxShardsPerNode=2&name=dv_coll&nrtReplicas=1&action=CREATE&numShards=4&wt=javabin&version=2 and sendToOCPQueue=true
   [junit4]   2> 288689 INFO  (OverseerThreadFactory-1124-thread-1) [    ] o.a.s.c.CreateCollectionCmd Create collection dv_coll
   [junit4]   2> 288792 INFO  (OverseerStateUpdate-98278401160380422-127.0.0.1:45993_solr-n_0000000000) [    ] o.a.s.c.o.SliceMutator createReplica() {
   [junit4]   2>   "operation":"ADDREPLICA",
   [junit4]   2>   "collection":"dv_coll",
   [junit4]   2>   "shard":"shard1",
   [junit4]   2>   "core":"dv_coll_shard1_replica_n1",
   [junit4]   2>   "state":"down",
   [junit4]   2>   "base_url":"https://127.0.0.1:46819/solr",
   [junit4]   2>   "type":"NRT"} 
   [junit4]   2> 288794 INFO  (OverseerStateUpdate-98278401160380422-127.0.0.1:45993_solr-n_0000000000) [    ] o.a.s.c.o.SliceMutator createReplica() {
   [junit4]   2>   "operation":"ADDREPLICA",
   [junit4]   2>   "collection":"dv_coll",
   [junit4]   2>   "shard":"shard2",
   [junit4]   2>   "core":"dv_coll_shard2_replica_n1",
   [junit4]   2>   "state":"down",
   [junit4]   2>   "base_url":"https://127.0.0.1:45993/solr",
   [junit4]   2>   "type":"NRT"} 
   [junit4]   2> 288795 INFO  (OverseerStateUpdate-98278401160380422-127.0.0.1:45993_solr-n_0000000000) [    ] o.a.s.c.o.SliceMutator createReplica() {
   [junit4]   2>   "operation":"ADDREPLICA",
   [junit4]   2>   "collection":"dv_coll",
   [junit4]   2>   "shard":"shard3",
   [junit4]   2>   "core":"dv_coll_shard3_replica_n1",
   [junit4]   2>   "state":"down",
   [junit4]   2>   "base_url":"https://127.0.0.1:46819/solr",
   [junit4]   2>   "type":"NRT"} 
   [junit4]   2> 288796 INFO  (OverseerStateUpdate-98278401160380422-127.0.0.1:45993_solr-n_0000000000) [    ] o.a.s.c.o.SliceMutator createReplica() {
   [junit4]   2>   "operation":"ADDREPLICA",
   [junit4]   2>   "collection":"dv_coll",
   [junit4]   2>   "shard":"shard4",
   [junit4]   2>   "core":"dv_coll_shard4_replica_n1",
   [junit4]   2>   "state":"down",
   [junit4]   2>   "base_url":"https://127.0.0.1:45993/solr",
   [junit4]   2>   "type":"NRT"} 
   [junit4]   2> 289004 INFO  (qtp639735455-3343) [    ] o.a.s.h.a.CoreAdminOperation core create command qt=/admin/cores&coreNodeName=core_node3&collection.configName=conf1&newCollection=true&name=dv_coll_shard3_replica_n1&action=CREATE&numShards=4&collection=dv_coll&shard=shard3&wt=javabin&version=2&replicaType=NRT
   [junit4]   2> 289004 INFO  (qtp639735455-3343) [    ] o.a.s.c.TransientSolrCoreCacheDefault Allocating transient cache for 2147483647 transient cores
   [junit4]   2> 289004 INFO  (qtp639735455-3338) [    ] o.a.s.h.a.CoreAdminOperation core create command qt=/admin/cores&coreNodeName=core_node1&collection.configName=conf1&newCollection=true&name=dv_coll_shard1_replica_n1&action=CREATE&numShards=4&collection=dv_coll&shard=shard1&wt=javabin&version=2&replicaType=NRT
   [junit4]   2> 289012 INFO  (qtp2102283932-3336) [    ] o.a.s.h.a.CoreAdminOperation core create command qt=/admin/cores&coreNodeName=core_node4&collection.configName=conf1&newCollection=true&name=dv_coll_shard4_replica_n1&action=CREATE&numShards=4&collection=dv_coll&shard=shard4&wt=javabin&version=2&replicaType=NRT
   [junit4]   2> 289012 INFO  (qtp2102283932-3336) [    ] o.a.s.c.TransientSolrCoreCacheDefault Allocating transient cache for 2147483647 transient cores
   [junit4]   2> 289017 INFO  (qtp2102283932-3346) [    ] o.a.s.h.a.CoreAdminOperation core create command qt=/admin/cores&coreNodeName=core_node2&collection.configName=conf1&newCollection=true&name=dv_coll_shard2_replica_n1&action=CREATE&numShards=4&collection=dv_coll&shard=shard2&wt=javabin&version=2&replicaType=NRT
   [junit4]   2> 289120 INFO  (zkCallback-399-thread-1) [    ] o.a.s.c.c.ZkStateReader A cluster state change: [WatchedEvent state:SyncConnected type:NodeDataChanged path:/collections/dv_coll/state.json] for collection [dv_coll] has occurred - updating... (live nodes size: [2])
   [junit4]   2> 289120 INFO  (zkCallback-398-thread-1) [    ] o.a.s.c.c.ZkStateReader A cluster state change: [WatchedEvent state:SyncConnected type:NodeDataChanged path:/collections/dv_coll/state.json] for collection [dv_coll] has occurred - updating... (live nodes size: [2])
   [junit4]   2> 289120 INFO  (zkCallback-399-thread-2) [    ] o.a.s.c.c.ZkStateReader A cluster state change: [WatchedEvent state:SyncConnected type:NodeDataChanged path:/collections/dv_coll/state.json] for collection [dv_coll] has occurred - updating... (live nodes size: [2])
   [junit4]   2> 290016 INFO  (qtp639735455-3338) [    ] o.a.s.c.SolrConfig Using Lucene MatchVersion: 7.1.0
   [junit4]   2> 290020 INFO  (qtp639735455-3338) [    ] o.a.s.s.IndexSchema [dv_coll_shard1_replica_n1] Schema name=minimal
   [junit4]   2> 290021 INFO  (qtp639735455-3338) [    ] o.a.s.s.IndexSchema Loaded schema minimal/1.1 with uniqueid field id
   [junit4]   2> 290021 INFO  (qtp639735455-3338) [    ] o.a.s.c.CoreContainer Creating SolrCore 'dv_coll_shard1_replica_n1' using configuration from collection dv_coll, trusted=true
   [junit4]   2> 290022 INFO  (qtp639735455-3338) [    ] o.a.s.m.r.SolrJmxReporter JMX monitoring for 'solr_46819.solr.core.dv_coll.shard1.replica_n1' (registry 'solr.core.dv_coll.shard1.replica_n1') enabled at server: com.sun.jmx.mbeanserver.JmxMBeanServer@25958cde
   [junit4]   2> 290023 INFO  (qtp639735455-3338) [    ] o.a.s.c.SolrCore solr.RecoveryStrategy.Builder
   [junit4]   2> 290023 INFO  (qtp639735455-3338) [    ] o.a.s.c.SolrCore [[dv_coll_shard1_replica_n1] ] Opening new SolrCore at [/home/jenkins/workspace/Lucene-Solr-7.x-Linux/solr/build/solr-core/test/J1/temp/solr.cloud.DocValuesNotIndexedTest_5C576950CF96A9B6-001/tempDir-001/node1/dv_coll_shard1_replica_n1], dataDir=[/home/jenkins/workspace/Lucene-Solr-7.x-Linux/solr/build/solr-core/test/J1/temp/solr.cloud.DocValuesNotIndexedTest_5C576950CF96A9B6-001/tempDir-001/node1/./dv_coll_shard1_replica_n1/data/]
   [junit4]   2> 290025 INFO  (qtp639735455-3343) [    ] o.a.s.c.SolrConfig Using Lucene MatchVersion: 7.1.0
   [junit4]   2> 290025 INFO  (qtp2102283932-3336) [    ] o.a.s.c.SolrConfig Using Lucene MatchVersion: 7.1.0
   [junit4]   2> 290025 INFO  (qtp2102283932-3346) [    ] o.a.s.c.SolrConfig Using Lucene MatchVersion: 7.1.0
   [junit4]   2> 290030 INFO  (qtp2102283932-3336) [    ] o.a.s.s.IndexSchema [dv_coll_shard4_replica_n1] Schema name=minimal
   [junit4]   2> 290030 INFO  (qtp639735455-3343) [    ] o.a.s.s.IndexSchema [dv_coll_shard3_replica_n1] Schema name=minimal
   [junit4]   2> 290031 INFO  (qtp2102283932-3336) [    ] o.a.s.s.IndexSchema Loaded schema minimal/1.1 with uniqueid field id
   [junit4]   2> 290031 INFO  (qtp2102283932-3336) [    ] o.a.s.c.CoreContainer Creating SolrCore 'dv_coll_shard4_replica_n1' using configuration from collection dv_coll, trusted=true
   [junit4]   2> 290031 INFO  (qtp639735455-3343) [    ] o.a.s.s.IndexSchema Loaded schema minimal/1.1 with uniqueid field id
   [junit4]   2> 290031 INFO  (qtp639735455-3343) [    ] o.a.s.c.CoreContainer Creating SolrCore 'dv_coll_shard3_replica_n1' using configuration from collection dv_coll, trusted=true
   [junit4]   2> 290031 INFO  (qtp2102283932-3336) [    ] o.a.s.m.r.SolrJmxReporter JMX monitoring for 'solr_45993.solr.core.dv_coll.shard4.replica_n1' (registry 'solr.core.dv_coll.shard4.replica_n1') enabled at server: com.sun.jmx.mbeanserver.JmxMBeanServer@25958cde
   [junit4]   2> 290031 INFO  (qtp2102283932-3336) [    ] o.a.s.c.SolrCore solr.RecoveryStrategy.Builder
   [junit4]   2> 290031 INFO  (qtp639735455-3343) [    ] o.a.s.m.r.SolrJmxReporter JMX monitoring for 'solr_46819.solr.core.dv_coll.shard3.replica_n1' (registry 'solr.core.dv_coll.shard3.replica_n1') enabled at server: com.sun.jmx.mbeanserver.JmxMBeanServer@25958cde
   [junit4]   2> 290031 INFO  (qtp2102283932-3336) [    ] o.a.s.c.SolrCore [[dv_coll_shard4_replica_n1] ] Opening new SolrCore at [/home/jenkins/workspace/Lucene-Solr-7.x-Linux/solr/build/solr-core/test/J1/temp/solr.cloud.DocValuesNotIndexedTest_5C576950CF96A9B6-001/tempDir-001/node2/dv_coll_shard4_replica_n1], dataDir=[/home/jenkins/workspace/Lucene-Solr-7.x-Linux/solr/build/solr-core/test/J1/temp/solr.cloud.DocValuesNotIndexedTest_5C576950CF96A9B6-001/tempDir-001/node2/./dv_coll_shard4_replica_n1/data/]
   [junit4]   2> 290031 INFO  (qtp639735455-3343) [    ] o.a.s.c.SolrCore solr.RecoveryStrategy.Builder
   [junit4]   2> 290032 INFO  (qtp639735455-3343) [    ] o.a.s.c.SolrCore [[dv_coll_shard3_replica_n1] ] Opening new SolrCore at [/home/jenkins/workspace/Lucene-Solr-7.x-Linux/solr/build/solr-core/test/J1/temp/solr.cloud.DocValuesNotIndexedTest_5C576950CF96A9B6-001/tempDir-001/node1/dv_coll_shard3_replica_n1], dataDir=[/home/jenkins/workspace/Lucene-Solr-7.x-Linux/solr/build/solr-core/test/J1/temp/solr.cloud.DocValuesNotIndexedTest_5C576950CF96A9B6-001/tempDir-001/node1/./dv_coll_shard3_replica_n1/data/]
   [junit4]   2> 290034 INFO  (qtp2102283932-3346) [    ] o.a.s.s.IndexSchema [dv_coll_shard2_replica_n1] Schema name=minimal
   [junit4]   2> 290035 INFO  (qtp2102283932-3346) [    ] o.a.s.s.IndexSchema Loaded schema minimal/1.1 with uniqueid field id
   [junit4]   2> 290035 INFO  (qtp2102283932-3346) [    ] o.a.s.c.CoreContainer Creating SolrCore 'dv_coll_shard2_replica_n1' using configuration from collection dv_coll, trusted=true
   [junit4]   2> 290035 INFO  (qtp2102283932-3346) [    ] o.a.s.m.r.SolrJmxReporter JMX monitoring for 'solr_45993.solr.core.dv_coll.shard2.replica_n1' (registry 'solr.core.dv_coll.shard2.replica_n1') enabled at server: com.sun.jmx.mbeanserver.JmxMBeanServer@25958cde
   [junit4]   2> 290035 INFO  (qtp2102283932-3346) [    ] o.a.s.c.SolrCore solr.RecoveryStrategy.Builder
   [junit4]   2> 290035 INFO  (qtp2102283932-3346) [    ] o.a.s.c.SolrCore [[dv_coll_shard2_replica_n1] ] Opening new SolrCore at [/home/jenkins/workspace/Lucene-Solr-7.x-Linux/solr/build/solr-core/test/J1/temp/solr.cloud.DocValuesNotIndexedTest_5C576950CF96A9B6-001/tempDir-001/node2/dv_coll_shard2_replica_n1], dataDir=[/home/jenkins/workspace/Lucene-Solr-7.x-Linux/solr/build/solr-core/test/J1/temp/solr.cloud.DocValuesNotIndexedTest_5C576950CF96A9B6-001/tempDir-001/node2/./dv_coll_shard2_replica_n1/data/]
   [junit4]   2> 290100 INFO  (qtp639735455-3338) [    ] o.a.s.u.UpdateHandler Using UpdateLog implementation: org.apache.solr.update.UpdateLog
   [junit4]   2> 290100 INFO  (qtp639735455-3338) [    ] o.a.s.u.UpdateLog Initializing UpdateLog: dataDir=null defaultSyncLevel=FLUSH numRecordsToKeep=100 maxNumLogsToKeep=10 numVersionBuckets=65536
   [junit4]   2> 290102 INFO  (qtp639735455-3338) [    ] o.a.s.u.CommitTracker Hard AutoCommit: disabled
   [junit4]   2> 290102 INFO  (qtp639735455-3338) [    ] o.a.s.u.CommitTracker Soft AutoCommit: disabled
   [junit4]   2> 290103 INFO  (qtp639735455-3338) [    ] o.a.s.s.SolrIndexSearcher Opening [Searcher@4edf806d[dv_coll_shard1_replica_n1] main]
   [junit4]   2> 290108 INFO  (qtp639735455-3338) [    ] o.a.s.r.ManagedResourceStorage Configured ZooKeeperStorageIO with znodeBase: /configs/conf1
   [junit4]   2> 290108 INFO  (qtp639735455-3338) [    ] o.a.s.r.ManagedResourceStorage Loaded null at path _rest_managed.json using ZooKeeperStorageIO:path=/configs/conf1
   [junit4]   2> 290108 INFO  (qtp639735455-3338) [    ] o.a.s.s.ZkIndexSchemaReader Creating ZooKeeper watch for the managed schema at /configs/conf1/managed-schema
   [junit4]   2> 290108 INFO  (qtp639735455-3338) [    ] o.a.s.s.ZkIndexSchemaReader Current schema version 0 is already the latest
   [junit4]   2> 290109 INFO  (qtp639735455-3338) [    ] o.a.s.h.ReplicationHandler Commits will be reserved for  10000
   [junit4]   2> 290109 INFO  (searcherExecutor-1129-thread-1) [    ] o.a.s.c.SolrCore [dv_coll_shard1_replica_n1] Registered new searcher Searcher@4edf806d[dv_coll_shard1_replica_n1] main{ExitableDirectoryReader(UninvertingDirectoryReader())}
   [junit4]   2> 290109 INFO  (qtp639735455-3338) [    ] o.a.s.u.UpdateLog Could not find max version in index or recent updates, using new clock 1572454420453523456
   [junit4]   2> 290113 INFO  (qtp639735455-3338) [    ] o.a.s.c.ShardLeaderElectionContext Enough replicas found to continue.
   [junit4]   2> 290113 INFO  (qtp639735455-3338) [    ] o.a.s.c.ShardLeaderElectionContext I may be the new leader - try and sync
   [junit4]   2> 290113 INFO  (qtp639735455-3338) [    ] o.a.s.c.SyncStrategy Sync replicas to https://127.0.0.1:46819/solr/dv_coll_shard1_replica_n1/
   [junit4]   2> 290113 INFO  (qtp639735455-3338) [    ] o.a.s.c.SyncStrategy Sync Success - now sync replicas to me
   [junit4]   2> 290113 INFO  (qtp639735455-3338) [    ] o.a.s.c.SyncStrategy https://127.0.0.1:46819/solr/dv_coll_shard1_replica_n1/ has no replicas
   [junit4]   2> 290113 INFO  (qtp639735455-3338) [    ] o.a.s.c.ShardLeaderElectionContext Found all replicas participating in election, clear LIR
   [junit4]   2> 290114 INFO  (qtp2102283932-3336) [    ] o.a.s.u.UpdateHandler Using UpdateLog implementation: org.apache.solr.update.UpdateLog
   [junit4]   2> 290114 INFO  (qtp2102283932-3336) [    ] o.a.s.u.UpdateLog Initializing UpdateLog: dataDir=null defaultSyncLevel=FLUSH numRecordsToKeep=100 maxNumLogsToKeep=10 numVersionBuckets=65536
   [junit4]   2> 290115 INFO  (qtp639735455-3343) [    ] o.a.s.u.UpdateHandler Using UpdateLog implementation: org.apache.solr.update.UpdateLog
   [junit4]   2> 290115 INFO  (qtp639735455-3343) [    ] o.a.s.u.UpdateLog Initializing UpdateLog: dataDir=null defaultSyncLevel=FLUSH numRecordsToKeep=100 maxNumLogsToKeep=10 numVersionBuckets=65536
   [junit4]   2> 290116 INFO  (qtp2102283932-3336) [    ] o.a.s.u.CommitTracker Hard AutoCommit: disabled
   [junit4]   2> 290116 INFO  (qtp2102283932-3336) [    ] o.a.s.u.CommitTracker Soft AutoCommit: disabled
   [junit4]   2> 290117 INFO  (qtp639735455-3343) [    ] o.a.s.u.CommitTracker Hard AutoCommit: disabled
   [junit4]   2> 290117 INFO  (qtp639735455-3343) [    ] o.a.s.u.CommitTracker Soft AutoCommit: disabled
   [junit4]   2> 290117 INFO  (qtp2102283932-3336) [    ] o.a.s.s.SolrIndexSearcher Opening [Searcher@aff055c[dv_coll_shard4_replica_n1] main]
   [junit4]   2> 290118 INFO  (qtp639735455-3338) [    ] o.a.s.c.ShardLeaderElectionContext I am the new leader: https://127.0.0.1:46819/solr/dv_coll_shard1_replica_n1/ shard1
   [junit4]   2> 290118 INFO  (qtp2102283932-3336) [    ] o.a.s.r.ManagedResourceStorage Configured ZooKeeperStorageIO with znodeBase: /configs/conf1
   [junit4]   2> 290118 INFO  (qtp639735455-3343) [    ] o.a.s.s.SolrIndexSearcher Opening [Searcher@804d255[dv_coll_shard3_replica_n1] main]
   [junit4]   2> 290118 INFO  (qtp2102283932-3336) [    ] o.a.s.r.ManagedResourceStorage Loaded null at path _rest_managed.json using ZooKeeperStorageIO:path=/configs/conf1
   [junit4]   2> 290118 INFO  (qtp2102283932-3336) [    ] o.a.s.s.ZkIndexSchemaReader Creating ZooKeeper watch for the managed schema at /configs/conf1/managed-schema
   [junit4]   2> 290118 INFO  (qtp2102283932-3336) [    ] o.a.s.s.ZkIndexSchemaReader Current schema version 0 is already the latest
   [junit4]   2> 290119 INFO  (qtp2102283932-3336) [    ] o.a.s.h.ReplicationHandler Commits will be reserved for  10000
   [junit4]   2> 290119 INFO  (qtp2102283932-3336) [    ] o.a.s.u.UpdateLog Could not find max version in index or recent updates, using new clock 1572454420464009216
   [junit4]   2> 290120 INFO  (qtp639735455-3343) [    ] o.a.s.r.ManagedResourceStorage Configured ZooKeeperStorageIO with znodeBase: /configs/conf1
   [junit4]   2> 290120 INFO  (searcherExecutor-1130-thread-1) [    ] o.a.s.c.SolrCore [dv_coll_shard4_replica_n1] Registered new searcher Searcher@aff055c[dv_coll_shard4_replica_n1] main{ExitableDirectoryReader(UninvertingDirectoryReader())}
   [junit4]   2> 290120 INFO  (qtp639735455-3343) [    ] o.a.s.r.ManagedResourceStorage Loaded null at path _rest_managed.json using ZooKeeperStorageIO:path=/configs/conf1
   [junit4]   2> 290120 INFO  (qtp639735455-3343) [    ] o.a.s.s.ZkIndexSchemaReader Creating ZooKeeper watch for the managed schema at /configs/conf1/managed-schema
   [junit4]   2> 290121 INFO  (qtp639735455-3343) [    ] o.a.s.s.ZkIndexSchemaReader Current schema version 0 is already the latest
   [junit4]   2> 290122 INFO  (qtp639735455-3343) [    ] o.a.s.h.ReplicationHandler Commits will be reserved for  10000
   [junit4]   2> 290122 INFO  (qtp2102283932-3336) [    ] o.a.s.c.ShardLeaderElectionContext Enough replicas found to continue.
   [junit4]   2> 290122 INFO  (qtp2102283932-3336) [    ] o.a.s.c.ShardLeaderElectionContext I may be the new leader - try and sync
   [junit4]   2> 290122 INFO  (qtp2102283932-3336) [    ] o.a.s.c.SyncStrategy Sync replicas to https://127.0.0.1:45993/solr/dv_coll_shard4_replica_n1/
   [junit4]   2> 290123 INFO  (searcherExecutor-1131-thread-1) [    ] o.a.s.c.SolrCore [dv_coll_shard3_replica_n1] Registered new searcher Searcher@804d255[dv_coll_shard3_replica_n1] main{ExitableDirectoryReader(UninvertingDirectoryReader())}
   [junit4]   2> 290123 INFO  (qtp2102283932-3336) [    ] o.a.s.c.SyncStrategy Sync Success - now sync replicas to me
   [junit4]   2> 290123 INFO  (qtp2102283932-3336) [    ] o.a.s.c.SyncStrategy https://127.0.0.1:45993/solr/dv_coll_shard4_replica_n1/ has no replicas
   [junit4]   2> 290123 INFO  (qtp2102283932-3336) [    ] o.a.s.c.ShardLeaderElectionContext Found all replicas participating in election, clear LIR
   [junit4]   2> 290123 INFO  (qtp639735455-3343) [    ] o.a.s.u.UpdateLog Could not find max version in index or recent updates, using new clock 1572454420468203520
   [junit4]   2> 290124 INFO  (qtp2102283932-3336) [    ] o.a.s.c.ShardLeaderElectionContext I am the new leader: https://127.0.0.1:45993/solr/dv_coll_shard4_replica_n1/ shard4
   [junit4]   2> 290125 INFO  (qtp2102283932-3346) [    ] o.a.s.u.UpdateHandler Using UpdateLog implementation: org.apache.solr.update.UpdateLog
   [junit4]   2> 290125 INFO  (qtp2102283932-3346) [    ] o.a.s.u.UpdateLog Initializing UpdateLog: dataDir=null defaultSyncLevel=FLUSH numRecordsToKeep=100 maxNumLogsToKeep=10 numVersionBuckets=65536
   [junit4]   2> 290127 INFO  (qtp639735455-3343) [    ] o.a.s.c.ShardLeaderElectionContext Enough replicas found to continue.
   [junit4]   2> 290127 INFO  (qtp639735455-3343) [    ] o.a.s.c.ShardLeaderElectionContext I may be the new leader - try and sync
   [junit4]   2> 290127 INFO  (qtp639735455-3343) [    ] o.a.s.c.SyncStrategy Sync replicas to https://127.0.0.1:46819/solr/dv_coll_shard3_replica_n1/
   [junit4]   2> 290127 INFO  (qtp2102283932-3346) [    ] o.a.s.u.CommitTracker Hard AutoCommit: disabled
   [junit4]   2> 290127 INFO  (qtp2102283932-3346) [    ] o.a.s.u.CommitTracker Soft AutoCommit: disabled
   [junit4]   2> 290128 INFO  (qtp639735455-3343) [    ] o.a.s.c.SyncStrategy Sync Success - now sync replicas to me
   [junit4]   2> 290128 INFO  (qtp639735455-3343) [    ] o.a.s.c.SyncStrategy https://127.0.0.1:46819/solr/dv_coll_shard3_replica_n1/ has no replicas
   [junit4]   2> 290128 INFO  (qtp639735455-3343) [    ] o.a.s.c.ShardLeaderElectionContext Found all replicas participating in election, clear LIR
   [junit4]   2> 290129 INFO  (qtp639735455-3343) [    ] o.a.s.c.ShardLeaderElectionContext I am the new leader: https://127.0.0.1:46819/solr/dv_coll_shard3_replica_n1/ shard3
   [junit4]   2> 290130 INFO  (qtp2102283932-3346) [    ] o.a.s.s.SolrIndexSearcher Opening [Searcher@42c261b1[dv_coll_shard2_replica_n1] main]
   [junit4]   2> 290130 INFO  (qtp2102283932-3346) [    ] o.a.s.r.ManagedResourceStorage Configured ZooKeeperStorageIO with znodeBase: /configs/conf1
   [junit4]   2> 290130 INFO  (qtp2102283932-3346) [    ] o.a.s.r.ManagedResourceStorage Loaded null at path _rest_managed.json using ZooKeeperStorageIO:path=/configs/conf1
   [junit4]   2> 290130 INFO  (qtp2102283932-3346) [    ] o.a.s.s.ZkIndexSchemaReader Creating ZooKeeper watch for the managed schema at /configs/conf1/managed-schema
   [junit4]   2> 290130 INFO  (qtp2102283932-3346) [    ] o.a.s.s.ZkIndexSchemaReader Current schema version 0 is already the latest
   [junit4]   2> 290131 INFO  (qtp2102283932-3346) [    ] o.a.s.h.ReplicationHandler Commits will be reserved for  10000
   [junit4]   2> 290132 INFO  (searcherExecutor-1132-thread-1) [    ] o.a.s.c.SolrCore [dv_coll_shard2_replica_n1] Registered new searcher Searcher@42c261b1[dv_coll_shard2_replica_n1] main{ExitableDirectoryReader(UninvertingDirectoryReader())}
   [junit4]   2> 290132 INFO  (qtp2102283932-3346) [    ] o.a.s.u.UpdateLog Could not find max version in index or recent updates, using new clock 1572454420477640704
   [junit4]   2> 290135 INFO  (qtp2102283932-3346) [    ] o.a.s.c.ShardLeaderElectionContext Enough replicas found to continue.
   [junit4]   2> 290135 INFO  (qtp2102283932-3346) [    ] o.a.s.c.ShardLeaderElectionContext I may be the new leader - try and sync
   [junit4]   2> 290135 INFO  (qtp2102283932-3346) [    ] o.a.s.c.SyncStrategy Sync replicas to https://127.0.0.1:45993/solr/dv_coll_shard2_replica_n1/
   [junit4]   2> 290135 INFO  (qtp2102283932-3346) [    ] o.a.s.c.SyncStrategy Sync Success - now sync replicas to me
   [junit4]   2> 290135 INFO  (qtp2102283932-3346) [    ] o.a.s.c.SyncStrategy https://127.0.0.1:45993/solr/dv_coll_shard2_replica_n1/ has no replicas
   [junit4]   2> 290135 INFO  (qtp2102283932-3346) [    ] o.a.s.c.ShardLeaderElectionContext Found all replicas participating in election, clear LIR
   [junit4]   2> 290136 INFO  (qtp2102283932-3346) [    ] o.a.s.c.ShardLeaderElectionContext I am the new leader: https://127.0.0.1:45993/solr/dv_coll_shard2_replica_n1/ shard2
   [junit4]   2> 290237 INFO  (zkCallback-399-thread-2) [    ] o.a.s.c.c.ZkStateReader A cluster state change: [WatchedEvent state:SyncConnected type:NodeDataChanged path:/collections/dv_coll/state.json] for collection [dv_coll] has occurred - updating... (live nodes size: [2])
   [junit4]   2> 290237 INFO  (zkCallback-399-thread-1) [    ] o.a.s.c.c.ZkStateReader A cluster state change: [WatchedEvent state:SyncConnected type:NodeDataChanged path:/collections/dv_coll/state.json] for collection [dv_coll] has occurred - updating... (live nodes size: [2])
   [junit4]   2> 290237 INFO  (zkCallback-398-thread-1) [    ] o.a.s.c.c.ZkStateReader A cluster state change: [WatchedEvent state:SyncConnected type:NodeDataChanged path:/collections/dv_coll/state.json] for collection [dv_coll] has occurred - updating... (live nodes size: [2])
   [junit4]   2> 290268 INFO  (qtp639735455-3338) [    ] o.a.s.c.ZkController I am the leader, no recovery necessary
   [junit4]   2> 290270 INFO  (qtp639735455-3338) [    ] o.a.s.s.HttpSolrCall [admin] webapp=null path=/admin/cores params={qt=/admin/cores&coreNodeName=core_node1&collection.configName=conf1&newCollection=true&name=dv_coll_shard1_replica_n1&action=CREATE&numShards=4&collection=dv_coll&shard=shard1&wt=javabin&version=2&replicaType=NRT} status=0 QTime=1265
   [junit4]   2> 290275 INFO  (qtp2102283932-3336) [    ] o.a.s.c.ZkController I am the leader, no recovery necessary
   [junit4]   2> 290276 INFO  (qtp2102283932-3336) [    ] o.a.s.s.HttpSolrCall [admin] webapp=null path=/admin/cores params={qt=/admin/cores&coreNodeName=core_node4&collection.configName=conf1&newCollection=true&name=dv_coll_shard4_replica_n1&action=CREATE&numShards=4&collection=dv_coll&shard=shard4&wt=javabin&version=2&replicaType=NRT} status=0 QTime=1264
   [junit4]   2> 290280 INFO  (qtp639735455-3343) [    ] o.a.s.c.ZkController I am the leader, no recovery necessary
   [junit4]   2> 290281 INFO  (qtp639735455-3343) [    ] o.a.s.s.HttpSolrCall [admin] webapp=null path=/admin/cores params={qt=/admin/cores&coreNodeName=core_node3&collection.configName=conf1&newCollection=true&name=dv_coll_shard3_replica_n1&action=CREATE&numShards=4&collection=dv_coll&shard=shard3&wt=javabin&version=2&replicaType=NRT} status=0 QTime=1277
   [junit4]   2> 290286 INFO  (qtp2102283932-3346) [    ] o.a.s.c.ZkController I am the leader, no recovery necessary
   [junit4]   2> 290288 INFO  (qtp2102283932-3346) [    ] o.a.s.s.HttpSolrCall [admin] webapp=null path=/admin/cores params={qt=/admin/cores&coreNodeName=core_node2&collection.configName=conf1&newCollection=true&name=dv_coll_shard2_replica_n1&action=CREATE&numShards=4&collection=dv_coll&shard=shard2&wt=javabin&version=2&replicaType=NRT} status=0 QTime=1270
   [junit4]   2> 290289 INFO  (qtp639735455-3344) [    ] o.a.s.h.a.CollectionsHandler Wait for new collection to be active for at most 30 seconds. Check all shard replicas
   [junit4]   2> 290388 INFO  (zkCallback-399-thread-2) [    ] o.a.s.c.c.ZkStateReader A cluster state change: [WatchedEvent state:SyncConnected type:NodeDataChanged path:/collections/dv_coll/state.json] for collection [dv_coll] has occurred - updating... (live nodes size: [2])
   [junit4]   2> 290388 INFO  (zkCallback-398-thread-1) [    ] o.a.s.c.c.ZkStateReader A cluster state change: [WatchedEvent state:SyncConnected type:NodeDataChanged path:/collections/dv_coll/state.json] for collection [dv_coll] has occurred - updating... (live nodes size: [2])
   [junit4]   2> 290388 INFO  (zkCallback-399-thread-1) [    ] o.a.s.c.c.ZkStateReader A cluster state change: [WatchedEvent state:SyncConnected type:NodeDataChanged path:/collections/dv_coll/state.json] for collection [dv_coll] has occurred - updating... (live nodes size: [2])
   [junit4]   2> 290690 INFO  (OverseerCollectionConfigSetProcessor-98278401160380422-127.0.0.1:45993_solr-n_0000000000) [    ] o.a.s.c.OverseerTaskQueue Response ZK path: /overseer/collection-queue-work/qnr-0000000000 doesn't exist.  Requestor may have disconnected from ZooKeeper
   [junit4]   2> 291289 INFO  (qtp639735455-3344) [    ] o.a.s.s.HttpSolrCall [admin] webapp=null path=/admin/collections params={replicationFactor=1&collection.configName=conf1&maxShardsPerNode=2&name=dv_coll&nrtReplicas=1&action=CREATE&numShards=4&wt=javabin&version=2} status=0 QTime=2601
   [junit4]   2> 291293 INFO  (qtp639735455-3337) [    ] o.a.s.s.SchemaManager managed schema loaded . version : 0 
   [junit4]   2> 291295 INFO  (qtp639735455-3337) [    ] o.a.s.s.IndexSchema [dv_coll_shard1_replica_n1] Schema name=minimal
   [junit4]   2> 291296 INFO  (qtp639735455-3337) [    ] o.a.s.s.IndexSchema Loaded schema minimal/1.1 with uniqueid field id
   [junit4]   2> 291303 INFO  (qtp639735455-3337) [    ] o.a.s.c.ZkController Persisted config data to node /configs/conf1/managed-schema 
   [junit4]   2> 291303 INFO  (zkCallback-398-thread-1) [    ] o.a.s.s.ZkIndexSchemaReader A schema change: WatchedEvent state:SyncConnected type:NodeDataChanged path:/configs/conf1/managed-schema, has occurred - updating schema from ZooKeeper ...
   [junit4]   2> 291304 INFO  (zkCallback-399-thread-1) [    ] o.a.s.s.ZkIndexSchemaReader A schema change: WatchedEvent state:SyncConnected type:NodeDataChanged path:/configs/conf1/managed-schema, has occurred - updating schema from ZooKeeper ...
   [junit4]   2> 291304 INFO  (zkCallback-399-thread-2) [    ] o.a.s.s.ZkIndexSchemaReader A schema change: WatchedEvent state:SyncConnected type:NodeDataChanged path:/configs/conf1/managed-schema, has occurred - updating schema from ZooKeeper ...
   [junit4]   2> 291304 INFO  (zkCallback-398-thread-2) [    ] o.a.s.s.ZkIndexSchemaReader A schema change: WatchedEvent state:SyncConnected type:NodeDataChanged path:/configs/conf1/managed-schema, has occurred - updating schema from ZooKeeper ...
   [junit4]   2> 291304 INFO  (zkCallback-399-thread-2) [    ] o.a.s.s.ZkIndexSchemaReader Retrieved schema version 1 from ZooKeeper
   [junit4]   2> 291304 INFO  (zkCallback-399-thread-1) [    ] o.a.s.s.ZkIndexSchemaReader Retrieved schema version 1 from ZooKeeper
   [junit4]   2> 291306 INFO  (zkCallback-399-thread-1) [    ] o.a.s.s.IndexSchema [dv_coll_shard4_replica_n1] Schema name=minimal
   [junit4]   2> 291306 INFO  (zkCallback-399-thread-2) [    ] o.a.s.s.IndexSchema [dv_coll_shard2_replica_n1] Schema name=minimal
   [junit4]   2> 291311 INFO  (zkCallback-399-thread-2) [    ] o.a.s.s.IndexSchema Loaded schema minimal/1.1 with uniqueid field id
   [junit4]   2> 291311 INFO  (Thread-1179) [    ] o.a.s.c.SolrCore config update listener called for core dv_coll_shard1_replica_n1
   [junit4]   2> 291311 INFO  (Thread-1180) [    ] o.a.s.c.SolrCore config update listener called for core dv_coll_shard2_replica_n1
   [junit4]   2> 291316 INFO  (zkCallback-399-thread-2) [    ] o.a.s.s.ZkIndexSchemaReader Finished refreshing schema in 11 ms
   [junit4]   2> 291316 INFO  (zkCallback-398-thread-2) [    ] o.a.s.s.ZkIndexSchemaReader Retrieved schema version 1 from ZooKeeper
   [junit4]   2> 291317 INFO  (Thread-1180) [    ] o.a.s.c.SolrCore core reload dv_coll_shard2_replica_n1
   [junit4]   2> 291319 INFO  (zkCallback-398-thread-2) [    ] o.a.s.s.IndexSchema [dv_coll_shard3_replica_n1] Schema name=minimal
   [junit4]   2> 291324 INFO  (zkCallback-398-thread-2) [    ] o.a.s.s.IndexSchema Loaded schema minimal/1.1 with uniqueid field id
   [junit4]   2> 291327 INFO  (zkCallback-398-thread-2) [    ] o.a.s.s.ZkIndexSchemaReader Finished refreshing schema in 10 ms
   [junit4]   2> 291327 INFO  (Thread-1180) [    ] o.a.s.c.SolrConfig Using Lucene MatchVersion: 7.1.0
   [junit4]   2> 291328 INFO  (zkCallback-399-thread-1) [    ] o.a.s.s.IndexSchema Loaded schema minimal/1.1 with uniqueid field id
   [junit4]   2> 291328 INFO  (Thread-1179) [    ] o.a.s.c.SolrCore core reload dv_coll_shard1_replica_n1
   [junit4]   2> 291334 INFO  (qtp639735455-3337) [    ] o.a.s.c.SolrConfig Using Lucene MatchVersion: 7.1.0
   [junit4]   2> 291335 INFO  (zkCallback-399-thread-1) [    ] o.a.s.s.ZkIndexSchemaReader Finished refreshing schema in 31 ms
   [junit4]   2> 291341 INFO  (Thread-1180) [    ] o.a.s.s.IndexSchema [dv_coll_shard2_replica_n1] Schema name=minimal
   [junit4]   2> 291342 INFO  (qtp639735455-3337) [    ] o.a.s.s.IndexSchema [dv_coll_shard1_replica_n1] Schema name=minimal
   [junit4]   2> 291345 INFO  (Thread-1180) [    ] o.a.s.s.IndexSchema Loaded schema minimal/1.1 with uniqueid field id
   [junit4]   2> 291345 INFO  (Thread-1180) [    ] o.a.s.c.CoreContainer Reloading SolrCore 'dv_coll_shard2_replica_n1' using configuration from collection dv_coll
   [junit4]   2> 291352 INFO  (qtp639735455-3337) [    ] o.a.s.s.IndexSchema Loaded schema minimal/1.1 with uniqueid field id
   [junit4]   2> 291352 INFO  (qtp639735455-3337) [    ] o.a.s.c.CoreContainer Reloading SolrCore 'dv_coll_shard1_replica_n1' using configuration from collection dv_coll
   [junit4]   2> 291377 INFO  (Thread-1180) [    ] o.a.s.m.r.SolrJmxReporter JMX monitoring for 'solr_45993.solr.core.dv_coll.shard2.replica_n1' (registry 'solr.core.dv_coll.shard2.replica_n1') enabled at server: com.sun.jmx.mbeanserver.JmxMBeanServer@25958cde
   [junit4]   2> 291377 INFO  (Thread-1180) [    ] o.a.s.c.SolrCore [[dv_coll_shard2_replica_n1] ] Opening new SolrCore at [/home/jenkins/workspace/Lucene-Solr-7.x-Linux/solr/build/solr-core/test/J1/temp/solr.cloud.DocValuesNotIndexedTest_5C576950CF96A9B6-001/tempDir-001/node2/dv_coll_shard2_replica_n1], dataDir=[/home/jenkins/workspace/Lucene-Solr-7.x-Linux/solr/build/solr-core/test/J1/temp/solr.cloud.DocValuesNotIndexedTest_5C576950CF96A9B6-001/tempDir-001/node2/./dv_coll_shard2_replica_n1/data/]
   [junit4]   2> 291378 INFO  (qtp639735455-3337) [    ] o.a.s.m.r.SolrJmxReporter JMX monitoring for 'solr_46819.solr.core.dv_coll.shard1.replica_n1' (registry 'solr.core.dv_coll.shard1.replica_n1') enabled at server: com.sun.jmx.mbeanserver.JmxMBeanServer@25958cde
   [junit4]   2> 291378 INFO  (qtp639735455-3337) [    ] o.a.s.c.SolrCore [[dv_coll_shard1_replica_n1] ] Opening new SolrCore at [/home/jenkins/workspace/Lucene-Solr-7.x-Linux/solr/build/solr-core/test/J1/temp/solr.cloud.DocValuesNotIndexedTest_5C576950CF96A9B6-001/tempDir-001/node1/dv_coll_shard1_replica_n1], dataDir=[/home/jenkins/workspace/Lucene-Solr-7.x-Linux/solr/build/solr-core/test/J1/temp/solr.cloud.DocValuesNotIndexedTest_5C576950CF96A9B6-001/tempDir-001/node1/./dv_coll_shard1_replica_n1/data/]
   [junit4]   2> 291449 INFO  (Thread-1180) [    ] o.a.s.u.CommitTracker Hard AutoCommit: disabled
   [junit4]   2> 291449 INFO  (Thread-1180) [    ] o.a.s.u.CommitTracker Soft AutoCommit: disabled
   [junit4]   2> 291452 INFO  (Thread-1180) [    ] o.a.s.s.SolrIndexSearcher Opening [Searcher@66302b43[dv_coll_shard2_replica_n1] main]
   [junit4]   2> 291453 INFO  (Thread-1180) [    ] o.a.s.r.ManagedResourceStorage Configured ZooKeeperStorageIO with znodeBase: /configs/conf1
   [junit4]   2> 291453 INFO  (Thread-1180) [    ] o.a.s.r.ManagedResourceStorage Loaded null at path _rest_managed.json using ZooKeeperStorageIO:path=/configs/conf1
   [junit4]   2> 291453 INFO  (Thread-1180) [    ] o.a.s.s.ZkIndexSchemaReader Creating ZooKeeper watch for the managed schema at /configs/conf1/managed-schema
   [junit4]   2> 291453 INFO  (Thread-1180) [    ] o.a.s.s.ZkIndexSchemaReader Current schema version 1 is already the latest
   [junit4]   2> 291453 INFO  (Thread-1180) [    ] o.a.s.h.ReplicationHandler Commits will be reserved for  10000
   [junit4]   2> 291454 INFO  (qtp639735455-3337) [    ] o.a.s.u.CommitTracker Hard AutoCommit: disabled
   [junit4]   2> 291454 INFO  (qtp639735455-3337) [    ] o.a.s.u.CommitTracker Soft AutoCommit: disabled
   [junit4]   2> 291456 INFO  (searcherExecutor-1149-thread-1) [    ] o.a.s.c.SolrCore [dv_coll_shard2_replica_n1] Registered new searcher Searcher@66302b43[dv_coll_shard2_replica_n1] main{ExitableDirectoryReader(UninvertingDirectoryReader())}
   [junit4]   2> 291456 INFO  (qtp639735455-3337) [    ] o.a.s.s.SolrIndexSearcher Opening [Searcher@28331da3[dv_coll_shard1_replica_n1] main]
   [junit4]   2> 291456 INFO  (Thread-1180) [    ] o.a.s.u.UpdateLog Could not find max version in index or recent updates, using new clock 1572454421865955328
   [junit4]   2> 291457 INFO  (qtp639735455-3337) [    ] o.a.s.r.ManagedResourceStorage Configured ZooKeeperStorageIO with znodeBase: /configs/conf1
   [junit4]   2> 291458 INFO  (qtp639735455-3337) [    ] o.a.s.r.ManagedResourceStorage Loaded null at path _rest_managed.json using ZooKeeperStorageIO:path=/configs/conf1
   [junit4]   2> 291458 INFO  (qtp639735455-3337) [    ] o.a.s.s.ZkIndexSchemaReader Creating ZooKeeper watch for the managed schema at /configs/conf1/managed-schema
   [junit4]   2> 291458 INFO  (Thread-1180) [    ] o.a.s.u.DefaultSolrCoreState New IndexWriter is ready to be used.
   [junit4]   2> 291459 INFO  (Thread-1180) [    ] o.a.s.s.SolrIndexSearcher Opening [Searcher@35b4dd26[dv_coll_shard2_replica_n1] main]
   [junit4]   2> 291459 INFO  (Thread-1180) [    ] o.a.s.c.SolrCore [dv_coll_shard2_replica_n1]  CLOSING SolrCore org.apache.solr.core.SolrCore@b36f5e2
   [junit4]   2> 291459 INFO  (qtp639735455-3337) [    ] o.a.s.s.ZkIndexSchemaReader Current schema version 1 is already the latest
   [junit4]   2> 291459 INFO  (Thread-1180) [    ] o.a.s.m.SolrMetricManager Closing metric reporters for registry=solr.core.dv_coll.shard2.replica_n1, tag=188151266
   [junit4]   2> 291459 INFO  (qtp639735455-3337) [    ] o.a.s.h.ReplicationHandler Commits will be reserved for  10000
   [junit4]   2> 291460 INFO  (searcherExecutor-1149-thread-1) [    ] o.a.s.c.SolrCore [dv_coll_shard2_replica_n1] Registered new searcher Searcher@35b4dd26[dv_coll_shard2_replica_n1] main{ExitableDirectoryReader(UninvertingDirectoryReader())}
   [junit4]   2> 291461 INFO  (searcherExecutor-1150-thread-1) [    ] o.a.s.c.SolrCore [dv_coll_shard1_replica_n1] Registered new searcher Searcher@28331da3[dv_coll_shard1_replica_n1] main{ExitableDirectoryReader(UninvertingDirectoryReader())}
   [junit4]   2> 291462 INFO  (Thread-1180) [    ] o.a.s.m.SolrMetricManager Closing metric reporters for registry=solr.collection.dv_coll.shard2.leader, tag=188151266
   [junit4]   2> 291463 INFO  (Thread-1180) [    ] o.a.s.c.SolrCore config update listener called for core dv_coll_shard4_replica_n1
   [junit4]   2> 291463 INFO  (qtp639735455-3337) [    ] o.a.s.u.UpdateLog Could not find max version in index or recent updates, using new clock 1572454421873295360
   [junit4]   2> 291465 INFO  (qtp639735455-3337) [    ] o.a.s.u.DefaultSolrCoreState New IndexWriter is ready to be used.
   [junit4]   2> 291465 INFO  (qtp639735455-3337) [    ] o.a.s.s.SolrIndexSearcher Opening [Searcher@2e08916e[dv_coll_shard1_replica_n1] main]
   [junit4]   2> 291467 INFO  (qtp639735455-3337) [    ] o.a.s.s.ManagedIndexSchema Waiting up to 599 secs for 3 replicas to apply schema update version 1 for collection dv_coll
   [junit4]   2> 291467 INFO  (searcherExecutor-1150-thread-1) [    ] o.a.s.c.SolrCore [dv_coll_shard1_replica_n1] Registered new searcher Searcher@2e08916e[dv_coll_shard1_replica_n1] main{ExitableDirectoryReader(UninvertingDirectoryReader())}
   [junit4]   2> 291468 INFO  (zkCallback-398-thread-1) [    ] o.a.s.s.ZkIndexSchemaReader Retrieved schema version 1 from ZooKeeper
   [junit4]   2> 291470 INFO  (zkCallback-398-thread-1) [    ] o.a.s.s.IndexSchema [dv_coll_shard1_replica_n1] Schema name=minimal
   [junit4]   2> 291474 INFO  (zkCallback-398-thread-1) [    ] o.a.s.s.IndexSchema Loaded schema minimal/1.1 with uniqueid field id
   [junit4]   2> 291474 INFO  (zkCallback-398-thread-1) [    ] o.a.s.s.ZkIndexSchemaReader Finished refreshing schema in 5 ms
   [junit4]   2> 291479 INFO  (Thread-1179) [    ] o.a.s.c.SolrConfig Using Lucene MatchVersion: 7.1.0
   [junit4]   2> 291490 INFO  (Thread-1179) [    ] o.a.s.s.IndexSchema [dv_coll_shard1_replica_n1] Schema name=minimal
   [junit4]   2> 291494 INFO  (Thread-1179) [    ] o.a.s.s.IndexSchema Loaded schema minimal/1.1 with uniqueid field id
   [junit4]   2> 291494 INFO  (Thread-1179) [    ] o.a.s.c.CoreContainer Reloading SolrCore 'dv_coll_shard1_replica_n1' using configuration from collection dv_coll
   [junit4]   2> 291495 INFO  (qtp639735455-3340) [    ] o.a.s.c.S.Request [dv_coll_shard3_replica_n1]  webapp=/solr path=/schema/zkversion params={refreshIfBelowVersion=1&wt=javabin&version=2} status=0 QTime=0
   [junit4]   2> 291495 INFO  (qtp2102283932-3346) [    ] o.a.s.c.S.Request [dv_coll_shard2_replica_n1]  webapp=/solr path=/schema/zkversion params={refreshIfBelowVersion=1&wt=javabin&version=2} status=0 QTime=0
   [junit4]   2> 291501 INFO  (qtp2102283932-3348) [    ] o.a.s.c.S.Request [dv_coll_shard4_replica_n1]  webapp=/solr path=/schema/zkversion params={refreshIfBelowVersion=1&wt=javabin&version=2} status=0 QTime=0
   [junit4]   2> 291502 INFO  (qtp639735455-3337) [    ] o.a.s.s.ManagedIndexSchema Took 36.0ms for 3 replicas to apply schema update version 1 for collection dv_coll
   [junit4]   2> 291502 INFO  (qtp639735455-3337) [    ] o.a.s.c.S.Request [dv_coll_shard1_replica_n1]  webapp=/solr path=/schema params={wt=javabin&version=2} status=0 QTime=209
   [junit4]   2> 291502 INFO  (qtp639735455-3337) [    ] o.a.s.c.SolrCore [dv_coll_shard1_replica_n1]  CLOSING SolrCore org.apache.solr.core.SolrCore@5a5d0152
   [junit4]   2> 291503 INFO  (qtp639735455-3337) [    ] o.a.s.m.SolrMetricManager Closing metric reporters for registry=solr.core.dv_coll.shard1.replica_n1, tag=1516044626
   [junit4]   2> 291508 INFO  (qtp639735455-3337) [    ] o.a.s.m.SolrMetricManager Closing metric reporters for registry=solr.collection.dv_coll.shard1.leader, tag=1516044626
   [junit4]   2> 291509 INFO  (Thread-1179) [    ] o.a.s.m.r.SolrJmxReporter JMX monitoring for 'solr_46819.solr.core.dv_coll.shard1.replica_n1' (registry 'solr.core.dv_coll.shard1.replica_n1') enabled at server: com.sun.jmx.mbeanserver.JmxMBeanServer@25958cde
   [junit4]   2> 291509 INFO  (Thread-1179) [    ] o.a.s.c.SolrCore [[dv_coll_shard1_replica_n1] ] Opening new SolrCore at [/home/jenkins/workspace/Lucene-Solr-7.x-Linux/solr/build/solr-core/test/J1/temp/solr.cloud.DocValuesNotIndexedTest_5C576950CF96A9B6-001/tempDir-001/node1/dv_coll_shard1_replica_n1], dataDir=[/home/jenkins/workspace/Lucene-Solr-7.x-Linux/solr/build/solr-core/test/J1/temp/solr.cloud.DocValuesNotIndexedTest_5C576950CF96A9B6-001/tempDir-001/node1/./dv_coll_shard1_replica_n1/data/]
   [junit4]   2> 291521 INFO  (TEST-DocValuesNotIndexedTest.testGroupingDVOnly-seed#[5C576950CF96A9B6]) [    ] o.a.s.SolrTestCaseJ4 ###Starting testGroupingDVOnly
   [junit4]   2> 291546 INFO  (qtp2102283932-3352) [    ] o.a.s.u.p.LogUpdateProcessorFactory [dv_coll_shard4_replica_n1]  webapp=/solr path=/update params={update.distrib=TOLEADER&distrib.from=https://127.0.0.1:46819/solr/dv_coll_shard3_replica_n1/&wt=javabin&version=2}{deleteByQuery=*:* (-1572454421955084288)} 0 4
   [junit4]   2> 291563 INFO  (qtp2102283932-3350) [    ] o.a.s.u.p.LogUpdateProcessorFactory [dv_coll_shard2_replica_n1]  webapp=/solr path=/update params={update.distrib=TOLEADER&distrib.from=https://127.0.0.1:46819/solr/dv_coll_shard3_replica_n1/&wt=javabin&version=2}{deleteByQuery=*:* (-1572454421962424320)} 0 15
   [junit4]   2> 291563 INFO  (qtp639735455-3343) [    ] o.a.s.u.p.LogUpdateProcessorFactory [dv_coll_shard1_replica_n1]  webapp=/solr path=/update params={update.distrib=TOLEADER&distrib.from=https://127.0.0.1:46819/solr/dv_coll_shard3_replica_n1/&wt=javabin&version=2}{deleteByQuery=*:* (-1572454421962424320)} 0 15
   [junit4]   2> 291564 INFO  (qtp639735455-3400) [    ] o.a.s.u.p.LogUpdateProcessorFactory [dv_coll_shard3_replica_n1]  webapp=/solr path=/update params={wt=javabin&version=2}{deleteByQuery=*:* (-1572454421945647104)} 0 41
   [junit4]   2> 291582 INFO  (Thread-1179) [    ] o.a.s.u.CommitTracker Hard AutoCommit: disabled
   [junit4]   2> 291582 INFO  (Thread-1179) [    ] o.a.s.u.CommitTracker Soft AutoCommit: disabled
   [junit4]   2> 291583 INFO  (qtp639735455-3344) [    ] o.a.s.u.DirectUpdateHandler2 start commit{_version_=1572454421999124480,optimize=false,openSearcher=true,waitSearcher=true,expungeDeletes=false,softCommit=false,prepareCommit=false}
   [junit4]   2> 291583 INFO  (qtp639735455-3344) [    ] o.a.s.u.DirectUpdateHandler2 No uncommitted changes. Skipping IW.commit.
   [junit4]   2> 291584 INFO  (Thread-1179) [    ] o.a.s.s.SolrIndexSearcher Opening [Searcher@74d3698d[dv_coll_shard1_replica_n1] main]
   [junit4]   2> 291589 INFO  (qtp2102283932-3350) [    ] o.a.s.u.DirectUpdateHandler2 start commit{_version_=1572454422005415936,optimize=false,openSearcher=true,waitSearcher=true,expungeDeletes=false,softCommit=false,prepareCommit=false}
   [junit4]   2> 291593 INFO  (qtp2102283932-3351) [    ] o.a.s.u.DirectUpdateHandler2 start commit{_version_=1572454422009610240,optimize=false,openSearcher=true,waitSearcher=true,expungeDeletes=false,softCommit=false,prepareCommit=false}
   [junit4]   2> 291593 INFO  (qtp2102283932-3350) [    ] o.a.s.u.DirectUpdateHandler2 No uncommitted changes. Skipping IW.commit.
   [junit4]   2> 291584 INFO  (qtp639735455-3344) [    ] o.a.s.u.DirectUpdateHandler2 end_commit_flush
   [junit4]   2> 291593 INFO  (qtp2102283932-3351) [    ] o.a.s.u.DirectUpdateHandler2 No uncommitted changes. Skipping IW.commit.
   [junit4]   2> 291593 INFO  (qtp639735455-3398) [    ] o.a.s.u.DirectUpdateHandler2 start commit{_version_=1572454422009610240,optimize=false,openSearcher=true,waitSearcher=true,expungeDeletes=false,softCommit=false,prepareCommit=false}
   [junit4]   2> 291594 INFO  (qtp639735455-3398) [    ] o.a.s.u.DirectUpdateHandler2 No uncommitted changes. Skipping IW.commit.
   [junit4]   2> 291593 INFO  (qtp639735455-3344) [    ] o.a.s.u.p.LogUpdateProcessorFactory [dv_coll_shard1_replica_n1]  webapp=/solr path=/update params={update.distrib=FROMLEADER&waitSearcher=true&openSearcher=true&commit=true&softCommit=false&distrib.from=https://127.0.0.1:45993/solr/dv_coll_shard4_replica_n1/&commit_end_point=true&wt=javabin&version=2&expungeDeletes=false}{commit=} 0 10
   [junit4]   2> 291594 INFO  (qtp2102283932-3350) [    ] o.a.s.s.SolrIndexSearcher Opening [Searcher@52d6d973[dv_coll_shard4_replica_n1] main]
   [junit4]   2> 291596 INFO  (qtp639735455-3398) [    ] o.a.s.s.SolrIndexSearcher Opening [Searcher@389f580f[dv_coll_shard3_replica_n1] main]
   [junit4]   2> 291596 INFO  (qtp2102283932-3351) [    ] o.a.s.u.DirectUpdateHandler2 end_commit_flush
   [junit4]   2> 291596 INFO  (qtp2102283932-3351) [    ] o.a.s.u.p.LogUpdateProcessorFactory [dv_coll_shard2_replica_n1]  webapp=/solr path=/update params={update.distrib=FROMLEADER&waitSearcher=true&openSearcher=true&commit=true&softCommit=false&distrib.from=https://127.0.0.1:45993/solr/dv_coll_shard4_replica_n1/&commit_end_point=true&wt=javabin&version=2&expungeDeletes=false}{commit=} 0 2
   [junit4]   2> 291597 INFO  (searcherExecutor-1130-thread-1) [    ] o.a.s.c.SolrCore [dv_coll_shard4_replica_n1] Registered new searcher Searcher@52d6d973[dv_coll_shard4_replica_n1] main{ExitableDirectoryReader(UninvertingDirectoryReader())}
   [junit4]   2> 291597 INFO  (searcherExecutor-1131-thread-1) [    ] o.a.s.c.SolrCore [dv_coll_shard3_replica_n1] Registered new searcher Searcher@389f580f[dv_coll_shard3_replica_n1] main{ExitableDirectoryReader(UninvertingDirectoryReader())}
   [junit4]   2> 291598 INFO  (qtp639735455-3398) [    ] o.a.s.u.DirectUpdateHandler2 end_commit_flush
   [junit4]   2> 291598 INFO  (qtp639735455-3398) [    ] o.a.s.u.p.LogUpdateProcessorFactory [dv_coll_shard3_replica_n1]  webapp=/solr path=/update params={update.distrib=FROMLEADER&waitSearcher=true&openSearcher=true&commit=true&softCommit=false&distrib.from=https://127.0.0.1:45993/solr/dv_coll_shard4_replica_n1/&commit_end_point=true&wt=javabin&version=2&expungeDeletes=false}{commit=} 0 4
   [junit4]   2> 291598 INFO  (qtp2102283932-3350) [    ] o.a.s.u.DirectUpdateHandler2 end_commit_flush
   [junit4]   2> 291599 INFO  (qtp2102283932-3350) [    ] o.a.s.u.p.LogUpdateProcessorFactory [dv_coll_shard4_replica_n1]  webapp=/solr path=/update params={update.distrib=FROMLEADER&waitSearcher=true&openSearcher=true&commit=true&softCommit=false&distrib.from=https://127.0.0.1:45993/solr/dv_coll_shard4_replica_n1/&commit_end_point=true&wt=javabin&version=2&expungeDeletes=false}{commit=} 0 9
   [junit4]   2> 291599 INFO  (qtp2102283932-3346) [    ] o.a.s.u.p.LogUpdateProcessorFactory [dv_coll_shard4_replica_n1]  webapp=/solr path=/update params={_stateVer_=dv_coll:4&waitSearcher=true&commit=true&softCommit=false&wt=javabin&version=2}{commit=} 0 31
   [junit4]   2> 291602 INFO  (Thread-1179) [    ] o.a.s.r.ManagedResourceStorage Configured ZooKeeperStorageIO with znodeBase: /configs/conf1
   [junit4]   2> 291603 INFO  (Thread-1179) [    ] o.a.s.r.ManagedResourceStorage Loaded null at path _rest_managed.json using ZooKeeperStorageIO:path=/configs/conf1
   [junit4]   2> 291603 INFO  (Thread-1179) [    ] o.a.s.s.ZkIndexSchemaReader Creating ZooKeeper watch for the managed schema at /configs/conf1/managed-schema
   [junit4]   2> 291604 INFO  (Thread-1179) [    ] o.a.s.s.ZkIndexSchemaReader Current schema version 1 is already the latest
   [junit4]   2> 291604 INFO  (Thread-1179) [    ] o.a.s.h.ReplicationHandler Commits will be reserved for  10000
   [junit4]   2> 291607 INFO  (searcherExecutor-1158-thread-1) [    ] o.a.s.c.SolrCore [dv_coll_shard1_replica_n1] Registered new searcher Searcher@74d3698d[dv_coll_shard1_replica_n1] main{ExitableDirectoryReader(UninvertingDirectoryReader())}
   [junit4]   2> 291608 INFO  (qtp2102283932-3352) [    ] o.a.s.u.p.LogUpdateProcessorFactory [dv_coll_shard4_replica_n1]  webapp=/solr path=/update params={_stateVer_=dv_coll:4&wt=javabin&version=2}{add=[10000 (1572454422022193152), 5 (1572454422024290304), 17 (1572454422024290305), 19 (1572454422024290306), 21 (1572454422024290307), 23 (1572454422024290308), 25 (1572454422024290309), 29 (1572454422024290310), 10030 (1572454422025338880), 33 (1572454422025338881), ... (13 adds)]} 0 3
   [junit4]   2> 291609 INFO  (qtp639735455-3399) [    ] o.a.s.u.p.LogUpdateProcessorFactory [dv_coll_shard3_replica_n1]  webapp=/solr path=/update params={_stateVer_=dv_coll:4&wt=javabin&version=2}{add=[2 (1572454422020096000), 3 (1572454422025338880), 6 (1572454422025338881), 7 (1572454422025338882), 9 (1572454422025338883), 10010 (1572454422025338884), 18 (1572454422025338885), 10025 (1572454422025338886), 26 (1572454422025338887), 30 (1572454422025338888), ... (14 adds)]} 0 6
   [junit4]   2> 291611 INFO  (qtp2102283932-3351) [    ] o.a.s.u.p.LogUpdateProcessorFactory [dv_coll_shard2_replica_n1]  webapp=/solr path=/update params={_stateVer_=dv_coll:4&wt=javabin&version=2}{add=[0 (1572454422025338880), 4 (1572454422025338881), 10005 (1572454422026387456), 12 (1572454422026387457), 15 (1572454422026387458), 16 (1572454422026387459), 20 (1572454422026387460), 22 (1572454422026387461), 34 (1572454422026387462), 35 (1572454422026387463), ... (16 adds)]} 0 3
   [junit4]   2> 291656 INFO  (Thread-1179) [    ] o.a.s.u.DefaultSolrCoreState New IndexWriter is ready to be used.
   [junit4]   2> 291665 INFO  (qtp639735455-3340) [    ] o.a.s.u.p.LogUpdateProcessorFactory [dv_coll_shard1_replica_n1]  webapp=/solr path=/update params={_stateVer_=dv_coll:4&wt=javabin&version=2}{add=[1 (1572454422025338880), 8 (1572454422026387456), 10 (1572454422028484608), 11 (1572454422028484609), 13 (1572454422083010560), 14 (1572454422085107712), 10015 (1572454422085107713), 10020 (1572454422085107714), 24 (1572454422085107715), 27 (1572454422085107716), ... (16 adds)]} 0 57
   [junit4]   2> 291669 INFO  (Thread-1179) [    ] o.a.s.s.SolrIndexSearcher Opening [Searcher@261ece1c[dv_coll_shard1_replica_n1] main]
   [junit4]   2> 291670 INFO  (qtp639735455-3339) [    ] o.a.s.u.DirectUpdateHandler2 start commit{_version_=1572454422090350592,optimize=false,openSearcher=true,waitSearcher=true,expungeDeletes=false,softCommit=false,prepareCommit=false}
   [junit4]   2> 291671 INFO  (searcherExecutor-1158-thread-1) [    ] o.a.s.c.SolrCore [dv_coll_shard1_replica_n1] Registered new searcher Searcher@261ece1c[dv_coll_shard1_replica_n1] main{ExitableDirectoryReader(UninvertingDirectoryReader(Uninverting(_0(7.1.0):C3) Uninverting(_1(7.1.0):C1)))}
   [junit4]   2> 291672 INFO  (qtp639735455-3339) [    ] o.a.s.u.SolrIndexWriter Calling setCommitData with IW:org.apache.solr.update.SolrIndexWriter@1caec20b commitCommandVersion:1572454422090350592
   [junit4]   2> 291672 INFO  (qtp2102283932-3352) [    ] o.a.s.u.DirectUpdateHandler2 start commit{_version_=1572454422092447744,optimize=false,openSearcher=true,waitSearcher=true,expungeDeletes=false,softCommit=false,prepareCommit=false}
   [junit4]   2> 291675 INFO  (qtp2102283932-3352) [    ] o.a.s.u.SolrIndexWriter Calling setCommitData with IW:org.apache.solr.update.SolrIndexWriter@bc641b8 commitCommandVersion:1572454422092447744
   [junit4]   2> 291680 INFO  (Thread-1179) [    ] o.a.s.c.SolrCore config update listener called for core dv_coll_shard3_replica_n1
   [junit4]   2> 291680 INFO  (qtp639735455-3400) [    ] o.a.s.u.DirectUpdateHandler2 start commit{_version_=1572454422100836352,optimize=false,openSearcher=true,waitSearcher=true,expungeDeletes=false,softCommit=false,prepareCommit=false}
   [junit4]   2> 291680 INFO  (qtp2102283932-3348) [    ] o.a.s.u.DirectUpdateHandler2 start commit{_version_=1572454422100836352,optimize=false,openSearcher=true,waitSearcher=true,expungeDeletes=false,softCommit=false,prepareCommit=false}
   [junit4]   2> 291681 INFO  (qtp639735455-3400) [    ] o.a.s.u.SolrIndexWriter Calling setCommitData with IW:org.apache.solr.update.SolrIndexWriter@4f2dd508 commitCommandVersion:1572454422100836352
   [junit4]   2> 291682 INFO  (qtp2102283932-3352) [    ] o.a.s.s.SolrIndexSearcher Opening [Searcher@53417e9d[dv_coll_shard2_replica_n1] main]
   [junit4]   2> 291682 INFO  (qtp2102283932-3348) [    ] o.a.s.u.SolrIndexWriter Calling setCommitData with IW:org.apache.solr.update.SolrIndexWriter@292bc4c9 commitCommandVersion:1572454422100836352
   [junit4]   2> 291683 INFO  (searcherExecutor-1149-thread-1) [    ] o.a.s.c.SolrCore [dv_coll_shard2_replica_n1] Registered new searcher Searcher@53417e9d[dv_coll_shard2_replica_n1] main{ExitableDirectoryReader(UninvertingDirectoryReader(Uninverting(_0(7.1.0):C16)))}
   [junit4]   2> 291684 INFO  (qtp2102283932-3352) [    ] o.a.s.u.DirectUpdateHandler2 end_commit_flush
   [junit4]   2> 291684 INFO  (qtp2102283932-3352) [    ] o.a.s.u.p.LogUpdateProcessorFactory [dv_coll_shard2_replica_n1]  webapp=/solr path=/update params={update.distrib=FROMLEADER&waitSearcher=true&openSearcher=true&commit=true&softCommit=false&distrib.from=https://127.0.0.1:46819/solr/dv_coll_shard1_replica_n1/&commit_end_point=true&wt=javabin&version=2&expungeDeletes=false}{commit=} 0 11
   [junit4]   2> 291686 INFO  (qtp639735455-3400) [    ] o.a.s.s.SolrIndexSearcher Opening [Searcher@8206742[dv_coll_shard3_replica_n1] main]
   [junit4]   2> 291687 INFO  (searcherExecutor-1131-thread-1) [    ] o.a.s.c.SolrCore [dv_coll_shard3_replica_n1] Registered new searcher Searcher@8206742[dv_coll_shard3_replica_n1] main{ExitableDirectoryReader(UninvertingDirectoryReader(Uninverting(_0(7.1.0):C14)))}
   [junit4]   2> 291688 INFO  (qtp639735455-3400) [    ] o.a.s.u.DirectUpdateHandler2 end_commit_flush
   [junit4]   2> 291688 INFO  (qtp639735455-3400) [    ] o.a.s.u.p.LogUpdateProcessorFactory [dv_coll_shard3_replica_n1]  webapp=/solr path=/update params={update.distrib=FROMLEADER&waitSearcher=true&openSearcher=true&commit=true&softCommit=false&distrib.from=https://127.0.0.1:46819/solr/dv_coll_shard1_replica_n1/&commit_end_point=true&wt=javabin&version=2&expungeDeletes=false}{commit=} 0 10
   [junit4]   2> 291689 INFO  (qtp639735455-3339) [    ] o.a.s.s.SolrIndexSearcher Opening [Searcher@4813cdc2[dv_coll_shard1_replica_n1] main]
   [junit4]   2> 291690 INFO  (qtp2102283932-3348) [    ] o.a.s.s.SolrIndexSearcher Opening [Searcher@644f2717[dv_coll_shard4_replica_n1] main]
   [junit4]   2> 291690 INFO  (qtp639735455-3339) [    ] o.a.s.u.DirectUpdateHandler2 end_commit_flush
   [junit4]   2> 291690 INFO  (qtp2102283932-3348) [    ] o.a.s.u.DirectUpdateHandler2 end_commit_flush
   [junit4]   2> 291691 INFO  (searcherExecutor-1130-thread-1) [    ] o.a.s.c.SolrCore [dv_coll_shard4_replica_n1] Registered new searcher Searcher@644f2717[dv_coll_shard4_replica_n1] main{ExitableDirectoryReader(UninvertingDirectoryReader(Uninverting(_0(7.1.0):C13)))}
   [junit4]   2> 291691 INFO  (qtp2102283932-3348) [    ] o.a.s.u.p.LogUpdateProcessorFactory [dv_coll_shard4_replica_n1]  webapp=/solr path=/update params={update.distrib=FROMLEADER&waitSearcher=true&openSearcher=true&commit=true&softCommit=false&distrib.from=https://127.0.0.1:46819/solr/dv_coll_shard1_replica_n1/&commit_end_point=true&wt=javabin&version=2&expungeDeletes=false}{commit=} 0 14
   [junit4]   2> 291692 INFO  (searcherExecutor-1150-thread-1) [    ] o.a.s.c.SolrCore [dv_coll_shard1_replica_n1] Registered new searcher Searcher@4813cdc2[dv_coll_shard1_replica_n1] main{ExitableDirectoryReader(UninvertingDirectoryReader(Uninverting(_0(7.1.0):C3) Uninverting(_1(7.1.0):C1) Uninverting(_2(7.1.0):C12)))}
   [junit4]   2> 291692 INFO  (qtp639735455-3339) [    ] o.a.s.u.p.LogUpdateProcessorFactory [dv_coll_shard1_replica_n1]  webapp=/solr path=/update params={update.distrib=FROMLEADER&waitSearcher=true&openSearcher=true&commit=true&softCommit=false&distrib.from=https://127.0.0.1:46819/solr/dv_coll_shard1_replica_n1/&commit_end_point=true&wt=javabin&version=2&expungeDeletes=false}{commit=} 0 21
   [junit4]   2> 291694 INFO  (qtp639735455-3399) [    ] o.a.s.u.p.LogUpdateProcessorFactory [dv_coll_shard1_replica_n1]  webapp=/solr path=/update params={_stateVer_=dv_coll:4&commit=true&wt=javabin&version=2}{commit=} 0 27
   [junit4]   2> 291694 INFO  (qtp639735455-3399) [    ] o.a.s.c.SolrCore [dv_coll_shard1_replica_n1]  CLOSING SolrCore org.apache.solr.core.SolrCore@2350ca57
   [junit4]   2> 291694 INFO  (qtp639735455-3399) [    ] o.a.s.m.SolrMetricManager Closing metric reporters for registry=solr.core.dv_coll.shard1.replica_n1, tag=592497239
   [junit4]   2> 291696 INFO  (qtp639735455-3399) [    ] o.a.s.m.SolrMetricManager Closing metric reporters for registry=solr.collection.dv_coll.shard1.leader, tag=592497239
   [junit4]   2> 291707 INFO  (qtp639735455-3343) [    ] o.a.s.c.S.Request [dv_coll_shard3_replica_n1]  webapp=/solr path=/select params={df=text&group.distributed.first=true&distrib=false&_stateVer_=dv_coll:4&group.limit=100&fl=id,score&shards.purpose=2048&start=0&shard.url=https://127.0.0.1:46819/solr/dv_coll_shard3_replica_n1/&rows=100&version=2&q=*:*&NOW=1499609396093&isShard=true&wt=javabin&group.field=intGSF&group=true} status=0 QTime=9
   [junit4]   2> 291707 INFO  (qtp639735455-3337) [    ] o.a.s.c.S.Request [dv_coll_shard1_replica_n1]  webapp=/solr path=/select params={df=text&group.distributed.first=true&distrib=false&_stateVer_=dv_coll:4&group.limit=100&fl=id,score&shards.purpose=2048&start=0&shard.url=https://127.0.0.1:46819/solr/dv_coll_shard1_replica_n1/&rows=100&version=2&q=*:*&NOW=1499609396093&isShard=true&wt=javabin&group.field=intGSF&group=true} status=0 QTime=9
   [junit4]   2> 291707 INFO  (qtp2102283932-3350) [    ] o.a.s.c.S.Request [dv_coll_shard4_replica_n1]  webapp=/solr path=/select params={df=text&group.distributed.first=true&distrib=false&_stateVer_=dv_coll:4&group.limit=100&fl=id,score&shards.purpose=2048&start=0&shard.url=https://127.0.0.1:45993/solr/dv_coll_shard4_replica_n1/&rows=100&version=2&q=*:*&NOW=1499609396093&isShard=true&wt=javabin&group.field=intGSF&group=true} status=0 QTime=9
   [junit4]   2> 291707 INFO  (qtp2102283932-3347) [    ] o.a.s.c.S.Request [dv_coll_shard2_replica_n1]  webapp=/solr path=/select params={df=text&group.distributed.first=true&distrib=false&_stateVer_=dv_coll:4&group.limit=100&fl=id,score&shards.purpose=2048&start=0&shard.url=https://127.0.0.1:45993/solr/dv_coll_shard2_replica_n1/&rows=100&version=2&q=*:*&NOW=1499609396093&isShard=true&wt=javabin&group.field=intGSF&group=true} status=0 QTime=9
   [junit4]   2> 291716 INFO  (qtp2102283932-3352) [    ] o.a.s.c.S.Request [dv_coll_shard2_replica_n1]  webapp=/solr path=/select params={df=text&distrib=false&_stateVer_=dv_coll:4&group.limit=100&fl=id,score&shards.purpose=4&start=0&shard.url=https://127.0.0.1:45993/solr/dv_coll_shard2_replica_n1/&rows=100&version=2&group.distributed.second=true&q=*:*&NOW=1499609396093&group.topgroups.intGSF=1311826592&group.topgroups.intGSF=1311836593&group.topgroups.intGSF=%01&group.topgroups.intGSF=1311846594&group.topgroups.intGSF=1311856597&group.topgroups.intGSF=1311866604&group.topgroups.intGSF=1311876612&group.topgroups.intGSF=1311886614&isShard=true&wt=javabin&group.field=intGSF&group=true} status=0 QTime=3
   [junit4]   2> 291717 INFO  (qtp2102283932-3351) [    ] o.a.s.c.S.Request [dv_coll_shard4_replica_n1]  webapp=/solr path=/select params={df=text&distrib=false&_stateVer_=dv_coll:4&group.limit=100&fl=id,score&shards.purpose=4&start=0&shard.url=https://127.0.0.1:45993/solr/dv_coll_shard4_replica_n1/&rows=100&version=2&group.distributed.second=true&q=*:*&NOW=1499609396093&group.topgroups.intGSF=1311826592&group.topgroups.intGSF=1311836593&group.topgroups.intGSF=%01&group.topgroups.intGSF=1311846594&group.topgroups.intGSF=1311856597&group.topgroups.intGSF=1311866604&group.topgroups.intGSF=1311876612&group.topgroups.intGSF=1311886614&isShard=true&wt=javabin&group.field=intGSF&group=true} status=0 QTime=4
   [junit4]   2> 291717 INFO  (qtp639735455-3344) [    ] o.a.s.c.S.Request [dv_coll_shard3_replica_n1]  webapp=/solr path=/select params={df=text&distrib=false&_stateVer_=dv_coll:4&group.limit=100&fl=id,score&shards.purpose=4&start=0&shard.url=https://127.0.0.1:46819/solr/dv_coll_shard3_replica_n1/&rows=100&version=2&group.distributed.second=true&q=*:*&NOW=1499609396093&group.topgroups.intGSF=1311826592&group.topgroups.intGSF=1311836593&group.topgroups.intGSF=%01&group.topgroups.intGSF=1311846594&group.topgroups.intGSF=1311856597&group.topgroups.intGSF=1311866604&group.topgroups.intGSF=1311876612&group.topgroups.intGSF=1311886614&isShard=true&wt=javabin&group.field=intGSF&group=true} status=0 QTime=4
   [junit4]   2> 291718 INFO  (qtp639735455-3340) [    ] o.a.s.c.S.Request [dv_coll_shard1_replica_n1]  webapp=/solr path=/select params={df=text&distrib=false&_stateVer_=dv_coll:4&group.limit=100&fl=id,score&shards.purpose=4&start=0&shard.url=https://127.0.0.1:46819/solr/dv_coll_shard1_replica_n1/&rows=100&version=2&group.distributed.second=true&q=*:*&NOW=1499609396093&group.topgroups.intGSF=1311826592&group.topgroups.intGSF=1311836593&group.topgroups.intGSF=%01&group.topgroups.intGSF=1311846594&group.topgroups.intGSF=1311856597&group.topgroups.intGSF=1311866604&group.topgroups.intGSF=1311876612&group.topgroups.intGSF=1311886614&isShard=true&wt=javabin&group.field=intGSF&group=true} status=0 QTime=5
   [junit4]   2> 291762 INFO  (qtp639735455-3400) [    ] o.a.s.c.S.Request [dv_coll_shard1_replica_n1]  webapp=/solr path=/select params={df=text&distrib=false&_stateVer_=dv_coll:4&group.limit=100&shards.purpose=64&shard.url=https://127.0.0.1:46819/solr/dv_coll_shard1_replica_n1/&rows=100&version=2&q=*:*&NOW=1499609396093&ids=11,1,8,10&isShard=true&wt=javabin&group.field=intGSF} status=0 QTime=0
   [junit4]   2> 291763 INFO  (qtp639735455-3339) [    ] o.a.s.c.S.Request [dv_coll_shard3_replica_n1]  webapp=/solr path=/select params={df=text&distrib=false&_stateVer_=dv_coll:4&group.limit=100&shards.purpose=64&shard.url=https://127.0.0.1:46819/solr/dv_coll_shard3_replica_n1/&rows=100&version=2&q=*:*&NOW=1499609396093&ids=26,39,18,2,3,6,7,9,10010,10035,10045,10025,30,31&isShard=true&wt=javabin&group.field=intGSF} status=0 QTime=0
   [junit4]   2> 291763 INFO  (qtp2102283932-3350) [    ] o.a.s.c.S.Request [dv_coll_shard2_replica_n1]  webapp=/solr path=/select params={df=text&distrib=false&_stateVer_=dv_coll:4&group.limit=100&shards.purpose=64&shard.url=https://127.0.0.1:45993/solr/dv_coll_shard2_replica_n1/&rows=100&version=2&q=*:*&NOW=1499609396093&ids=22,44,12,34,35,46,36,47,15,16,0,4,41,20,10005,43&isShard=true&wt=javabin&group.field=intGSF} status=0 QTime=0
   [junit4]   2> 291762 INFO  (qtp2102283932-3348) [    ] o.a.s.c.S.Request [dv_coll_shard4_replica_n1]  webapp=/solr path=/select params={df=text&distrib=false&_stateVer_=dv_coll:4&group.limit=100&shards.purpose=64&shard.url=https://127.0.0.1:45993/solr/dv_coll_shard4_replica_n1/&rows=100&version=2&q=*:*&NOW=1499609396093&ids=33,23,45,25,10040,37,17,10030,29,19,5,10000,21&isShard=true&wt=javabin&group.field=intGSF} status=0 QTime=0
   [junit4]   2> 291769 INFO  (qtp2102283932-3346) [    ] o.a.s.c.S.Request [dv_coll_shard4_replica_n1]  webapp=/solr path=/select params={q=*:*&_stateVer_=dv_coll:4&group.limit=100&rows=100&wt=javabin&version=2&group.field=intGSF&group=true} status=0 QTime=73
   [junit4]   2> 291771 INFO  (TEST-DocValuesNotIndexedTest.testGroupingDVOnly-seed#[5C576950CF96A9B6]) [    ] o.a.s.SolrTestCaseJ4 ###Ending testGroupingDVOnly
   [junit4]   2> NOTE: reproduce with: ant test  -Dtestcase=DocValuesNotIndexedTest -Dtests.method=testGroupingDVOnly -Dtests.seed=5C576950CF96A9B6 -Dtests.multiplier=3 -Dtests.slow=true -Dtests.locale=se-FI -Dtests.timezone=Asia/Makassar -Dtests.asserts=true -Dtests.file.encoding=ISO-8859-1
   [junit4] FAILURE 0.26s J1 | DocValuesNotIndexedTest.testGroupingDVOnly <<<
   [junit4]    > Throwable #1: java.lang.AssertionError: Unexpected number of elements in the group for intGSF: 6
   [junit4]    > 	at __randomizedtesting.SeedInfo.seed([5C576950CF96A9B6:C7EC070882CE9BE8]:0)
   [junit4]    > 	at org.apache.solr.cloud.DocValuesNotIndexedTest.testGroupingDVOnly(DocValuesNotIndexedTest.java:376)
   [junit4]    > 	at java.base/jdk.internal.reflect.NativeMethodAccessorImpl.invoke0(Native Method)
   [junit4]    > 	at java.base/jdk.internal.reflect.NativeMethodAccessorImpl.invoke(NativeMethodAccessorImpl.java:62)
   [junit4]    > 	at java.base/jdk.internal.reflect.DelegatingMethodAccessorImpl.invoke(DelegatingMethodAccessorImpl.java:43)
   [junit4]    > 	at java.base/java.lang.reflect.Method.invoke(Method.java:564)
   [junit4]    > 	at java.base/java.lang.Thread.run(Thread.java:844)
   [junit4]   2> 291799 INFO  (TEST-DocValuesNotIndexedTest.testGroupingDocAbsent-seed#[5C576950CF96A9B6]) [    ] o.a.s.SolrTestCaseJ4 ###Starting testGroupingDocAbsent
   [junit4]   2> 291801 INFO  (qtp2102283932-3352) [    ] o.a.s.s.SolrIndexSearcher Opening [Searcher@7ac63f8c[dv_coll_shard2_replica_n1] realtime]
   [junit4]   2> 291803 INFO  (qtp639735455-3343) [    ] o.a.s.s.SolrIndexSearcher Opening [Searcher@49f4d904[dv_coll_shard1_replica_n1] realtime]
   [junit4]   2> 291804 INFO  (qtp639735455-3398) [    ] o.a.s.s.SolrIndexSearcher Opening [Searcher@72968ea6[dv_coll_shard3_replica_n1] realtime]
   [junit4]   2> 291808 INFO  (qtp2102283932-3351) [    ] o.a.s.s.SolrIndexSearcher Opening [Searcher@2478325e[dv_coll_shard4_replica_n1] realtime]
   [junit4]   2> 291809 INFO  (qtp2102283932-3351) [    ] o.a.s.u.p.LogUpdateProcessorFactory [dv_coll_shard4_replica_n1]  webapp=/solr path=/update params={update.distrib=TOLEADER&distrib.from=https://127.0.0.1:46819/solr/dv_coll_shard3_replica_n1/&wt=javabin&version=2}{deleteByQuery=*:* (-1572454422227714048)} 0 8
   [junit4]   2> 291809 INFO  (qtp2102283932-3352) [    ] o.a.s.u.p.LogUpdateProcessorFactory [dv_coll_shard2_replica_n1]  webapp=/solr path=/update params={update.distrib=TOLEADER&distrib.from=https://127.0.0.1:46819/solr/dv_coll_shard3_replica_n1/&wt=javabin&version=2}{deleteByQuery=*:* (-1572454422226665472)} 0 9
   [junit4]   2> 291810 INFO  (qtp639735455-3343) [    ] o.a.s.s.SolrIndexSearcher Opening [Searcher@4f8aab8d[dv_coll_shard1_replica_n1] realtime]
   [junit4]   2> 291811 INFO  (qtp639735455-3343) [    ] o.a.s.u.p.LogUpdateProcessorFactory [dv_coll_shard1_replica_n1]  webapp=/solr path=/update params={update.distrib=TOLEADER&distrib.from=https://127.0.0.1:46819/solr/dv_coll_shard3_replica_n1/&wt=javabin&version=2}{deleteByQuery=*:* (-1572454422226665472)} 0 10
   [junit4]   2> 291811 INFO  (qtp639735455-3398) [    ] o.a.s.u.p.LogUpdateProcessorFactory [dv_coll_shard3_replica_n1]  webapp=/solr path=/update params={wt=javabin&version=2}{deleteByQuery=*:* (-1572454422226665472)} 0 11
   [junit4]   2> 291815 INFO  (qtp2102283932-3347) [    ] o.a.s.u.DirectUpdateHandler2 start commit{_version_=1572454422242394112,optimize=false,openSearcher=true,waitSearcher=true,expungeDeletes=false,softCommit=false,prepareCommit=false}
   [junit4]   2> 291815 INFO  (qtp2102283932-3347) [    ] o.a.s.u.SolrIndexWriter Calling setCommitData with IW:org.apache.solr.update.SolrIndexWriter@bc641b8 commitCommandVersion:1572454422242394112
   [junit4]   2> 291815 INFO  (qtp639735455-3399) [    ] o.a.s.u.DirectUpdateHandler2 start commit{_version_=1572454422242394112,optimize=false,openSearcher=true,waitSearcher=true,expungeDeletes=false,softCommit=false,prepareCommit=false}
   [junit4]   2> 291815 INFO  (qtp2102283932-3336) [    ] o.a.s.u.DirectUpdateHandler2 start commit{_version_=1572454422242394112,optimize=false,openSearcher=true,waitSearcher=true,expungeDeletes=false,softCommit=false,prepareCommit=false}
   [junit4]   2> 291816 INFO  (qtp639735455-3399) [    ] o.a.s.u.SolrIndexWriter Calling setCommitData with IW:org.apache.solr.update.SolrIndexWriter@4f2dd508 commitCommandVersion:1572454422242394112
   [junit4]   2> 291816 INFO  (qtp2102283932-3336) [    ] o.a.s.u.SolrIndexWriter Calling setCommitData with IW:org.apache.solr.update.SolrIndexWriter@292bc4c9 commitCommandVersion:1572454422242394112
   [junit4]   2> 291816 INFO  (qtp639735455-3344) [    ] o.a.s.u.DirectUpdateHandler2 start commit{_version_=1572454422243442688,optimize=false,openSearcher=true,waitSearcher=true,expungeDeletes=false,softCommit=false,prepareCommit=false}
   [junit4]   2> 291816 INFO  (qtp639735455-3344) [    ] o.a.s.u.SolrIndexWriter Calling setCommitData with IW:org.apache.solr.update.SolrIndexWriter@1caec20b commitCommandVersion:1572454422243442688
   [junit4]   2> 291816 INFO  (qtp639735455-3344) [    ] o.a.s.s.SolrIndexSearcher Opening [Searcher@73e25a06[dv_coll_shard1_replica_n1] main]
   [junit4]   2> 291816 INFO  (qtp2102283932-3336) [    ] o.a.s.s.SolrIndexSearcher Opening [Searcher@d6a2386[dv_coll_shard4_replica_n1] main]
   [junit4]   2> 291817 INFO  (qtp639735455-3399) [    ] o.a.s.s.SolrIndexSearcher Opening [Searcher@1b6e2934[dv_coll_shard3_replica_n1] main]
   [junit4]   2> 291817 INFO  (qtp639735455-3344) [    ] o.a.s.u.DirectUpdateHandler2 end_commit_flush
   [junit4]   2> 291817 INFO  (qtp2102283932-3336) [    ] o.a.s.u.DirectUpdateHandler2 end_commit_flush
   [junit4]   2> 291818 INFO  (qtp639735455-3399) [    ] o.a.s.u.DirectUpdateHandler2 end_commit_flush
   [junit4]   2> 291818 INFO  (qtp2102283932-3347) [    ] o.a.s.s.SolrIndexSearcher Opening [Searcher@25078ec6[dv_coll_shard2_replica_n1] main]
   [junit4]   2> 291819 INFO  (searcherExecutor-1158-thread-1) [    ] o.a.s.c.SolrCore [dv_coll_shard1_replica_n1] Registered new searcher Searcher@73e25a06[dv_coll_shard1_replica_n1] main{ExitableDirectoryReader(UninvertingDirectoryReader())}
   [junit4]   2> 291819 INFO  (searcherExecutor-1130-thread-1) [    ] o.a.s.c.SolrCore [dv_coll_shard4_replica_n1] Registered new searcher Searcher@d6a2386[dv_coll_shard4_replica_n1] main{ExitableDirectoryReader(UninvertingDirectoryReader())}
   [junit4]   2> 291819 INFO  (qtp2102283932-3336) [    ] o.a.s.u.p.LogUpdateProcessorFactory [dv_coll_shard4_replica_n1]  webapp=/solr path=/update params={update.distrib=FROMLEADER&waitSearcher=true&openSearcher=true&commit=true&softCommit=false&distrib.from=https://127.0.0.1:45993/solr/dv_coll_shard2_replica_n1/&commit_end_point=true&wt=javabin&version=2&expungeDeletes=false}{commit=} 0 3
   [junit4]   2> 291819 INFO  (qtp639735455-3344) [    ] o.a.s.u.p.LogUpdateProcessorFactory [dv_coll_shard1_replica_n1]  webapp=/solr path=/update params={update.distrib=FROMLEADER&waitSearcher=true&openSearcher=true&commit=true&softCommit=false&distrib.from=https://127.0.0.1:45993/solr/dv_coll_shard2_replica_n1/&commit_end_point=true&wt=javabin&version=2&expungeDeletes=false}{commit=} 0 2
   [junit4]   2> 291819 INFO  (searcherExecutor-1131-thread-1) [    ] o.a.s.c.SolrCore [dv_coll_shard3_replica_n1] Registered new searcher Searcher@1b6e2934[dv_coll_shard3_replica_n1] main{ExitableDirectoryReader(UninvertingDirectoryReader())}
   [junit4]   2> 291821 INFO  (searcherExecutor-1149-thread-1) [    ] o.a.s.c.SolrCore [dv_coll_shard2_replica_n1] Registered new searcher Searcher@25078ec6[dv_coll_shard2_replica_n1] main{ExitableDirectoryReader(UninvertingDirectoryReader())}
   [junit4]   2> 291820 INFO  (qtp2102283932-3347) [    ] o.a.s.u.DirectUpdateHandler2 end_commit_flush
   [junit4]   2> 291821 INFO  (qtp2102283932-3347) [    ] o.a.s.u.p.LogUpdateProcessorFactory [dv_coll_shard2_replica_n1]  webapp=/solr path=/update params={update.distrib=FROMLEADER&waitSearcher=true&openSearcher=true&commit=true&softCommit=false&distrib.from=https://127.0.0.1:45993/solr/dv_coll_shard2_replica_n1/&commit_end_point=true&wt=javabin&version=2&expungeDeletes=false}{commit=} 0 6
   [junit4]   2> 291821 INFO  (qtp639735455-3399) [    ] o.a.s.u.p.LogUpdateProcessorFactory [dv_coll_shard3_replica_n1]  webapp=/solr path=/update params={update.distrib=FROMLEADER&waitSearcher=true&openSearcher=true&commit=true&softCommit=false&distrib.from=https://127.0.0.1:45993/solr/dv_coll_shard2_replica_n1/&commit_end_point=true&wt=javabin&version=2&expungeDeletes=false}{commit=} 0 5
   [junit4]   2> 291821 INFO  (qtp2102283932-3350) [    ] o.a.s.u.p.LogUpdateProcessorFactory [dv_coll_shard2_replica_n1]  webapp=/solr path=/update params={_stateVer_=dv_coll:4&waitSearcher=true&commit=true&softCommit=false&wt=javabin&version=2}{commit=} 0 8
   [junit4]   2> 291825 INFO  (qtp639735455-3338) [    ] o.a.s.u.p.LogUpdateProcessorFactory [dv_coll_shard3_replica_n1]  webapp=/solr path=/update params={_stateVer_=dv_coll:4&wt=javabin&version=2}{add=[2 (1572454422250782720), 3 (1572454422252879872)]} 0 2
   [junit4]   2> 291826 INFO  (qtp2102283932-3346) [    ] o.a.s.u.p.LogUpdateProcessorFactory [dv_coll_shard2_replica_n1]  webapp=/solr path=/update params={_stateVer_=dv_coll:4&wt=javabin&version=2}{add=[4 (1572454422250782720)]} 0 3
   [junit4]   2> 291827 INFO  (qtp639735455-3337) [    ] o.a.s.u.p.LogUpdateProcessorFactory [dv_coll_shard1_replica_n1]  webapp=/solr path=/update params={_stateVer_=dv_coll:4&wt=javabin&version=2}{add=[1 (1572454422250782720)]} 0 4
   [junit4]   2> 291829 INFO  (qtp2102283932-3351) [    ] o.a.s.u.DirectUpdateHandler2 start commit{_version_=1572454422257074176,optimize=false,openSearcher=true,waitSearcher=true,expungeDeletes=false,softCommit=false,prepareCommit=false}
   [junit4]   2> 291829 INFO  (qtp2102283932-3351) [    ] o.a.s.u.SolrIndexWriter Calling setCommitData with IW:org.apache.solr.update.SolrIndexWriter@bc641b8 commitCommandVersion:1572454422257074176
   [junit4]   2> 291829 INFO  (qtp639735455-3339) [    ] o.a.s.u.DirectUpdateHandler2 start commit{_version_=1572454422257074176,optimize=false,openSearcher=true,waitSearcher=true,expungeDeletes=false,softCommit=false,prepareCommit=false}
   [junit4]   2> 291829 INFO  (qtp639735455-3339) [    ] o.a.s.u.SolrIndexWriter Calling setCommitData with IW:org.apache.solr.update.SolrIndexWriter@4f2dd508 commitCommandVersion:1572454422257074176
   [junit4]   2> 291829 INFO  (qtp639735455-3400) [    ] o.a.s.u.DirectUpdateHandler2 start commit{_version_=1572454422257074176,optimize=false,openSearcher=true,waitSearcher=true,expungeDeletes=false,softCommit=false,prepareCommit=false}
   [junit4]   2> 291829 INFO  (qtp2102283932-3348) [    ] o.a.s.u.DirectUpdateHandler2 start commit{_version_=1572454422257074176,optimize=false,openSearcher=true,waitSearcher=true,expungeDeletes=false,softCommit=false,prepareCommit=false}
   [junit4]   2> 291829 INFO  (qtp2102283932-3348) [    ] o.a.s.u.DirectUpdateHandler2 No uncommitted changes. Skipping IW.commit.
   [junit4]   2> 291829 INFO  (qtp2102283932-3348) [    ] o.a.s.u.DirectUpdateHandler2 end_commit_flush
   [junit4]   2> 291829 INFO  (qtp2102283932-3348) [    ] o.a.s.u.p.LogUpdateProcessorFactory [dv_coll_shard4_replica_n1]  webapp=/solr path=/update params={update.distrib=FROMLEADER&waitSearcher=true&openSearcher=true&commit=true&softCommit=false&distrib.from=https://127.0.0.1:45993/solr/dv_coll_shard2_replica_n1/&commit_end_point=true&wt=javabin&version=2&expungeDeletes=false}{commit=} 0 0
   [junit4]   2> 291830 INFO  (qtp639735455-3400) [    ] o.a.s.u.SolrIndexWriter Calling setCommitData with IW:org.apache.solr.update.SolrIndexWriter@1caec20b commitCommandVersion:1572454422257074176
   [junit4]   2> 291833 INFO  (qtp639735455-3400) [    ] o.a.s.s.SolrIndexSearcher Opening [Searcher@2d43995b[dv_coll_shard1_replica_n1] main]
   [junit4]   2> 291834 INFO  (qtp639735455-3400) [    ] o.a.s.u.DirectUpdateHandler2 end_commit_flush
   [junit4]   2> 291836 INFO  (searcherExecutor-1158-thread-1) [    ] o.a.s.c.SolrCore [dv_coll_shard1_replica_n1] Registered new searcher Searcher@2d43995b[dv_coll_shard1_replica_n1] main{ExitableDirectoryReader(UninvertingDirectoryReader(Uninverting(_3(7.1.0):C1)))}
   [junit4]   2> 291837 INFO  (qtp639735455-3400) [    ] o.a.s.u.p.LogUpdateProcessorFactory [dv_coll_shard1_replica_n1]  webapp=/solr path=/update params={update.distrib=FROMLEADER&waitSearcher=true&openSearcher=true&commit=true&softCommit=false&distrib.from=https://127.0.0.1:45993/solr/dv_coll_shard2_replica_n1/&commit_end_point=true&wt=javabin&version=2&expungeDeletes=false}{commit=} 0 8
   [junit4]   2> 291839 INFO  (qtp2102283932-3351) [    ] o.a.s.s.SolrIndexSearcher Opening [Searcher@3e4606af[dv_coll_shard2_replica_n1] main]
   [junit4]   2> 291840 INFO  (qtp639735455-3339) [    ] o.a.s.s.SolrIndexSearcher Opening [Searcher@567d3dca[dv_coll_shard3_replica_n1] main]
   [junit4]   2> 291841 INFO  (searcherExecutor-1149-thread-1) [    ] o.a.s.c.SolrCore [dv_coll_shard2_replica_n1] Registered new searcher Searcher@3e4606af[dv_coll_shard2_replica_n1] main{ExitableDirectoryReader(UninvertingDirectoryReader(Uninverting(_1(7.1.0):C1)))}
   [junit4]   2> 291842 INFO  (searcherExecutor-1131-thread-1) [    ] o.a.s.c.SolrCore [dv_coll_shard3_replica_n1] Registered new searcher Searcher@567d3dca[dv_coll_shard3_replica_n1] main{ExitableDirectoryReader(UninvertingDirectoryReader(Uninverting(_1(7.1.0):C2)))}
   [junit4]   2> 291844 INFO  (qtp2102283932-3351) [    ] o.a.s.u.DirectUpdateHa

[...truncated too long message...]

=160&facet=true} hits=1 status=0 QTime=7
   [junit4]   2> 292259 INFO  (qtp639735455-3338) [    ] o.a.s.c.S.Request [dv_coll_shard3_replica_n1]  webapp=/solr path=/select params={q=*:*&facet.field=intField&facet.field=longField&facet.field=doubleField&facet.field=floatField&facet.field=dateField&facet.field=stringField&facet.field=boolField&facet.field=intFieldMulti&facet.field=longFieldMulti&facet.field=doubleFieldMulti&facet.field=floatFieldMulti&facet.field=dateFieldMulti&facet.field=stringFieldMulti&facet.field=boolFieldMulti&_stateVer_=dv_coll:4&rows=0&facet=true&wt=javabin&version=2} hits=1 status=0 QTime=12
   [junit4]   2> 292261 INFO  (TEST-DocValuesNotIndexedTest.testDistribFaceting-seed#[5C576950CF96A9B6]) [    ] o.a.s.SolrTestCaseJ4 ###Ending testDistribFaceting
   [junit4]   2> 292277 INFO  (jetty-closer-388-thread-1) [    ] o.e.j.s.AbstractConnector Stopped ServerConnector@39928fc8{SSL,[ssl, http/1.1]}{127.0.0.1:0}
   [junit4]   2> 292299 INFO  (jetty-closer-388-thread-1) [    ] o.a.s.c.CoreContainer Shutting down CoreContainer instance=2079383362
   [junit4]   2> 292299 INFO  (jetty-closer-388-thread-1) [    ] o.a.s.m.SolrMetricManager Closing metric reporters for registry=solr.node, tag=null
   [junit4]   2> 292301 INFO  (jetty-closer-388-thread-1) [    ] o.a.s.m.SolrMetricManager Closing metric reporters for registry=solr.jvm, tag=null
   [junit4]   2> 292303 INFO  (jetty-closer-388-thread-1) [    ] o.a.s.m.SolrMetricManager Closing metric reporters for registry=solr.jetty, tag=null
   [junit4]   2> 292305 INFO  (jetty-closer-388-thread-1) [    ] o.a.s.m.SolrMetricManager Closing metric reporters for registry=solr.cluster, tag=null
   [junit4]   2> 292305 INFO  (jetty-closer-388-thread-2) [    ] o.e.j.s.AbstractConnector Stopped ServerConnector@48c91bc2{SSL,[ssl, http/1.1]}{127.0.0.1:0}
   [junit4]   2> 292305 INFO  (jetty-closer-388-thread-2) [    ] o.a.s.c.CoreContainer Shutting down CoreContainer instance=306910565
   [junit4]   2> 292305 INFO  (jetty-closer-388-thread-2) [    ] o.a.s.m.SolrMetricManager Closing metric reporters for registry=solr.node, tag=null
   [junit4]   2> 292308 INFO  (jetty-closer-388-thread-2) [    ] o.a.s.m.SolrMetricManager Closing metric reporters for registry=solr.jvm, tag=null
   [junit4]   2> 292309 INFO  (jetty-closer-388-thread-2) [    ] o.a.s.m.SolrMetricManager Closing metric reporters for registry=solr.jetty, tag=null
   [junit4]   2> 292310 INFO  (jetty-closer-388-thread-2) [    ] o.a.s.m.SolrMetricManager Closing metric reporters for registry=solr.cluster, tag=null
   [junit4]   2> 292323 INFO  (coreCloseExecutor-1162-thread-1) [    ] o.a.s.c.SolrCore [dv_coll_shard4_replica_n1]  CLOSING SolrCore org.apache.solr.core.SolrCore@34215022
   [junit4]   2> 292323 INFO  (coreCloseExecutor-1163-thread-1) [    ] o.a.s.c.SolrCore [dv_coll_shard1_replica_n1]  CLOSING SolrCore org.apache.solr.core.SolrCore@253ee676
   [junit4]   2> 292324 INFO  (coreCloseExecutor-1163-thread-2) [    ] o.a.s.c.SolrCore [dv_coll_shard3_replica_n1]  CLOSING SolrCore org.apache.solr.core.SolrCore@407b8fc8
   [junit4]   2> 292324 INFO  (coreCloseExecutor-1163-thread-1) [    ] o.a.s.m.SolrMetricManager Closing metric reporters for registry=solr.core.dv_coll.shard1.replica_n1, tag=624879222
   [junit4]   2> 292325 INFO  (coreCloseExecutor-1162-thread-2) [    ] o.a.s.c.SolrCore [dv_coll_shard2_replica_n1]  CLOSING SolrCore org.apache.solr.core.SolrCore@7ae78c16
   [junit4]   2> 292325 INFO  (coreCloseExecutor-1163-thread-1) [    ] o.a.s.m.SolrMetricManager Closing metric reporters for registry=solr.collection.dv_coll.shard1.leader, tag=624879222
   [junit4]   2> 292326 INFO  (coreCloseExecutor-1163-thread-2) [    ] o.a.s.m.SolrMetricManager Closing metric reporters for registry=solr.core.dv_coll.shard3.replica_n1, tag=1081839560
   [junit4]   2> 292327 INFO  (coreCloseExecutor-1162-thread-1) [    ] o.a.s.m.SolrMetricManager Closing metric reporters for registry=solr.core.dv_coll.shard4.replica_n1, tag=874598434
   [junit4]   2> 292353 INFO  (coreCloseExecutor-1163-thread-2) [    ] o.a.s.m.SolrMetricManager Closing metric reporters for registry=solr.collection.dv_coll.shard3.leader, tag=1081839560
   [junit4]   2> 292354 INFO  (coreCloseExecutor-1162-thread-1) [    ] o.a.s.m.SolrMetricManager Closing metric reporters for registry=solr.collection.dv_coll.shard4.leader, tag=874598434
   [junit4]   2> 292371 INFO  (coreCloseExecutor-1162-thread-2) [    ] o.a.s.m.SolrMetricManager Closing metric reporters for registry=solr.core.dv_coll.shard2.replica_n1, tag=2061995030
   [junit4]   2> 292372 INFO  (coreCloseExecutor-1162-thread-2) [    ] o.a.s.m.SolrMetricManager Closing metric reporters for registry=solr.collection.dv_coll.shard2.leader, tag=2061995030
   [junit4]   2> 292374 INFO  (jetty-closer-388-thread-1) [    ] o.a.s.c.Overseer Overseer (id=98278401160380422-127.0.0.1:45993_solr-n_0000000000) closing
   [junit4]   2> 292374 INFO  (OverseerStateUpdate-98278401160380422-127.0.0.1:45993_solr-n_0000000000) [    ] o.a.s.c.Overseer Overseer Loop exiting : 127.0.0.1:45993_solr
   [junit4]   2> 292393 INFO  (zkCallback-399-thread-1) [    ] o.a.s.c.c.ZkStateReader Updated live nodes from ZooKeeper... (2) -> (1)
   [junit4]   2> 292394 INFO  (jetty-closer-388-thread-1) [    ] o.e.j.s.h.ContextHandler Stopped o.e.j.s.ServletContextHandler@2c96e096{/solr,null,UNAVAILABLE}
   [junit4]   2> 293893 WARN  (zkCallback-398-thread-1) [    ] o.a.s.c.c.ZkStateReader ZooKeeper watch triggered, but Solr cannot talk to ZK: [KeeperErrorCode = Session expired for /live_nodes]
   [junit4]   2> 293893 INFO  (jetty-closer-388-thread-2) [    ] o.e.j.s.h.ContextHandler Stopped o.e.j.s.ServletContextHandler@568c1687{/solr,null,UNAVAILABLE}
   [junit4]   2> 293893 ERROR (SUITE-DocValuesNotIndexedTest-seed#[5C576950CF96A9B6]-worker) [    ] o.a.z.s.ZooKeeperServer ZKShutdownHandler is not registered, so ZooKeeper server won't take any action on ERROR or SHUTDOWN server state changes
   [junit4]   2> 293894 INFO  (SUITE-DocValuesNotIndexedTest-seed#[5C576950CF96A9B6]-worker) [    ] o.a.s.c.ZkTestServer connecting to 127.0.0.1:46323 46323
   [junit4]   2> 293931 INFO  (Thread-1157) [    ] o.a.s.c.ZkTestServer connecting to 127.0.0.1:46323 46323
   [junit4]   2> 293931 WARN  (Thread-1157) [    ] o.a.s.c.ZkTestServer Watch limit violations: 
   [junit4]   2> Maximum concurrent create/delete watches above limit:
   [junit4]   2> 
   [junit4]   2> 	7	/solr/configs/conf1/managed-schema
   [junit4]   2> 	4	/solr/configs/conf1
   [junit4]   2> 	3	/solr/aliases.json
   [junit4]   2> 	2	/solr/security.json
   [junit4]   2> 
   [junit4]   2> Maximum concurrent data watches above limit:
   [junit4]   2> 
   [junit4]   2> 	6	/solr/collections/dv_coll/state.json
   [junit4]   2> 	3	/solr/clusterstate.json
   [junit4]   2> 	3	/solr/clusterprops.json
   [junit4]   2> 	2	/solr/configs/conf1/managed-schema
   [junit4]   2> 
   [junit4]   2> Maximum concurrent children watches above limit:
   [junit4]   2> 
   [junit4]   2> 	3	/solr/live_nodes
   [junit4]   2> 	3	/solr/collections
   [junit4]   2> 
   [junit4]   2> NOTE: leaving temporary files on disk at: /home/jenkins/workspace/Lucene-Solr-7.x-Linux/solr/build/solr-core/test/J1/temp/solr.cloud.DocValuesNotIndexedTest_5C576950CF96A9B6-001
   [junit4]   2> Jul 09, 2017 2:09:58 PM com.carrotsearch.randomizedtesting.ThreadLeakControl checkThreadLeaks
   [junit4]   2> WARNING: Will linger awaiting termination of 1 leaked thread(s).
   [junit4]   2> NOTE: test params are: codec=Asserting(Lucene70): {_version_=PostingsFormat(name=LuceneFixedGap), id=PostingsFormat(name=MockRandom)}, docValues:{floatField=DocValuesFormat(name=Memory), doubleField=DocValuesFormat(name=Asserting), intFieldMulti=DocValuesFormat(name=Memory), boolFieldMulti=DocValuesFormat(name=Asserting), floatGSL=DocValuesFormat(name=Direct), longFieldMulti=DocValuesFormat(name=Lucene70), intField=DocValuesFormat(name=Asserting), boolField=DocValuesFormat(name=Direct), stringFieldMulti=DocValuesFormat(name=Direct), dateFieldMulti=DocValuesFormat(name=Lucene70), longGSF=DocValuesFormat(name=Memory), doubleFieldMulti=DocValuesFormat(name=Direct), stringGSL=DocValuesFormat(name=Lucene70), doubleGSF=DocValuesFormat(name=Asserting), doubleGSL=DocValuesFormat(name=Lucene70), stringGSF=DocValuesFormat(name=Asserting), intGSL=DocValuesFormat(name=Asserting), longField=DocValuesFormat(name=Memory), dateField=DocValuesFormat(name=Direct), dateGSF=DocValuesFormat(name=Direct), boolGSF=DocValuesFormat(name=Direct), longGSL=DocValuesFormat(name=Direct), boolGSL=DocValuesFormat(name=Memory), floatFieldMulti=DocValuesFormat(name=Asserting), floatGSF=DocValuesFormat(name=Memory), dateGSL=DocValuesFormat(name=Memory), intGSF=DocValuesFormat(name=Lucene70), stringField=DocValuesFormat(name=Asserting)}, maxPointsInLeafNode=1148, maxMBSortInHeap=7.4373901180387465, sim=RandomSimilarity(queryNorm=false): {}, locale=se-FI, timezone=Asia/Makassar
   [junit4]   2> NOTE: Linux 4.10.0-21-generic amd64/Oracle Corporation 9 (64-bit)/cpus=8,threads=1,free=269854856,total=536870912
   [junit4]   2> NOTE: All tests run in this JVM: [StatelessScriptUpdateProcessorFactoryTest, TestSearcherReuse, TestHashPartitioner, TestSystemIdResolver, TestSimpleTrackingShardHandler, TestQueryWrapperFilter, TestEmbeddedSolrServerSchemaAPI, MultiThreadedOCPTest, CacheHeaderTest, TestDelegationWithHadoopAuth, ChaosMonkeySafeLeaderTest, DistributedIntervalFacetingTest, FullHLLTest, TestHdfsBackupRestoreCore, LeaderElectionContextKeyTest, UtilsToolTest, LoggingHandlerTest, TestNamedUpdateProcessors, UninvertDocValuesMergePolicyTest, QueryResultKeyTest, DistributedMLTComponentTest, TestPivotHelperCode, TestFiltering, TestSolrCloudSnapshots, JSONWriterTest, StressHdfsTest, TestNonDefinedSimilarityFactory, TermVectorComponentTest, TestRTimerTree, DocValuesNotIndexedTest]
   [junit4] Completed [98/727 (1!)] on J1 in 6.45s, 4 tests, 1 failure <<< FAILURES!

[...truncated 38656 lines...]

[JENKINS-EA] Lucene-Solr-7.x-Linux (64bit/jdk-9-ea+175) - Build # 44 - Still Unstable!

Posted by Policeman Jenkins Server <je...@thetaphi.de>.
Build: https://jenkins.thetaphi.de/job/Lucene-Solr-7.x-Linux/44/
Java: 64bit/jdk-9-ea+175 -XX:+UseCompressedOops -XX:+UseConcMarkSweepGC --illegal-access=deny

1 tests failed.
FAILED:  org.apache.solr.handler.TestSQLHandler.doTest

Error Message:


Stack Trace:
java.lang.AssertionError
	at __randomizedtesting.SeedInfo.seed([3F0677B4D21C37A1:9842CF10BFA72418]:0)
	at org.apache.solr.handler.TestSQLHandler.testBasicSelect(TestSQLHandler.java:186)
	at org.apache.solr.handler.TestSQLHandler.doTest(TestSQLHandler.java:87)
	at java.base/jdk.internal.reflect.NativeMethodAccessorImpl.invoke0(Native Method)
	at java.base/jdk.internal.reflect.NativeMethodAccessorImpl.invoke(NativeMethodAccessorImpl.java:62)
	at java.base/jdk.internal.reflect.DelegatingMethodAccessorImpl.invoke(DelegatingMethodAccessorImpl.java:43)
	at java.base/java.lang.reflect.Method.invoke(Method.java:564)
	at com.carrotsearch.randomizedtesting.RandomizedRunner.invoke(RandomizedRunner.java:1713)
	at com.carrotsearch.randomizedtesting.RandomizedRunner$8.evaluate(RandomizedRunner.java:907)
	at com.carrotsearch.randomizedtesting.RandomizedRunner$9.evaluate(RandomizedRunner.java:943)
	at com.carrotsearch.randomizedtesting.RandomizedRunner$10.evaluate(RandomizedRunner.java:957)
	at org.apache.solr.BaseDistributedSearchTestCase$ShardsRepeatRule$ShardsFixedStatement.callStatement(BaseDistributedSearchTestCase.java:985)
	at org.apache.solr.BaseDistributedSearchTestCase$ShardsRepeatRule$ShardsStatement.evaluate(BaseDistributedSearchTestCase.java:960)
	at com.carrotsearch.randomizedtesting.rules.SystemPropertiesRestoreRule$1.evaluate(SystemPropertiesRestoreRule.java:57)
	at org.apache.lucene.util.TestRuleSetupTeardownChained$1.evaluate(TestRuleSetupTeardownChained.java:49)
	at org.apache.lucene.util.AbstractBeforeAfterRule$1.evaluate(AbstractBeforeAfterRule.java:45)
	at org.apache.lucene.util.TestRuleThreadAndTestName$1.evaluate(TestRuleThreadAndTestName.java:48)
	at org.apache.lucene.util.TestRuleIgnoreAfterMaxFailures$1.evaluate(TestRuleIgnoreAfterMaxFailures.java:64)
	at org.apache.lucene.util.TestRuleMarkFailure$1.evaluate(TestRuleMarkFailure.java:47)
	at com.carrotsearch.randomizedtesting.rules.StatementAdapter.evaluate(StatementAdapter.java:36)
	at com.carrotsearch.randomizedtesting.ThreadLeakControl$StatementRunner.run(ThreadLeakControl.java:368)
	at com.carrotsearch.randomizedtesting.ThreadLeakControl.forkTimeoutingTask(ThreadLeakControl.java:817)
	at com.carrotsearch.randomizedtesting.ThreadLeakControl$3.evaluate(ThreadLeakControl.java:468)
	at com.carrotsearch.randomizedtesting.RandomizedRunner.runSingleTest(RandomizedRunner.java:916)
	at com.carrotsearch.randomizedtesting.RandomizedRunner$5.evaluate(RandomizedRunner.java:802)
	at com.carrotsearch.randomizedtesting.RandomizedRunner$6.evaluate(RandomizedRunner.java:852)
	at com.carrotsearch.randomizedtesting.RandomizedRunner$7.evaluate(RandomizedRunner.java:863)
	at com.carrotsearch.randomizedtesting.rules.StatementAdapter.evaluate(StatementAdapter.java:36)
	at com.carrotsearch.randomizedtesting.rules.SystemPropertiesRestoreRule$1.evaluate(SystemPropertiesRestoreRule.java:57)
	at org.apache.lucene.util.AbstractBeforeAfterRule$1.evaluate(AbstractBeforeAfterRule.java:45)
	at com.carrotsearch.randomizedtesting.rules.StatementAdapter.evaluate(StatementAdapter.java:36)
	at org.apache.lucene.util.TestRuleStoreClassName$1.evaluate(TestRuleStoreClassName.java:41)
	at com.carrotsearch.randomizedtesting.rules.NoShadowingOrOverridesOnMethodsRule$1.evaluate(NoShadowingOrOverridesOnMethodsRule.java:40)
	at com.carrotsearch.randomizedtesting.rules.NoShadowingOrOverridesOnMethodsRule$1.evaluate(NoShadowingOrOverridesOnMethodsRule.java:40)
	at com.carrotsearch.randomizedtesting.rules.StatementAdapter.evaluate(StatementAdapter.java:36)
	at com.carrotsearch.randomizedtesting.rules.StatementAdapter.evaluate(StatementAdapter.java:36)
	at org.apache.lucene.util.TestRuleAssertionsRequired$1.evaluate(TestRuleAssertionsRequired.java:53)
	at org.apache.lucene.util.TestRuleMarkFailure$1.evaluate(TestRuleMarkFailure.java:47)
	at org.apache.lucene.util.TestRuleIgnoreAfterMaxFailures$1.evaluate(TestRuleIgnoreAfterMaxFailures.java:64)
	at org.apache.lucene.util.TestRuleIgnoreTestSuites$1.evaluate(TestRuleIgnoreTestSuites.java:54)
	at com.carrotsearch.randomizedtesting.rules.StatementAdapter.evaluate(StatementAdapter.java:36)
	at com.carrotsearch.randomizedtesting.ThreadLeakControl$StatementRunner.run(ThreadLeakControl.java:368)
	at java.base/java.lang.Thread.run(Thread.java:844)




Build Log:
[...truncated 1690 lines...]
   [junit4] JVM J0: stderr was not empty, see: /home/jenkins/workspace/Lucene-Solr-7.x-Linux/lucene/build/core/test/temp/junit4-J0-20170709_163052_59911583826294380217917.syserr
   [junit4] >>> JVM J0 emitted unexpected output (verbatim) ----
   [junit4] Java HotSpot(TM) 64-Bit Server VM warning: Option UseConcMarkSweepGC was deprecated in version 9.0 and will likely be removed in a future release.
   [junit4] <<< JVM J0: EOF ----

[...truncated 5 lines...]
   [junit4] JVM J2: stderr was not empty, see: /home/jenkins/workspace/Lucene-Solr-7.x-Linux/lucene/build/core/test/temp/junit4-J2-20170709_163052_5991407945342449547033.syserr
   [junit4] >>> JVM J2 emitted unexpected output (verbatim) ----
   [junit4] Java HotSpot(TM) 64-Bit Server VM warning: Option UseConcMarkSweepGC was deprecated in version 9.0 and will likely be removed in a future release.
   [junit4] <<< JVM J2: EOF ----

[...truncated 9 lines...]
   [junit4] JVM J1: stderr was not empty, see: /home/jenkins/workspace/Lucene-Solr-7.x-Linux/lucene/build/core/test/temp/junit4-J1-20170709_163052_5981801529927009482802.syserr
   [junit4] >>> JVM J1 emitted unexpected output (verbatim) ----
   [junit4] Java HotSpot(TM) 64-Bit Server VM warning: Option UseConcMarkSweepGC was deprecated in version 9.0 and will likely be removed in a future release.
   [junit4] <<< JVM J1: EOF ----

[...truncated 288 lines...]
   [junit4] JVM J0: stderr was not empty, see: /home/jenkins/workspace/Lucene-Solr-7.x-Linux/lucene/build/test-framework/test/temp/junit4-J0-20170709_163745_89314120234204141750789.syserr
   [junit4] >>> JVM J0 emitted unexpected output (verbatim) ----
   [junit4] Java HotSpot(TM) 64-Bit Server VM warning: Option UseConcMarkSweepGC was deprecated in version 9.0 and will likely be removed in a future release.
   [junit4] <<< JVM J0: EOF ----

[...truncated 3 lines...]
   [junit4] JVM J2: stderr was not empty, see: /home/jenkins/workspace/Lucene-Solr-7.x-Linux/lucene/build/test-framework/test/temp/junit4-J2-20170709_163745_89310450158031587171154.syserr
   [junit4] >>> JVM J2 emitted unexpected output (verbatim) ----
   [junit4] Java HotSpot(TM) 64-Bit Server VM warning: Option UseConcMarkSweepGC was deprecated in version 9.0 and will likely be removed in a future release.
   [junit4] <<< JVM J2: EOF ----

[...truncated 3 lines...]
   [junit4] JVM J1: stderr was not empty, see: /home/jenkins/workspace/Lucene-Solr-7.x-Linux/lucene/build/test-framework/test/temp/junit4-J1-20170709_163745_89315614219913580560354.syserr
   [junit4] >>> JVM J1 emitted unexpected output (verbatim) ----
   [junit4] Java HotSpot(TM) 64-Bit Server VM warning: Option UseConcMarkSweepGC was deprecated in version 9.0 and will likely be removed in a future release.
   [junit4] <<< JVM J1: EOF ----

[...truncated 1054 lines...]
   [junit4] JVM J0: stderr was not empty, see: /home/jenkins/workspace/Lucene-Solr-7.x-Linux/lucene/build/analysis/common/test/temp/junit4-J0-20170709_163924_50811635140732071898794.syserr
   [junit4] >>> JVM J0 emitted unexpected output (verbatim) ----
   [junit4] Java HotSpot(TM) 64-Bit Server VM warning: Option UseConcMarkSweepGC was deprecated in version 9.0 and will likely be removed in a future release.
   [junit4] <<< JVM J0: EOF ----

   [junit4] JVM J2: stderr was not empty, see: /home/jenkins/workspace/Lucene-Solr-7.x-Linux/lucene/build/analysis/common/test/temp/junit4-J2-20170709_163924_51017393929295243920962.syserr
   [junit4] >>> JVM J2 emitted unexpected output (verbatim) ----
   [junit4] Java HotSpot(TM) 64-Bit Server VM warning: Option UseConcMarkSweepGC was deprecated in version 9.0 and will likely be removed in a future release.
   [junit4] <<< JVM J2: EOF ----

[...truncated 3 lines...]
   [junit4] JVM J1: stderr was not empty, see: /home/jenkins/workspace/Lucene-Solr-7.x-Linux/lucene/build/analysis/common/test/temp/junit4-J1-20170709_163924_50811770196862495493868.syserr
   [junit4] >>> JVM J1 emitted unexpected output (verbatim) ----
   [junit4] Java HotSpot(TM) 64-Bit Server VM warning: Option UseConcMarkSweepGC was deprecated in version 9.0 and will likely be removed in a future release.
   [junit4] <<< JVM J1: EOF ----

[...truncated 218 lines...]
   [junit4] JVM J2: stderr was not empty, see: /home/jenkins/workspace/Lucene-Solr-7.x-Linux/lucene/build/analysis/icu/test/temp/junit4-J2-20170709_164133_50111386872274223154766.syserr
   [junit4] >>> JVM J2 emitted unexpected output (verbatim) ----
   [junit4] Java HotSpot(TM) 64-Bit Server VM warning: Option UseConcMarkSweepGC was deprecated in version 9.0 and will likely be removed in a future release.
   [junit4] <<< JVM J2: EOF ----

   [junit4] JVM J0: stderr was not empty, see: /home/jenkins/workspace/Lucene-Solr-7.x-Linux/lucene/build/analysis/icu/test/temp/junit4-J0-20170709_164133_5015802846552663036944.syserr
   [junit4] >>> JVM J0 emitted unexpected output (verbatim) ----
   [junit4] Java HotSpot(TM) 64-Bit Server VM warning: Option UseConcMarkSweepGC was deprecated in version 9.0 and will likely be removed in a future release.
   [junit4] <<< JVM J0: EOF ----

[...truncated 3 lines...]
   [junit4] JVM J1: stderr was not empty, see: /home/jenkins/workspace/Lucene-Solr-7.x-Linux/lucene/build/analysis/icu/test/temp/junit4-J1-20170709_164133_50118140266882752987216.syserr
   [junit4] >>> JVM J1 emitted unexpected output (verbatim) ----
   [junit4] Java HotSpot(TM) 64-Bit Server VM warning: Option UseConcMarkSweepGC was deprecated in version 9.0 and will likely be removed in a future release.
   [junit4] <<< JVM J1: EOF ----

[...truncated 235 lines...]
   [junit4] JVM J2: stderr was not empty, see: /home/jenkins/workspace/Lucene-Solr-7.x-Linux/lucene/build/analysis/kuromoji/test/temp/junit4-J2-20170709_164146_2957321966191656677696.syserr
   [junit4] >>> JVM J2 emitted unexpected output (verbatim) ----
   [junit4] Java HotSpot(TM) 64-Bit Server VM warning: Option UseConcMarkSweepGC was deprecated in version 9.0 and will likely be removed in a future release.
   [junit4] <<< JVM J2: EOF ----

[...truncated 5 lines...]
   [junit4] JVM J0: stderr was not empty, see: /home/jenkins/workspace/Lucene-Solr-7.x-Linux/lucene/build/analysis/kuromoji/test/temp/junit4-J0-20170709_164146_2954949813588687397798.syserr
   [junit4] >>> JVM J0 emitted unexpected output (verbatim) ----
   [junit4] Java HotSpot(TM) 64-Bit Server VM warning: Option UseConcMarkSweepGC was deprecated in version 9.0 and will likely be removed in a future release.
   [junit4] <<< JVM J0: EOF ----

[...truncated 3 lines...]
   [junit4] JVM J1: stderr was not empty, see: /home/jenkins/workspace/Lucene-Solr-7.x-Linux/lucene/build/analysis/kuromoji/test/temp/junit4-J1-20170709_164146_29516112461389087518537.syserr
   [junit4] >>> JVM J1 emitted unexpected output (verbatim) ----
   [junit4] Java HotSpot(TM) 64-Bit Server VM warning: Option UseConcMarkSweepGC was deprecated in version 9.0 and will likely be removed in a future release.
   [junit4] <<< JVM J1: EOF ----

[...truncated 146 lines...]
   [junit4] JVM J1: stderr was not empty, see: /home/jenkins/workspace/Lucene-Solr-7.x-Linux/lucene/build/analysis/morfologik/test/temp/junit4-J1-20170709_164216_3191727097051772230251.syserr
   [junit4] >>> JVM J1 emitted unexpected output (verbatim) ----
   [junit4] Java HotSpot(TM) 64-Bit Server VM warning: Option UseConcMarkSweepGC was deprecated in version 9.0 and will likely be removed in a future release.
   [junit4] <<< JVM J1: EOF ----

[...truncated 3 lines...]
   [junit4] JVM J0: stderr was not empty, see: /home/jenkins/workspace/Lucene-Solr-7.x-Linux/lucene/build/analysis/morfologik/test/temp/junit4-J0-20170709_164216_3191852648807067386914.syserr
   [junit4] >>> JVM J0 emitted unexpected output (verbatim) ----
   [junit4] Java HotSpot(TM) 64-Bit Server VM warning: Option UseConcMarkSweepGC was deprecated in version 9.0 and will likely be removed in a future release.
   [junit4] <<< JVM J0: EOF ----

[...truncated 3 lines...]
   [junit4] JVM J2: stderr was not empty, see: /home/jenkins/workspace/Lucene-Solr-7.x-Linux/lucene/build/analysis/morfologik/test/temp/junit4-J2-20170709_164216_321548920801477945899.syserr
   [junit4] >>> JVM J2 emitted unexpected output (verbatim) ----
   [junit4] Java HotSpot(TM) 64-Bit Server VM warning: Option UseConcMarkSweepGC was deprecated in version 9.0 and will likely be removed in a future release.
   [junit4] <<< JVM J2: EOF ----

[...truncated 158 lines...]
   [junit4] JVM J2: stderr was not empty, see: /home/jenkins/workspace/Lucene-Solr-7.x-Linux/lucene/build/analysis/phonetic/test/temp/junit4-J2-20170709_164221_00211551738898148305901.syserr
   [junit4] >>> JVM J2 emitted unexpected output (verbatim) ----
   [junit4] Java HotSpot(TM) 64-Bit Server VM warning: Option UseConcMarkSweepGC was deprecated in version 9.0 and will likely be removed in a future release.
   [junit4] <<< JVM J2: EOF ----

[...truncated 3 lines...]
   [junit4] JVM J0: stderr was not empty, see: /home/jenkins/workspace/Lucene-Solr-7.x-Linux/lucene/build/analysis/phonetic/test/temp/junit4-J0-20170709_164220_99316721992357893940241.syserr
   [junit4] >>> JVM J0 emitted unexpected output (verbatim) ----
   [junit4] Java HotSpot(TM) 64-Bit Server VM warning: Option UseConcMarkSweepGC was deprecated in version 9.0 and will likely be removed in a future release.
   [junit4] <<< JVM J0: EOF ----

[...truncated 3 lines...]
   [junit4] JVM J1: stderr was not empty, see: /home/jenkins/workspace/Lucene-Solr-7.x-Linux/lucene/build/analysis/phonetic/test/temp/junit4-J1-20170709_164220_99313206995325574560816.syserr
   [junit4] >>> JVM J1 emitted unexpected output (verbatim) ----
   [junit4] Java HotSpot(TM) 64-Bit Server VM warning: Option UseConcMarkSweepGC was deprecated in version 9.0 and will likely be removed in a future release.
   [junit4] <<< JVM J1: EOF ----

[...truncated 145 lines...]
   [junit4] JVM J1: stderr was not empty, see: /home/jenkins/workspace/Lucene-Solr-7.x-Linux/lucene/build/analysis/smartcn/test/temp/junit4-J1-20170709_164232_60516399703782878309555.syserr
   [junit4] >>> JVM J1 emitted unexpected output (verbatim) ----
   [junit4] Java HotSpot(TM) 64-Bit Server VM warning: Option UseConcMarkSweepGC was deprecated in version 9.0 and will likely be removed in a future release.
   [junit4] <<< JVM J1: EOF ----

[...truncated 3 lines...]
   [junit4] JVM J0: stderr was not empty, see: /home/jenkins/workspace/Lucene-Solr-7.x-Linux/lucene/build/analysis/smartcn/test/temp/junit4-J0-20170709_164232_6048115880028353092537.syserr
   [junit4] >>> JVM J0 emitted unexpected output (verbatim) ----
   [junit4] Java HotSpot(TM) 64-Bit Server VM warning: Option UseConcMarkSweepGC was deprecated in version 9.0 and will likely be removed in a future release.
   [junit4] <<< JVM J0: EOF ----

[...truncated 146 lines...]
   [junit4] JVM J2: stderr was not empty, see: /home/jenkins/workspace/Lucene-Solr-7.x-Linux/lucene/build/analysis/stempel/test/temp/junit4-J2-20170709_164241_6054250692971539745777.syserr
   [junit4] >>> JVM J2 emitted unexpected output (verbatim) ----
   [junit4] Java HotSpot(TM) 64-Bit Server VM warning: Option UseConcMarkSweepGC was deprecated in version 9.0 and will likely be removed in a future release.
   [junit4] <<< JVM J2: EOF ----

[...truncated 6 lines...]
   [junit4] JVM J1: stderr was not empty, see: /home/jenkins/workspace/Lucene-Solr-7.x-Linux/lucene/build/analysis/stempel/test/temp/junit4-J1-20170709_164241_60513002550530300865313.syserr
   [junit4] >>> JVM J1 emitted unexpected output (verbatim) ----
   [junit4] Java HotSpot(TM) 64-Bit Server VM warning: Option UseConcMarkSweepGC was deprecated in version 9.0 and will likely be removed in a future release.
   [junit4] <<< JVM J1: EOF ----

   [junit4] JVM J0: stderr was not empty, see: /home/jenkins/workspace/Lucene-Solr-7.x-Linux/lucene/build/analysis/stempel/test/temp/junit4-J0-20170709_164241_60518250154595670904400.syserr
   [junit4] >>> JVM J0 emitted unexpected output (verbatim) ----
   [junit4] Java HotSpot(TM) 64-Bit Server VM warning: Option UseConcMarkSweepGC was deprecated in version 9.0 and will likely be removed in a future release.
   [junit4] <<< JVM J0: EOF ----

[...truncated 161 lines...]
   [junit4] JVM J0: stderr was not empty, see: /home/jenkins/workspace/Lucene-Solr-7.x-Linux/lucene/build/analysis/uima/test/temp/junit4-J0-20170709_164244_8998288331872177430151.syserr
   [junit4] >>> JVM J0 emitted unexpected output (verbatim) ----
   [junit4] Java HotSpot(TM) 64-Bit Server VM warning: Option UseConcMarkSweepGC was deprecated in version 9.0 and will likely be removed in a future release.
   [junit4] <<< JVM J0: EOF ----

[...truncated 184 lines...]
   [junit4] JVM J1: stderr was not empty, see: /home/jenkins/workspace/Lucene-Solr-7.x-Linux/lucene/build/backward-codecs/test/temp/junit4-J1-20170709_164252_1352634429109777519847.syserr
   [junit4] >>> JVM J1 emitted unexpected output (verbatim) ----
   [junit4] Java HotSpot(TM) 64-Bit Server VM warning: Option UseConcMarkSweepGC was deprecated in version 9.0 and will likely be removed in a future release.
   [junit4] <<< JVM J1: EOF ----

[...truncated 20 lines...]
   [junit4] JVM J0: stderr was not empty, see: /home/jenkins/workspace/Lucene-Solr-7.x-Linux/lucene/build/backward-codecs/test/temp/junit4-J0-20170709_164252_1358876167779049980854.syserr
   [junit4] >>> JVM J0 emitted unexpected output (verbatim) ----
   [junit4] Java HotSpot(TM) 64-Bit Server VM warning: Option UseConcMarkSweepGC was deprecated in version 9.0 and will likely be removed in a future release.
   [junit4] <<< JVM J0: EOF ----

[...truncated 9 lines...]
   [junit4] JVM J2: stderr was not empty, see: /home/jenkins/workspace/Lucene-Solr-7.x-Linux/lucene/build/backward-codecs/test/temp/junit4-J2-20170709_164252_13614679579307554267674.syserr
   [junit4] >>> JVM J2 emitted unexpected output (verbatim) ----
   [junit4] Java HotSpot(TM) 64-Bit Server VM warning: Option UseConcMarkSweepGC was deprecated in version 9.0 and will likely be removed in a future release.
   [junit4] <<< JVM J2: EOF ----

[...truncated 1211 lines...]
   [junit4] JVM J1: stderr was not empty, see: /home/jenkins/workspace/Lucene-Solr-7.x-Linux/lucene/build/benchmark/test/temp/junit4-J1-20170709_164424_09117013775271113938249.syserr
   [junit4] >>> JVM J1 emitted unexpected output (verbatim) ----
   [junit4] Java HotSpot(TM) 64-Bit Server VM warning: Option UseConcMarkSweepGC was deprecated in version 9.0 and will likely be removed in a future release.
   [junit4] <<< JVM J1: EOF ----

   [junit4] JVM J2: stderr was not empty, see: /home/jenkins/workspace/Lucene-Solr-7.x-Linux/lucene/build/benchmark/test/temp/junit4-J2-20170709_164424_0913595789645547751136.syserr
   [junit4] >>> JVM J2 emitted unexpected output (verbatim) ----
   [junit4] Java HotSpot(TM) 64-Bit Server VM warning: Option UseConcMarkSweepGC was deprecated in version 9.0 and will likely be removed in a future release.
   [junit4] <<< JVM J2: EOF ----

[...truncated 3 lines...]
   [junit4] JVM J0: stderr was not empty, see: /home/jenkins/workspace/Lucene-Solr-7.x-Linux/lucene/build/benchmark/test/temp/junit4-J0-20170709_164424_0914278775924965085370.syserr
   [junit4] >>> JVM J0 emitted unexpected output (verbatim) ----
   [junit4] Java HotSpot(TM) 64-Bit Server VM warning: Option UseConcMarkSweepGC was deprecated in version 9.0 and will likely be removed in a future release.
   [junit4] <<< JVM J0: EOF ----

[...truncated 223 lines...]
   [junit4] JVM J2: stderr was not empty, see: /home/jenkins/workspace/Lucene-Solr-7.x-Linux/lucene/build/classification/test/temp/junit4-J2-20170709_164431_46515485953611859564916.syserr
   [junit4] >>> JVM J2 emitted unexpected output (verbatim) ----
   [junit4] Java HotSpot(TM) 64-Bit Server VM warning: Option UseConcMarkSweepGC was deprecated in version 9.0 and will likely be removed in a future release.
   [junit4] <<< JVM J2: EOF ----

   [junit4] JVM J0: stderr was not empty, see: /home/jenkins/workspace/Lucene-Solr-7.x-Linux/lucene/build/classification/test/temp/junit4-J0-20170709_164431_46416420204343921998060.syserr
   [junit4] >>> JVM J0 emitted unexpected output (verbatim) ----
   [junit4] Java HotSpot(TM) 64-Bit Server VM warning: Option UseConcMarkSweepGC was deprecated in version 9.0 and will likely be removed in a future release.
   [junit4] <<< JVM J0: EOF ----

[...truncated 3 lines...]
   [junit4] JVM J1: stderr was not empty, see: /home/jenkins/workspace/Lucene-Solr-7.x-Linux/lucene/build/classification/test/temp/junit4-J1-20170709_164431_46415043782606802724429.syserr
   [junit4] >>> JVM J1 emitted unexpected output (verbatim) ----
   [junit4] Java HotSpot(TM) 64-Bit Server VM warning: Option UseConcMarkSweepGC was deprecated in version 9.0 and will likely be removed in a future release.
   [junit4] <<< JVM J1: EOF ----

[...truncated 246 lines...]
   [junit4] JVM J2: stderr was not empty, see: /home/jenkins/workspace/Lucene-Solr-7.x-Linux/lucene/build/codecs/test/temp/junit4-J2-20170709_164441_51516423278658304713484.syserr
   [junit4] >>> JVM J2 emitted unexpected output (verbatim) ----
   [junit4] Java HotSpot(TM) 64-Bit Server VM warning: Option UseConcMarkSweepGC was deprecated in version 9.0 and will likely be removed in a future release.
   [junit4] <<< JVM J2: EOF ----

[...truncated 5 lines...]
   [junit4] JVM J1: stderr was not empty, see: /home/jenkins/workspace/Lucene-Solr-7.x-Linux/lucene/build/codecs/test/temp/junit4-J1-20170709_164441_51413205679405684411350.syserr
   [junit4] >>> JVM J1 emitted unexpected output (verbatim) ----
   [junit4] Java HotSpot(TM) 64-Bit Server VM warning: Option UseConcMarkSweepGC was deprecated in version 9.0 and will likely be removed in a future release.
   [junit4] <<< JVM J1: EOF ----

[...truncated 6 lines...]
   [junit4] JVM J0: stderr was not empty, see: /home/jenkins/workspace/Lucene-Solr-7.x-Linux/lucene/build/codecs/test/temp/junit4-J0-20170709_164441_5141640093157690402763.syserr
   [junit4] >>> JVM J0 emitted unexpected output (verbatim) ----
   [junit4] Java HotSpot(TM) 64-Bit Server VM warning: Option UseConcMarkSweepGC was deprecated in version 9.0 and will likely be removed in a future release.
   [junit4] <<< JVM J0: EOF ----

[...truncated 229 lines...]
   [junit4] JVM J1: stderr was not empty, see: /home/jenkins/workspace/Lucene-Solr-7.x-Linux/lucene/build/demo/test/temp/junit4-J1-20170709_164640_4956907070513184471117.syserr
   [junit4] >>> JVM J1 emitted unexpected output (verbatim) ----
   [junit4] Java HotSpot(TM) 64-Bit Server VM warning: Option UseConcMarkSweepGC was deprecated in version 9.0 and will likely be removed in a future release.
   [junit4] <<< JVM J1: EOF ----

   [junit4] JVM J2: stderr was not empty, see: /home/jenkins/workspace/Lucene-Solr-7.x-Linux/lucene/build/demo/test/temp/junit4-J2-20170709_164640_49513448989203246569631.syserr
   [junit4] >>> JVM J2 emitted unexpected output (verbatim) ----
   [junit4] Java HotSpot(TM) 64-Bit Server VM warning: Option UseConcMarkSweepGC was deprecated in version 9.0 and will likely be removed in a future release.
   [junit4] <<< JVM J2: EOF ----

   [junit4] JVM J0: stderr was not empty, see: /home/jenkins/workspace/Lucene-Solr-7.x-Linux/lucene/build/demo/test/temp/junit4-J0-20170709_164640_49517555072283387839771.syserr
   [junit4] >>> JVM J0 emitted unexpected output (verbatim) ----
   [junit4] Java HotSpot(TM) 64-Bit Server VM warning: Option UseConcMarkSweepGC was deprecated in version 9.0 and will likely be removed in a future release.
   [junit4] <<< JVM J0: EOF ----

[...truncated 165 lines...]
   [junit4] JVM J1: stderr was not empty, see: /home/jenkins/workspace/Lucene-Solr-7.x-Linux/lucene/build/expressions/test/temp/junit4-J1-20170709_164643_16718014975932367560051.syserr
   [junit4] >>> JVM J1 emitted unexpected output (verbatim) ----
   [junit4] Java HotSpot(TM) 64-Bit Server VM warning: Option UseConcMarkSweepGC was deprecated in version 9.0 and will likely be removed in a future release.
   [junit4] <<< JVM J1: EOF ----

   [junit4] JVM J0: stderr was not empty, see: /home/jenkins/workspace/Lucene-Solr-7.x-Linux/lucene/build/expressions/test/temp/junit4-J0-20170709_164643_167941798259448767199.syserr
   [junit4] >>> JVM J0 emitted unexpected output (verbatim) ----
   [junit4] Java HotSpot(TM) 64-Bit Server VM warning: Option UseConcMarkSweepGC was deprecated in version 9.0 and will likely be removed in a future release.
   [junit4] <<< JVM J0: EOF ----

[...truncated 3 lines...]
   [junit4] JVM J2: stderr was not empty, see: /home/jenkins/workspace/Lucene-Solr-7.x-Linux/lucene/build/expressions/test/temp/junit4-J2-20170709_164643_1676704321059536521813.syserr
   [junit4] >>> JVM J2 emitted unexpected output (verbatim) ----
   [junit4] Java HotSpot(TM) 64-Bit Server VM warning: Option UseConcMarkSweepGC was deprecated in version 9.0 and will likely be removed in a future release.
   [junit4] <<< JVM J2: EOF ----

[...truncated 207 lines...]
   [junit4] JVM J0: stderr was not empty, see: /home/jenkins/workspace/Lucene-Solr-7.x-Linux/lucene/build/facet/test/temp/junit4-J0-20170709_164648_00515001305560657400755.syserr
   [junit4] >>> JVM J0 emitted unexpected output (verbatim) ----
   [junit4] Java HotSpot(TM) 64-Bit Server VM warning: Option UseConcMarkSweepGC was deprecated in version 9.0 and will likely be removed in a future release.
   [junit4] <<< JVM J0: EOF ----

[...truncated 3 lines...]
   [junit4] JVM J1: stderr was not empty, see: /home/jenkins/workspace/Lucene-Solr-7.x-Linux/lucene/build/facet/test/temp/junit4-J1-20170709_164648_00511750992798403249543.syserr
   [junit4] >>> JVM J1 emitted unexpected output (verbatim) ----
   [junit4] Java HotSpot(TM) 64-Bit Server VM warning: Option UseConcMarkSweepGC was deprecated in version 9.0 and will likely be removed in a future release.
   [junit4] <<< JVM J1: EOF ----

[...truncated 3 lines...]
   [junit4] JVM J2: stderr was not empty, see: /home/jenkins/workspace/Lucene-Solr-7.x-Linux/lucene/build/facet/test/temp/junit4-J2-20170709_164648_00512871962318037467576.syserr
   [junit4] >>> JVM J2 emitted unexpected output (verbatim) ----
   [junit4] Java HotSpot(TM) 64-Bit Server VM warning: Option UseConcMarkSweepGC was deprecated in version 9.0 and will likely be removed in a future release.
   [junit4] <<< JVM J2: EOF ----

[...truncated 171 lines...]
   [junit4] JVM J2: stderr was not empty, see: /home/jenkins/workspace/Lucene-Solr-7.x-Linux/lucene/build/grouping/test/temp/junit4-J2-20170709_164718_4784861937633268819980.syserr
   [junit4] >>> JVM J2 emitted unexpected output (verbatim) ----
   [junit4] Java HotSpot(TM) 64-Bit Server VM warning: Option UseConcMarkSweepGC was deprecated in version 9.0 and will likely be removed in a future release.
   [junit4] <<< JVM J2: EOF ----

[...truncated 3 lines...]
   [junit4] JVM J1: stderr was not empty, see: /home/jenkins/workspace/Lucene-Solr-7.x-Linux/lucene/build/grouping/test/temp/junit4-J1-20170709_164718_4787141572169248607138.syserr
   [junit4] >>> JVM J1 emitted unexpected output (verbatim) ----
   [junit4] Java HotSpot(TM) 64-Bit Server VM warning: Option UseConcMarkSweepGC was deprecated in version 9.0 and will likely be removed in a future release.
   [junit4] <<< JVM J1: EOF ----

[...truncated 3 lines...]
   [junit4] JVM J0: stderr was not empty, see: /home/jenkins/workspace/Lucene-Solr-7.x-Linux/lucene/build/grouping/test/temp/junit4-J0-20170709_164718_4772297621649377395372.syserr
   [junit4] >>> JVM J0 emitted unexpected output (verbatim) ----
   [junit4] Java HotSpot(TM) 64-Bit Server VM warning: Option UseConcMarkSweepGC was deprecated in version 9.0 and will likely be removed in a future release.
   [junit4] <<< JVM J0: EOF ----

[...truncated 235 lines...]
   [junit4] JVM J0: stderr was not empty, see: /home/jenkins/workspace/Lucene-Solr-7.x-Linux/lucene/build/highlighter/test/temp/junit4-J0-20170709_164727_5262030300914064680283.syserr
   [junit4] >>> JVM J0 emitted unexpected output (verbatim) ----
   [junit4] Java HotSpot(TM) 64-Bit Server VM warning: Option UseConcMarkSweepGC was deprecated in version 9.0 and will likely be removed in a future release.
   [junit4] <<< JVM J0: EOF ----

[...truncated 3 lines...]
   [junit4] JVM J2: stderr was not empty, see: /home/jenkins/workspace/Lucene-Solr-7.x-Linux/lucene/build/highlighter/test/temp/junit4-J2-20170709_164727_5262858498692407951421.syserr
   [junit4] >>> JVM J2 emitted unexpected output (verbatim) ----
   [junit4] Java HotSpot(TM) 64-Bit Server VM warning: Option UseConcMarkSweepGC was deprecated in version 9.0 and will likely be removed in a future release.
   [junit4] <<< JVM J2: EOF ----

[...truncated 3 lines...]
   [junit4] JVM J1: stderr was not empty, see: /home/jenkins/workspace/Lucene-Solr-7.x-Linux/lucene/build/highlighter/test/temp/junit4-J1-20170709_164727_52615639990950344428422.syserr
   [junit4] >>> JVM J1 emitted unexpected output (verbatim) ----
   [junit4] Java HotSpot(TM) 64-Bit Server VM warning: Option UseConcMarkSweepGC was deprecated in version 9.0 and will likely be removed in a future release.
   [junit4] <<< JVM J1: EOF ----

[...truncated 152 lines...]
   [junit4] JVM J2: stderr was not empty, see: /home/jenkins/workspace/Lucene-Solr-7.x-Linux/lucene/build/join/test/temp/junit4-J2-20170709_164747_65212959437530453519569.syserr
   [junit4] >>> JVM J2 emitted unexpected output (verbatim) ----
   [junit4] Java HotSpot(TM) 64-Bit Server VM warning: Option UseConcMarkSweepGC was deprecated in version 9.0 and will likely be removed in a future release.
   [junit4] <<< JVM J2: EOF ----

[...truncated 3 lines...]
   [junit4] JVM J0: stderr was not empty, see: /home/jenkins/workspace/Lucene-Solr-7.x-Linux/lucene/build/join/test/temp/junit4-J0-20170709_164747_65218215671255583702872.syserr
   [junit4] >>> JVM J0 emitted unexpected output (verbatim) ----
   [junit4] Java HotSpot(TM) 64-Bit Server VM warning: Option UseConcMarkSweepGC was deprecated in version 9.0 and will likely be removed in a future release.
   [junit4] <<< JVM J0: EOF ----

[...truncated 6 lines...]
   [junit4] JVM J1: stderr was not empty, see: /home/jenkins/workspace/Lucene-Solr-7.x-Linux/lucene/build/join/test/temp/junit4-J1-20170709_164747_65217512462654791566548.syserr
   [junit4] >>> JVM J1 emitted unexpected output (verbatim) ----
   [junit4] Java HotSpot(TM) 64-Bit Server VM warning: Option UseConcMarkSweepGC was deprecated in version 9.0 and will likely be removed in a future release.
   [junit4] <<< JVM J1: EOF ----

[...truncated 141 lines...]
   [junit4] JVM J0: stderr was not empty, see: /home/jenkins/workspace/Lucene-Solr-7.x-Linux/lucene/build/memory/test/temp/junit4-J0-20170709_164814_07111261531005360458989.syserr
   [junit4] >>> JVM J0 emitted unexpected output (verbatim) ----
   [junit4] Java HotSpot(TM) 64-Bit Server VM warning: Option UseConcMarkSweepGC was deprecated in version 9.0 and will likely be removed in a future release.
   [junit4] <<< JVM J0: EOF ----

[...truncated 3 lines...]
   [junit4] JVM J1: stderr was not empty, see: /home/jenkins/workspace/Lucene-Solr-7.x-Linux/lucene/build/memory/test/temp/junit4-J1-20170709_164814_0719515991759093632392.syserr
   [junit4] >>> JVM J1 emitted unexpected output (verbatim) ----
   [junit4] Java HotSpot(TM) 64-Bit Server VM warning: Option UseConcMarkSweepGC was deprecated in version 9.0 and will likely be removed in a future release.
   [junit4] <<< JVM J1: EOF ----

[...truncated 164 lines...]
   [junit4] JVM J2: stderr was not empty, see: /home/jenkins/workspace/Lucene-Solr-7.x-Linux/lucene/build/misc/test/temp/junit4-J2-20170709_164823_24614376012072206935457.syserr
   [junit4] >>> JVM J2 emitted unexpected output (verbatim) ----
   [junit4] Java HotSpot(TM) 64-Bit Server VM warning: Option UseConcMarkSweepGC was deprecated in version 9.0 and will likely be removed in a future release.
   [junit4] <<< JVM J2: EOF ----

[...truncated 5 lines...]
   [junit4] JVM J1: stderr was not empty, see: /home/jenkins/workspace/Lucene-Solr-7.x-Linux/lucene/build/misc/test/temp/junit4-J1-20170709_164823_24310163339930703809300.syserr
   [junit4] >>> JVM J1 emitted unexpected output (verbatim) ----
   [junit4] Java HotSpot(TM) 64-Bit Server VM warning: Option UseConcMarkSweepGC was deprecated in version 9.0 and will likely be removed in a future release.
   [junit4] <<< JVM J1: EOF ----

[...truncated 9 lines...]
   [junit4] JVM J0: stderr was not empty, see: /home/jenkins/workspace/Lucene-Solr-7.x-Linux/lucene/build/misc/test/temp/junit4-J0-20170709_164823_2439735278207862489911.syserr
   [junit4] >>> JVM J0 emitted unexpected output (verbatim) ----
   [junit4] Java HotSpot(TM) 64-Bit Server VM warning: Option UseConcMarkSweepGC was deprecated in version 9.0 and will likely be removed in a future release.
   [junit4] <<< JVM J0: EOF ----

[...truncated 307 lines...]
   [junit4] JVM J1: stderr was not empty, see: /home/jenkins/workspace/Lucene-Solr-7.x-Linux/lucene/build/queries/test/temp/junit4-J1-20170709_164839_3496058594924950883915.syserr
   [junit4] >>> JVM J1 emitted unexpected output (verbatim) ----
   [junit4] Java HotSpot(TM) 64-Bit Server VM warning: Option UseConcMarkSweepGC was deprecated in version 9.0 and will likely be removed in a future release.
   [junit4] <<< JVM J1: EOF ----

[...truncated 3 lines...]
   [junit4] JVM J0: stderr was not empty, see: /home/jenkins/workspace/Lucene-Solr-7.x-Linux/lucene/build/queries/test/temp/junit4-J0-20170709_164839_3491314105147110019152.syserr
   [junit4] >>> JVM J0 emitted unexpected output (verbatim) ----
   [junit4] Java HotSpot(TM) 64-Bit Server VM warning: Option UseConcMarkSweepGC was deprecated in version 9.0 and will likely be removed in a future release.
   [junit4] <<< JVM J0: EOF ----

   [junit4] JVM J2: stderr was not empty, see: /home/jenkins/workspace/Lucene-Solr-7.x-Linux/lucene/build/queries/test/temp/junit4-J2-20170709_164839_34911225175417726176798.syserr
   [junit4] >>> JVM J2 emitted unexpected output (verbatim) ----
   [junit4] Java HotSpot(TM) 64-Bit Server VM warning: Option UseConcMarkSweepGC was deprecated in version 9.0 and will likely be removed in a future release.
   [junit4] <<< JVM J2: EOF ----

[...truncated 216 lines...]
   [junit4] JVM J1: stderr was not empty, see: /home/jenkins/workspace/Lucene-Solr-7.x-Linux/lucene/build/queryparser/test/temp/junit4-J1-20170709_164846_87817153058915892235610.syserr
   [junit4] >>> JVM J1 emitted unexpected output (verbatim) ----
   [junit4] Java HotSpot(TM) 64-Bit Server VM warning: Option UseConcMarkSweepGC was deprecated in version 9.0 and will likely be removed in a future release.
   [junit4] <<< JVM J1: EOF ----

[...truncated 3 lines...]
   [junit4] JVM J0: stderr was not empty, see: /home/jenkins/workspace/Lucene-Solr-7.x-Linux/lucene/build/queryparser/test/temp/junit4-J0-20170709_164846_87814172564471685936195.syserr
   [junit4] >>> JVM J0 emitted unexpected output (verbatim) ----
   [junit4] Java HotSpot(TM) 64-Bit Server VM warning: Option UseConcMarkSweepGC was deprecated in version 9.0 and will likely be removed in a future release.
   [junit4] <<< JVM J0: EOF ----

[...truncated 3 lines...]
   [junit4] JVM J2: stderr was not empty, see: /home/jenkins/workspace/Lucene-Solr-7.x-Linux/lucene/build/queryparser/test/temp/junit4-J2-20170709_164846_8788388065485783926271.syserr
   [junit4] >>> JVM J2 emitted unexpected output (verbatim) ----
   [junit4] Java HotSpot(TM) 64-Bit Server VM warning: Option UseConcMarkSweepGC was deprecated in version 9.0 and will likely be removed in a future release.
   [junit4] <<< JVM J2: EOF ----

[...truncated 179 lines...]
   [junit4] JVM J2: stderr was not empty, see: /home/jenkins/workspace/Lucene-Solr-7.x-Linux/lucene/build/replicator/test/temp/junit4-J2-20170709_164853_48524140918004416200.syserr
   [junit4] >>> JVM J2 emitted unexpected output (verbatim) ----
   [junit4] Java HotSpot(TM) 64-Bit Server VM warning: Option UseConcMarkSweepGC was deprecated in version 9.0 and will likely be removed in a future release.
   [junit4] <<< JVM J2: EOF ----

[...truncated 3 lines...]
   [junit4] JVM J0: stderr was not empty, see: /home/jenkins/workspace/Lucene-Solr-7.x-Linux/lucene/build/replicator/test/temp/junit4-J0-20170709_164853_48518005132659293364089.syserr
   [junit4] >>> JVM J0 emitted unexpected output (verbatim) ----
   [junit4] Java HotSpot(TM) 64-Bit Server VM warning: Option UseConcMarkSweepGC was deprecated in version 9.0 and will likely be removed in a future release.
   [junit4] <<< JVM J0: EOF ----

[...truncated 23 lines...]
   [junit4] JVM J1: stderr was not empty, see: /home/jenkins/workspace/Lucene-Solr-7.x-Linux/lucene/build/replicator/test/temp/junit4-J1-20170709_164853_48517842176068795944689.syserr
   [junit4] >>> JVM J1 emitted unexpected output (verbatim) ----
   [junit4] Java HotSpot(TM) 64-Bit Server VM warning: Option UseConcMarkSweepGC was deprecated in version 9.0 and will likely be removed in a future release.
   [junit4] <<< JVM J1: EOF ----

[...truncated 197 lines...]
   [junit4] JVM J2: stderr was not empty, see: /home/jenkins/workspace/Lucene-Solr-7.x-Linux/lucene/build/sandbox/test/temp/junit4-J2-20170709_164905_2604571112454631398597.syserr
   [junit4] >>> JVM J2 emitted unexpected output (verbatim) ----
   [junit4] Java HotSpot(TM) 64-Bit Server VM warning: Option UseConcMarkSweepGC was deprecated in version 9.0 and will likely be removed in a future release.
   [junit4] <<< JVM J2: EOF ----

[...truncated 3 lines...]
   [junit4] JVM J0: stderr was not empty, see: /home/jenkins/workspace/Lucene-Solr-7.x-Linux/lucene/build/sandbox/test/temp/junit4-J0-20170709_164905_25917056536683977515323.syserr
   [junit4] >>> JVM J0 emitted unexpected output (verbatim) ----
   [junit4] Java HotSpot(TM) 64-Bit Server VM warning: Option UseConcMarkSweepGC was deprecated in version 9.0 and will likely be removed in a future release.
   [junit4] <<< JVM J0: EOF ----

[...truncated 7 lines...]
   [junit4] JVM J1: stderr was not empty, see: /home/jenkins/workspace/Lucene-Solr-7.x-Linux/lucene/build/sandbox/test/temp/junit4-J1-20170709_164905_2599799884483540392393.syserr
   [junit4] >>> JVM J1 emitted unexpected output (verbatim) ----
   [junit4] Java HotSpot(TM) 64-Bit Server VM warning: Option UseConcMarkSweepGC was deprecated in version 9.0 and will likely be removed in a future release.
   [junit4] <<< JVM J1: EOF ----

[...truncated 207 lines...]
   [junit4] JVM J0: stderr was not empty, see: /home/jenkins/workspace/Lucene-Solr-7.x-Linux/lucene/build/spatial-extras/test/temp/junit4-J0-20170709_164943_6094252961712681002763.syserr
   [junit4] >>> JVM J0 emitted unexpected output (verbatim) ----
   [junit4] Java HotSpot(TM) 64-Bit Server VM warning: Option UseConcMarkSweepGC was deprecated in version 9.0 and will likely be removed in a future release.
   [junit4] <<< JVM J0: EOF ----

[...truncated 3 lines...]
   [junit4] JVM J2: stderr was not empty, see: /home/jenkins/workspace/Lucene-Solr-7.x-Linux/lucene/build/spatial-extras/test/temp/junit4-J2-20170709_164943_60914458653788577883489.syserr
   [junit4] >>> JVM J2 emitted unexpected output (verbatim) ----
   [junit4] Java HotSpot(TM) 64-Bit Server VM warning: Option UseConcMarkSweepGC was deprecated in version 9.0 and will likely be removed in a future release.
   [junit4] <<< JVM J2: EOF ----

[...truncated 3 lines...]
   [junit4] JVM J1: stderr was not empty, see: /home/jenkins/workspace/Lucene-Solr-7.x-Linux/lucene/build/spatial-extras/test/temp/junit4-J1-20170709_164943_6095034920312297623042.syserr
   [junit4] >>> JVM J1 emitted unexpected output (verbatim) ----
   [junit4] Java HotSpot(TM) 64-Bit Server VM warning: Option UseConcMarkSweepGC was deprecated in version 9.0 and will likely be removed in a future release.
   [junit4] <<< JVM J1: EOF ----

[...truncated 140 lines...]
   [junit4] JVM J0: stderr was not empty, see: /home/jenkins/workspace/Lucene-Solr-7.x-Linux/lucene/build/spatial/test/temp/junit4-J0-20170709_164957_81611186038626156427443.syserr
   [junit4] >>> JVM J0 emitted unexpected output (verbatim) ----
   [junit4] Java HotSpot(TM) 64-Bit Server VM warning: Option UseConcMarkSweepGC was deprecated in version 9.0 and will likely be removed in a future release.
   [junit4] <<< JVM J0: EOF ----

[...truncated 157 lines...]
   [junit4] JVM J2: stderr was not empty, see: /home/jenkins/workspace/Lucene-Solr-7.x-Linux/lucene/build/spatial3d/test/temp/junit4-J2-20170709_164959_39916759863479338226575.syserr
   [junit4] >>> JVM J2 emitted unexpected output (verbatim) ----
   [junit4] Java HotSpot(TM) 64-Bit Server VM warning: Option UseConcMarkSweepGC was deprecated in version 9.0 and will likely be removed in a future release.
   [junit4] <<< JVM J2: EOF ----

   [junit4] JVM J0: stderr was not empty, see: /home/jenkins/workspace/Lucene-Solr-7.x-Linux/lucene/build/spatial3d/test/temp/junit4-J0-20170709_164959_39814364048533245400047.syserr
   [junit4] >>> JVM J0 emitted unexpected output (verbatim) ----
   [junit4] Java HotSpot(TM) 64-Bit Server VM warning: Option UseConcMarkSweepGC was deprecated in version 9.0 and will likely be removed in a future release.
   [junit4] <<< JVM J0: EOF ----

[...truncated 5 lines...]
   [junit4] JVM J1: stderr was not empty, see: /home/jenkins/workspace/Lucene-Solr-7.x-Linux/lucene/build/spatial3d/test/temp/junit4-J1-20170709_164959_39813325663002609876351.syserr
   [junit4] >>> JVM J1 emitted unexpected output (verbatim) ----
   [junit4] Java HotSpot(TM) 64-Bit Server VM warning: Option UseConcMarkSweepGC was deprecated in version 9.0 and will likely be removed in a future release.
   [junit4] <<< JVM J1: EOF ----

[...truncated 294 lines...]
   [junit4] JVM J0: stderr was not empty, see: /home/jenkins/workspace/Lucene-Solr-7.x-Linux/lucene/build/suggest/test/temp/junit4-J0-20170709_165058_32916491401270890697745.syserr
   [junit4] >>> JVM J0 emitted unexpected output (verbatim) ----
   [junit4] Java HotSpot(TM) 64-Bit Server VM warning: Option UseConcMarkSweepGC was deprecated in version 9.0 and will likely be removed in a future release.
   [junit4] <<< JVM J0: EOF ----

[...truncated 12 lines...]
   [junit4] JVM J2: stderr was not empty, see: /home/jenkins/workspace/Lucene-Solr-7.x-Linux/lucene/build/suggest/test/temp/junit4-J2-20170709_165058_3299945264958864060061.syserr
   [junit4] >>> JVM J2 emitted unexpected output (verbatim) ----
   [junit4] Java HotSpot(TM) 64-Bit Server VM warning: Option UseConcMarkSweepGC was deprecated in version 9.0 and will likely be removed in a future release.
   [junit4] <<< JVM J2: EOF ----

[...truncated 3 lines...]
   [junit4] JVM J1: stderr was not empty, see: /home/jenkins/workspace/Lucene-Solr-7.x-Linux/lucene/build/suggest/test/temp/junit4-J1-20170709_165058_3295916863823974586769.syserr
   [junit4] >>> JVM J1 emitted unexpected output (verbatim) ----
   [junit4] Java HotSpot(TM) 64-Bit Server VM warning: Option UseConcMarkSweepGC was deprecated in version 9.0 and will likely be removed in a future release.
   [junit4] <<< JVM J1: EOF ----

[...truncated 3194 lines...]
   [junit4] Suite: org.apache.solr.handler.TestSQLHandler
   [junit4]   2> Creating dataDir: /home/jenkins/workspace/Lucene-Solr-7.x-Linux/solr/build/solr-core/test/J1/temp/solr.handler.TestSQLHandler_3F0677B4D21C37A1-001/init-core-data-001
   [junit4]   2> 1968799 WARN  (SUITE-TestSQLHandler-seed#[3F0677B4D21C37A1]-worker) [    ] o.a.s.SolrTestCaseJ4 startTrackingSearchers: numOpens=18 numCloses=18
   [junit4]   2> 1968799 INFO  (SUITE-TestSQLHandler-seed#[3F0677B4D21C37A1]-worker) [    ] o.a.s.SolrTestCaseJ4 Using TrieFields (NUMERIC_POINTS_SYSPROP=false) w/NUMERIC_DOCVALUES_SYSPROP=true
   [junit4]   2> 1968799 INFO  (SUITE-TestSQLHandler-seed#[3F0677B4D21C37A1]-worker) [    ] o.a.s.SolrTestCaseJ4 Randomized ssl (false) and clientAuth (true) via: @org.apache.solr.util.RandomizeSSL(reason="", value=0.0/0.0, ssl=0.0/0.0, clientAuth=0.0/0.0)
   [junit4]   2> 1968799 INFO  (SUITE-TestSQLHandler-seed#[3F0677B4D21C37A1]-worker) [    ] o.a.s.BaseDistributedSearchTestCase Setting hostContext system property: /zi_m/
   [junit4]   2> 1968800 INFO  (TEST-TestSQLHandler.doTest-seed#[3F0677B4D21C37A1]) [    ] o.a.s.c.ZkTestServer STARTING ZK TEST SERVER
   [junit4]   2> 1968800 INFO  (Thread-8616) [    ] o.a.s.c.ZkTestServer client port:0.0.0.0/0.0.0.0:0
   [junit4]   2> 1968800 INFO  (Thread-8616) [    ] o.a.s.c.ZkTestServer Starting server
   [junit4]   2> 1968802 ERROR (Thread-8616) [    ] o.a.z.s.ZooKeeperServer ZKShutdownHandler is not registered, so ZooKeeper server won't take any action on ERROR or SHUTDOWN server state changes
   [junit4]   2> 1968900 INFO  (TEST-TestSQLHandler.doTest-seed#[3F0677B4D21C37A1]) [    ] o.a.s.c.ZkTestServer start zk server on port:38697
   [junit4]   2> 1968908 INFO  (TEST-TestSQLHandler.doTest-seed#[3F0677B4D21C37A1]) [    ] o.a.s.c.AbstractZkTestCase put /home/jenkins/workspace/Lucene-Solr-7.x-Linux/solr/core/src/test-files/solr/collection1/conf/solrconfig-sql.xml to /configs/conf1/solrconfig.xml
   [junit4]   2> 1968908 INFO  (TEST-TestSQLHandler.doTest-seed#[3F0677B4D21C37A1]) [    ] o.a.s.c.AbstractZkTestCase put /home/jenkins/workspace/Lucene-Solr-7.x-Linux/solr/core/src/test-files/solr/collection1/conf/schema-sql.xml to /configs/conf1/schema.xml
   [junit4]   2> 1968909 INFO  (TEST-TestSQLHandler.doTest-seed#[3F0677B4D21C37A1]) [    ] o.a.s.c.AbstractZkTestCase put /home/jenkins/workspace/Lucene-Solr-7.x-Linux/solr/core/src/test-files/solr/collection1/conf/solrconfig.snippet.randomindexconfig.xml to /configs/conf1/solrconfig.snippet.randomindexconfig.xml
   [junit4]   2> 1968909 INFO  (TEST-TestSQLHandler.doTest-seed#[3F0677B4D21C37A1]) [    ] o.a.s.c.AbstractZkTestCase put /home/jenkins/workspace/Lucene-Solr-7.x-Linux/solr/core/src/test-files/solr/collection1/conf/stopwords.txt to /configs/conf1/stopwords.txt
   [junit4]   2> 1968910 INFO  (TEST-TestSQLHandler.doTest-seed#[3F0677B4D21C37A1]) [    ] o.a.s.c.AbstractZkTestCase put /home/jenkins/workspace/Lucene-Solr-7.x-Linux/solr/core/src/test-files/solr/collection1/conf/protwords.txt to /configs/conf1/protwords.txt
   [junit4]   2> 1968910 INFO  (TEST-TestSQLHandler.doTest-seed#[3F0677B4D21C37A1]) [    ] o.a.s.c.AbstractZkTestCase put /home/jenkins/workspace/Lucene-Solr-7.x-Linux/solr/core/src/test-files/solr/collection1/conf/currency.xml to /configs/conf1/currency.xml
   [junit4]   2> 1968911 INFO  (TEST-TestSQLHandler.doTest-seed#[3F0677B4D21C37A1]) [    ] o.a.s.c.AbstractZkTestCase put /home/jenkins/workspace/Lucene-Solr-7.x-Linux/solr/core/src/test-files/solr/collection1/conf/enumsConfig.xml to /configs/conf1/enumsConfig.xml
   [junit4]   2> 1968911 INFO  (TEST-TestSQLHandler.doTest-seed#[3F0677B4D21C37A1]) [    ] o.a.s.c.AbstractZkTestCase put /home/jenkins/workspace/Lucene-Solr-7.x-Linux/solr/core/src/test-files/solr/collection1/conf/open-exchange-rates.json to /configs/conf1/open-exchange-rates.json
   [junit4]   2> 1968912 INFO  (TEST-TestSQLHandler.doTest-seed#[3F0677B4D21C37A1]) [    ] o.a.s.c.AbstractZkTestCase put /home/jenkins/workspace/Lucene-Solr-7.x-Linux/solr/core/src/test-files/solr/collection1/conf/mapping-ISOLatin1Accent.txt to /configs/conf1/mapping-ISOLatin1Accent.txt
   [junit4]   2> 1968912 INFO  (TEST-TestSQLHandler.doTest-seed#[3F0677B4D21C37A1]) [    ] o.a.s.c.AbstractZkTestCase put /home/jenkins/workspace/Lucene-Solr-7.x-Linux/solr/core/src/test-files/solr/collection1/conf/old_synonyms.txt to /configs/conf1/old_synonyms.txt
   [junit4]   2> 1968912 INFO  (TEST-TestSQLHandler.doTest-seed#[3F0677B4D21C37A1]) [    ] o.a.s.c.AbstractZkTestCase put /home/jenkins/workspace/Lucene-Solr-7.x-Linux/solr/core/src/test-files/solr/collection1/conf/synonyms.txt to /configs/conf1/synonyms.txt
   [junit4]   2> 1968913 INFO  (TEST-TestSQLHandler.doTest-seed#[3F0677B4D21C37A1]) [    ] o.a.s.c.AbstractFullDistribZkTestBase Will use NRT replicas unless explicitly asked otherwise
   [junit4]   2> 1969012 INFO  (TEST-TestSQLHandler.doTest-seed#[3F0677B4D21C37A1]) [    ] o.e.j.s.Server jetty-9.3.14.v20161028
   [junit4]   2> 1969012 INFO  (TEST-TestSQLHandler.doTest-seed#[3F0677B4D21C37A1]) [    ] o.e.j.s.h.ContextHandler Started o.e.j.s.ServletContextHandler@1b281e6e{/zi_m,null,AVAILABLE}
   [junit4]   2> 1969014 INFO  (TEST-TestSQLHandler.doTest-seed#[3F0677B4D21C37A1]) [    ] o.e.j.s.AbstractConnector Started ServerConnector@1fe5f48b{HTTP/1.1,[http/1.1]}{127.0.0.1:46431}
   [junit4]   2> 1969014 INFO  (TEST-TestSQLHandler.doTest-seed#[3F0677B4D21C37A1]) [    ] o.e.j.s.Server Started @1970092ms
   [junit4]   2> 1969014 INFO  (TEST-TestSQLHandler.doTest-seed#[3F0677B4D21C37A1]) [    ] o.a.s.c.s.e.JettySolrRunner Jetty properties: {hostContext=/zi_m, solr.data.dir=/home/jenkins/workspace/Lucene-Solr-7.x-Linux/solr/build/solr-core/test/J1/temp/solr.handler.TestSQLHandler_3F0677B4D21C37A1-001/tempDir-001/control/data, hostPort=46431, coreRootDirectory=/home/jenkins/workspace/Lucene-Solr-7.x-Linux/solr/build/solr-core/test/J1/temp/solr.handler.TestSQLHandler_3F0677B4D21C37A1-001/control-001/cores}
   [junit4]   2> 1969014 ERROR (TEST-TestSQLHandler.doTest-seed#[3F0677B4D21C37A1]) [    ] o.a.s.s.StartupLoggingUtils Missing Java Option solr.log.dir. Logging may be missing or incomplete.
   [junit4]   2> 1969014 INFO  (TEST-TestSQLHandler.doTest-seed#[3F0677B4D21C37A1]) [    ] o.a.s.s.SolrDispatchFilter  ___      _       Welcome to Apache Solr? version 7.1.0
   [junit4]   2> 1969014 INFO  (TEST-TestSQLHandler.doTest-seed#[3F0677B4D21C37A1]) [    ] o.a.s.s.SolrDispatchFilter / __| ___| |_ _   Starting in cloud mode on port null
   [junit4]   2> 1969014 INFO  (TEST-TestSQLHandler.doTest-seed#[3F0677B4D21C37A1]) [    ] o.a.s.s.SolrDispatchFilter \__ \/ _ \ | '_|  Install dir: null, Default config dir: null
   [junit4]   2> 1969014 INFO  (TEST-TestSQLHandler.doTest-seed#[3F0677B4D21C37A1]) [    ] o.a.s.s.SolrDispatchFilter |___/\___/_|_|    Start time: 2017-07-09T17:24:46.027711Z
   [junit4]   2> 1969015 INFO  (TEST-TestSQLHandler.doTest-seed#[3F0677B4D21C37A1]) [    ] o.a.s.s.SolrDispatchFilter Loading solr.xml from SolrHome (not found in ZooKeeper)
   [junit4]   2> 1969015 INFO  (TEST-TestSQLHandler.doTest-seed#[3F0677B4D21C37A1]) [    ] o.a.s.c.SolrXmlConfig Loading container configuration from /home/jenkins/workspace/Lucene-Solr-7.x-Linux/solr/build/solr-core/test/J1/temp/solr.handler.TestSQLHandler_3F0677B4D21C37A1-001/control-001/solr.xml
   [junit4]   2> 1969025 INFO  (TEST-TestSQLHandler.doTest-seed#[3F0677B4D21C37A1]) [    ] o.a.s.c.SolrXmlConfig MBean server found: com.sun.jmx.mbeanserver.JmxMBeanServer@74279a61, but no JMX reporters were configured - adding default JMX reporter.
   [junit4]   2> 1969026 INFO  (TEST-TestSQLHandler.doTest-seed#[3F0677B4D21C37A1]) [    ] o.a.s.c.ZkContainer Zookeeper client=127.0.0.1:38697/solr
   [junit4]   2> 1969051 INFO  (TEST-TestSQLHandler.doTest-seed#[3F0677B4D21C37A1]) [    ] o.a.s.c.Overseer Overseer (id=null) closing
   [junit4]   2> 1969052 INFO  (TEST-TestSQLHandler.doTest-seed#[3F0677B4D21C37A1]) [    ] o.a.s.c.OverseerElectionContext I am going to be the leader 127.0.0.1:46431_zi_m
   [junit4]   2> 1969052 INFO  (TEST-TestSQLHandler.doTest-seed#[3F0677B4D21C37A1]) [    ] o.a.s.c.Overseer Overseer (id=98279167479906308-127.0.0.1:46431_zi_m-n_0000000000) starting
   [junit4]   2> 1969054 INFO  (TEST-TestSQLHandler.doTest-seed#[3F0677B4D21C37A1]) [    ] o.a.s.c.ZkController Register node as live in ZooKeeper:/live_nodes/127.0.0.1:46431_zi_m
   [junit4]   2> 1969056 INFO  (zkCallback-2960-thread-1) [    ] o.a.s.c.c.ZkStateReader Updated live nodes from ZooKeeper... (0) -> (1)
   [junit4]   2> 1969087 INFO  (TEST-TestSQLHandler.doTest-seed#[3F0677B4D21C37A1]) [    ] o.a.s.m.r.SolrJmxReporter JMX monitoring for 'solr.node' (registry 'solr.node') enabled at server: com.sun.jmx.mbeanserver.JmxMBeanServer@74279a61
   [junit4]   2> 1969090 INFO  (TEST-TestSQLHandler.doTest-seed#[3F0677B4D21C37A1]) [    ] o.a.s.m.r.SolrJmxReporter JMX monitoring for 'solr.jvm' (registry 'solr.jvm') enabled at server: com.sun.jmx.mbeanserver.JmxMBeanServer@74279a61
   [junit4]   2> 1969090 INFO  (TEST-TestSQLHandler.doTest-seed#[3F0677B4D21C37A1]) [    ] o.a.s.m.r.SolrJmxReporter JMX monitoring for 'solr.jetty' (registry 'solr.jetty') enabled at server: com.sun.jmx.mbeanserver.JmxMBeanServer@74279a61
   [junit4]   2> 1969091 INFO  (TEST-TestSQLHandler.doTest-seed#[3F0677B4D21C37A1]) [    ] o.a.s.c.CorePropertiesLocator Found 0 core definitions underneath /home/jenkins/workspace/Lucene-Solr-7.x-Linux/solr/build/solr-core/test/J1/temp/solr.handler.TestSQLHandler_3F0677B4D21C37A1-001/control-001/cores
   [junit4]   2> 1969098 INFO  (TEST-TestSQLHandler.doTest-seed#[3F0677B4D21C37A1]) [    ] o.a.s.c.c.ZkStateReader Updated live nodes from ZooKeeper... (0) -> (1)
   [junit4]   2> 1969099 INFO  (TEST-TestSQLHandler.doTest-seed#[3F0677B4D21C37A1]) [    ] o.a.s.c.s.i.ZkClientClusterStateProvider Cluster at 127.0.0.1:38697/solr ready
   [junit4]   2> 1969100 INFO  (qtp831179512-23694) [    ] o.a.s.h.a.CollectionsHandler Invoked Collection Action :create with params replicationFactor=1&collection.configName=conf1&name=control_collection&nrtReplicas=1&action=CREATE&numShards=1&createNodeSet=127.0.0.1:46431_zi_m&wt=javabin&version=2 and sendToOCPQueue=true
   [junit4]   2> 1969106 INFO  (OverseerThreadFactory-7812-thread-1) [    ] o.a.s.c.CreateCollectionCmd Create collection control_collection
   [junit4]   2> 1969208 INFO  (qtp831179512-23690) [    ] o.a.s.h.a.CoreAdminOperation core create command qt=/admin/cores&collection.configName=conf1&newCollection=true&name=control_collection_shard1_replica_n1&action=CREATE&numShards=1&collection=control_collection&shard=shard1&wt=javabin&version=2&replicaType=NRT
   [junit4]   2> 1969208 INFO  (qtp831179512-23690) [    ] o.a.s.c.TransientSolrCoreCacheDefault Allocating transient cache for 4 transient cores
   [junit4]   2> 1969310 INFO  (zkCallback-2960-thread-1) [    ] o.a.s.c.c.ZkStateReader A cluster state change: [WatchedEvent state:SyncConnected type:NodeDataChanged path:/collections/control_collection/state.json] for collection [control_collection] has occurred - updating... (live nodes size: [1])
   [junit4]   2> 1970214 INFO  (qtp831179512-23690) [    ] o.a.s.c.SolrConfig Using Lucene MatchVersion: 7.1.0
   [junit4]   2> 1970219 INFO  (qtp831179512-23690) [    ] o.a.s.s.IndexSchema [control_collection_shard1_replica_n1] Schema name=test
   [junit4]   2> 1970265 WARN  (qtp831179512-23690) [    ] o.a.s.s.IndexSchema Field lowerfilt1and2 is not multivalued and destination for multiple copyFields (2)
   [junit4]   2> 1970266 WARN  (qtp831179512-23690) [    ] o.a.s.s.IndexSchema Field text is not multivalued and destination for multiple copyFields (3)
   [junit4]   2> 1970266 INFO  (qtp831179512-23690) [    ] o.a.s.s.IndexSchema Loaded schema test/1.6 with uniqueid field id
   [junit4]   2> 1970266 INFO  (qtp831179512-23690) [    ] o.a.s.c.CoreContainer Creating SolrCore 'control_collection_shard1_replica_n1' using configuration from collection control_collection, trusted=true
   [junit4]   2> 1970266 INFO  (qtp831179512-23690) [    ] o.a.s.m.r.SolrJmxReporter JMX monitoring for 'solr.core.control_collection.shard1.replica_n1' (registry 'solr.core.control_collection.shard1.replica_n1') enabled at server: com.sun.jmx.mbeanserver.JmxMBeanServer@74279a61
   [junit4]   2> 1970266 INFO  (qtp831179512-23690) [    ] o.a.s.c.SolrCore solr.RecoveryStrategy.Builder
   [junit4]   2> 1970266 INFO  (qtp831179512-23690) [    ] o.a.s.c.SolrCore [[control_collection_shard1_replica_n1] ] Opening new SolrCore at [/home/jenkins/workspace/Lucene-Solr-7.x-Linux/solr/build/solr-core/test/J1/temp/solr.handler.TestSQLHandler_3F0677B4D21C37A1-001/control-001/cores/control_collection_shard1_replica_n1], dataDir=[/home/jenkins/workspace/Lucene-Solr-7.x-Linux/solr/build/solr-core/test/J1/temp/solr.handler.TestSQLHandler_3F0677B4D21C37A1-001/control-001/cores/control_collection_shard1_replica_n1/data/]
   [junit4]   2> 1970298 INFO  (qtp831179512-23690) [    ] o.a.s.u.UpdateHandler Using UpdateLog implementation: org.apache.solr.update.UpdateLog
   [junit4]   2> 1970298 INFO  (qtp831179512-23690) [    ] o.a.s.u.UpdateLog Initializing UpdateLog: dataDir= defaultSyncLevel=FLUSH numRecordsToKeep=100 maxNumLogsToKeep=10 numVersionBuckets=65536
   [junit4]   2> 1970299 INFO  (qtp831179512-23690) [    ] o.a.s.u.CommitTracker Hard AutoCommit: disabled
   [junit4]   2> 1970299 INFO  (qtp831179512-23690) [    ] o.a.s.u.CommitTracker Soft AutoCommit: disabled
   [junit4]   2> 1970300 INFO  (qtp831179512-23690) [    ] o.a.s.s.SolrIndexSearcher Opening [Searcher@501f707c[control_collection_shard1_replica_n1] main]
   [junit4]   2> 1970301 INFO  (qtp831179512-23690) [    ] o.a.s.r.ManagedResourceStorage Configured ZooKeeperStorageIO with znodeBase: /configs/conf1
   [junit4]   2> 1970301 INFO  (qtp831179512-23690) [    ] o.a.s.r.ManagedResourceStorage Loaded null at path _rest_managed.json using ZooKeeperStorageIO:path=/configs/conf1
   [junit4]   2> 1970302 INFO  (searcherExecutor-7815-thread-1) [    ] o.a.s.c.SolrCore [control_collection_shard1_replica_n1] Registered new searcher Searcher@501f707c[control_collection_shard1_replica_n1] main{ExitableDirectoryReader(UninvertingDirectoryReader())}
   [junit4]   2> 1970302 INFO  (qtp831179512-23690) [    ] o.a.s.u.UpdateLog Could not find max version in index or recent updates, using new clock 1572466681252413440
   [junit4]   2> 1970304 INFO  (qtp831179512-23690) [    ] o.a.s.c.ShardLeaderElectionContext Enough replicas found to continue.
   [junit4]   2> 1970305 INFO  (qtp831179512-23690) [    ] o.a.s.c.ShardLeaderElectionContext I may be the new leader - try and sync
   [junit4]   2> 1970305 INFO  (qtp831179512-23690) [    ] o.a.s.c.SyncStrategy Sync replicas to http://127.0.0.1:46431/zi_m/control_collection_shard1_replica_n1/
   [junit4]   2> 1970305 INFO  (qtp831179512-23690) [    ] o.a.s.c.SyncStrategy Sync Success - now sync replicas to me
   [junit4]   2> 1970305 INFO  (qtp831179512-23690) [    ] o.a.s.c.SyncStrategy http://127.0.0.1:46431/zi_m/control_collection_shard1_replica_n1/ has no replicas
   [junit4]   2> 1970305 INFO  (qtp831179512-23690) [    ] o.a.s.c.ShardLeaderElectionContext Found all replicas participating in election, clear LIR
   [junit4]   2> 1970309 INFO  (qtp831179512-23690) [    ] o.a.s.c.ShardLeaderElectionContext I am the new leader: http://127.0.0.1:46431/zi_m/control_collection_shard1_replica_n1/ shard1
   [junit4]   2> 1970410 INFO  (zkCallback-2960-thread-1) [    ] o.a.s.c.c.ZkStateReader A cluster state change: [WatchedEvent state:SyncConnected type:NodeDataChanged path:/collections/control_collection/state.json] for collection [control_collection] has occurred - updating... (live nodes size: [1])
   [junit4]   2> 1970459 INFO  (qtp831179512-23690) [    ] o.a.s.c.ZkController I am the leader, no recovery necessary
   [junit4]   2> 1970461 INFO  (qtp831179512-23690) [    ] o.a.s.s.HttpSolrCall [admin] webapp=null path=/admin/cores params={qt=/admin/cores&collection.configName=conf1&newCollection=true&name=control_collection_shard1_replica_n1&action=CREATE&numShards=1&collection=control_collection&shard=shard1&wt=javabin&version=2&replicaType=NRT} status=0 QTime=1252
   [junit4]   2> 1970462 INFO  (qtp831179512-23694) [    ] o.a.s.h.a.CollectionsHandler Wait for new collection to be active for at most 30 seconds. Check all shard replicas
   [junit4]   2> 1970561 INFO  (zkCallback-2960-thread-1) [    ] o.a.s.c.c.ZkStateReader A cluster state change: [WatchedEvent state:SyncConnected type:NodeDataChanged path:/collections/control_collection/state.json] for collection [control_collection] has occurred - updating... (live nodes size: [1])
   [junit4]   2> 1971108 INFO  (OverseerCollectionConfigSetProcessor-98279167479906308-127.0.0.1:46431_zi_m-n_0000000000) [    ] o.a.s.c.OverseerTaskQueue Response ZK path: /overseer/collection-queue-work/qnr-0000000000 doesn't exist.  Requestor may have disconnected from ZooKeeper
   [junit4]   2> 1971462 INFO  (qtp831179512-23694) [    ] o.a.s.s.HttpSolrCall [admin] webapp=null path=/admin/collections params={replicationFactor=1&collection.configName=conf1&name=control_collection&nrtReplicas=1&action=CREATE&numShards=1&createNodeSet=127.0.0.1:46431_zi_m&wt=javabin&version=2} status=0 QTime=2362
   [junit4]   2> 1971465 INFO  (TEST-TestSQLHandler.doTest-seed#[3F0677B4D21C37A1]) [    ] o.a.s.c.c.ZkStateReader Updated live nodes from ZooKeeper... (0) -> (1)
   [junit4]   2> 1971465 INFO  (TEST-TestSQLHandler.doTest-seed#[3F0677B4D21C37A1]) [    ] o.a.s.c.s.i.ZkClientClusterStateProvider Cluster at 127.0.0.1:38697/solr ready
   [junit4]   2> 1971466 INFO  (TEST-TestSQLHandler.doTest-seed#[3F0677B4D21C37A1]) [    ] o.a.s.c.ChaosMonkey monkey: init - expire sessions:false cause connection loss:false
   [junit4]   2> 1971466 INFO  (qtp831179512-23694) [    ] o.a.s.h.a.CollectionsHandler Invoked Collection Action :create with params replicationFactor=1&collection.configName=conf1&name=collection1&nrtReplicas=1&action=CREATE&numShards=2&createNodeSet=&stateFormat=1&wt=javabin&version=2 and sendToOCPQueue=true
   [junit4]   2> 1971467 INFO  (OverseerThreadFactory-7812-thread-2) [    ] o.a.s.c.CreateCollectionCmd Create collection collection1
   [junit4]   2> 1971467 WARN  (OverseerThreadFactory-7812-thread-2) [    ] o.a.s.c.CreateCollectionCmd It is unusual to create a collection (collection1) without cores.
   [junit4]   2> 1971672 INFO  (qtp831179512-23694) [    ] o.a.s.h.a.CollectionsHandler Wait for new collection to be active for at most 30 seconds. Check all shard replicas
   [junit4]   2> 1971672 INFO  (qtp831179512-23694) [    ] o.a.s.s.HttpSolrCall [admin] webapp=null path=/admin/collections params={replicationFactor=1&collection.configName=conf1&name=collection1&nrtReplicas=1&action=CREATE&numShards=2&createNodeSet=&stateFormat=1&wt=javabin&version=2} status=0 QTime=206
   [junit4]   2> 1971762 INFO  (TEST-TestSQLHandler.doTest-seed#[3F0677B4D21C37A1]) [    ] o.a.s.c.AbstractFullDistribZkTestBase create jetty 1 in directory /home/jenkins/workspace/Lucene-Solr-7.x-Linux/solr/build/solr-core/test/J1/temp/solr.handler.TestSQLHandler_3F0677B4D21C37A1-001/shard-1-001 of type NRT
   [junit4]   2> 1971762 INFO  (TEST-TestSQLHandler.doTest-seed#[3F0677B4D21C37A1]) [    ] o.e.j.s.Server jetty-9.3.14.v20161028
   [junit4]   2> 1971763 INFO  (TEST-TestSQLHandler.doTest-seed#[3F0677B4D21C37A1]) [    ] o.e.j.s.h.ContextHandler Started o.e.j.s.ServletContextHandler@4315826e{/zi_m,null,AVAILABLE}
   [junit4]   2> 1971763 INFO  (TEST-TestSQLHandler.doTest-seed#[3F0677B4D21C37A1]) [    ] o.e.j.s.AbstractConnector Started ServerConnector@407967cd{HTTP/1.1,[http/1.1]}{127.0.0.1:34855}
   [junit4]   2> 1971763 INFO  (TEST-TestSQLHandler.doTest-seed#[3F0677B4D21C37A1]) [    ] o.e.j.s.Server Started @1972841ms
   [junit4]   2> 1971763 INFO  (TEST-TestSQLHandler.doTest-seed#[3F0677B4D21C37A1]) [    ] o.a.s.c.s.e.JettySolrRunner Jetty properties: {hostContext=/zi_m, solrconfig=solrconfig.xml, solr.data.dir=/home/jenkins/workspace/Lucene-Solr-7.x-Linux/solr/build/solr-core/test/J1/temp/solr.handler.TestSQLHandler_3F0677B4D21C37A1-001/tempDir-001/jetty1, hostPort=34855, coreRootDirectory=/home/jenkins/workspace/Lucene-Solr-7.x-Linux/solr/build/solr-core/test/J1/temp/solr.handler.TestSQLHandler_3F0677B4D21C37A1-001/shard-1-001/cores, replicaType=NRT}
   [junit4]   2> 1971763 ERROR (TEST-TestSQLHandler.doTest-seed#[3F0677B4D21C37A1]) [    ] o.a.s.s.StartupLoggingUtils Missing Java Option solr.log.dir. Logging may be missing or incomplete.
   [junit4]   2> 1971764 INFO  (TEST-TestSQLHandler.doTest-seed#[3F0677B4D21C37A1]) [    ] o.a.s.s.SolrDispatchFilter  ___      _       Welcome to Apache Solr? version 7.1.0
   [junit4]   2> 1971764 INFO  (TEST-TestSQLHandler.doTest-seed#[3F0677B4D21C37A1]) [    ] o.a.s.s.SolrDispatchFilter / __| ___| |_ _   Starting in cloud mode on port null
   [junit4]   2> 1971764 INFO  (TEST-TestSQLHandler.doTest-seed#[3F0677B4D21C37A1]) [    ] o.a.s.s.SolrDispatchFilter \__ \/ _ \ | '_|  Install dir: null, Default config dir: null
   [junit4]   2> 1971764 INFO  (TEST-TestSQLHandler.doTest-seed#[3F0677B4D21C37A1]) [    ] o.a.s.s.SolrDispatchFilter |___/\___/_|_|    Start time: 2017-07-09T17:24:48.777128Z
   [junit4]   2> 1971765 INFO  (TEST-TestSQLHandler.doTest-seed#[3F0677B4D21C37A1]) [    ] o.a.s.s.SolrDispatchFilter Loading solr.xml from SolrHome (not found in ZooKeeper)
   [junit4]   2> 1971765 INFO  (TEST-TestSQLHandler.doTest-seed#[3F0677B4D21C37A1]) [    ] o.a.s.c.SolrXmlConfig Loading container configuration from /home/jenkins/workspace/Lucene-Solr-7.x-Linux/solr/build/solr-core/test/J1/temp/solr.handler.TestSQLHandler_3F0677B4D21C37A1-001/shard-1-001/solr.xml
   [junit4]   2> 1971767 INFO  (TEST-TestSQLHandler.doTest-seed#[3F0677B4D21C37A1]) [    ] o.a.s.c.SolrXmlConfig MBean server found: com.sun.jmx.mbeanserver.JmxMBeanServer@74279a61, but no JMX reporters were configured - adding default JMX reporter.
   [junit4]   2> 1971768 INFO  (TEST-TestSQLHandler.doTest-seed#[3F0677B4D21C37A1]) [    ] o.a.s.c.ZkContainer Zookeeper client=127.0.0.1:38697/solr
   [junit4]   2> 1971772 INFO  (TEST-TestSQLHandler.doTest-seed#[3F0677B4D21C37A1]) [    ] o.a.s.c.c.ZkStateReader Updated live nodes from ZooKeeper... (0) -> (1)
   [junit4]   2> 1971772 INFO  (TEST-TestSQLHandler.doTest-seed#[3F0677B4D21C37A1]) [    ] o.a.s.c.Overseer Overseer (id=null) closing
   [junit4]   2> 1971773 INFO  (TEST-TestSQLHandler.doTest-seed#[3F0677B4D21C37A1]) [    ] o.a.s.c.ZkController Register node as live in ZooKeeper:/live_nodes/127.0.0.1:34855_zi_m
   [junit4]   2> 1971773 INFO  (zkCallback-2960-thread-1) [    ] o.a.s.c.c.ZkStateReader Updated live nodes from ZooKeeper... (1) -> (2)
   [junit4]   2> 1971773 INFO  (zkCallback-2967-thread-1) [    ] o.a.s.c.c.ZkStateReader Updated live nodes from ZooKeeper... (1) -> (2)
   [junit4]   2> 1971774 INFO  (zkCallback-2972-thread-1) [    ] o.a.s.c.c.ZkStateReader Updated live nodes from ZooKeeper... (1) -> (2)
   [junit4]   2> 1971811 INFO  (TEST-TestSQLHandler.doTest-seed#[3F0677B4D21C37A1]) [    ] o.a.s.m.r.SolrJmxReporter JMX monitoring for 'solr.node' (registry 'solr.node') enabled at server: com.sun.jmx.mbeanserver.JmxMBeanServer@74279a61
   [junit4]   2> 1971817 INFO  (TEST-TestSQLHandler.doTest-seed#[3F0677B4D21C37A1]) [    ] o.a.s.m.r.SolrJmxReporter JMX monitoring for 'solr.jvm' (registry 'solr.jvm') enabled at server: com.sun.jmx.mbeanserver.JmxMBeanServer@74279a61
   [junit4]   2> 1971817 INFO  (TEST-TestSQLHandler.doTest-seed#[3F0677B4D21C37A1]) [    ] o.a.s.m.r.SolrJmxReporter JMX monitoring for 'solr.jetty' (registry 'solr.jetty') enabled at server: com.sun.jmx.mbeanserver.JmxMBeanServer@74279a61
   [junit4]   2> 1971818 INFO  (TEST-TestSQLHandler.doTest-seed#[3F0677B4D21C37A1]) [    ] o.a.s.c.CorePropertiesLocator Found 0 core definitions underneath /home/jenkins/workspace/Lucene-Solr-7.x-Linux/solr/build/solr-core/test/J1/temp/solr.handler.TestSQLHandler_3F0677B4D21C37A1-001/shard-1-001/cores
   [junit4]   2> 1971836 INFO  (qtp862959865-23735) [    ] o.a.s.h.a.CollectionsHandler Invoked Collection Action :addreplica with params node=127.0.0.1:34855_zi_m&action=ADDREPLICA&collection=collection1&shard=shard2&type=NRT&wt=javabin&version=2 and sendToOCPQueue=true
   [junit4]   2> 1971836 INFO  (OverseerCollectionConfigSetProcessor-98279167479906308-127.0.0.1:46431_zi_m-n_0000000000) [    ] o.a.s.c.OverseerTaskQueue Response ZK path: /overseer/collection-queue-work/qnr-0000000002 doesn't exist.  Requestor may have disconnected from ZooKeeper
   [junit4]   2> 1971837 INFO  (OverseerThreadFactory-7812-thread-3) [    ] o.a.s.c.AddReplicaCmd Node Identified 127.0.0.1:34855_zi_m for creating new replica
   [junit4]   2> 1971837 INFO  (qtp862959865-23731) [    ] o.a.s.h.a.CoreAdminOperation core create command qt=/admin/cores&collection.configName=conf1&name=collection1_shard2_replica_n0&action=CREATE&collection=collection1&shard=shard2&wt=javabin&version=2&replicaType=NRT
   [junit4]   2> 1971837 INFO  (qtp862959865-23731) [    ] o.a.s.c.TransientSolrCoreCacheDefault Allocating transient cache for 4 transient cores
   [junit4]   2> 1972841 INFO  (qtp862959865-23731) [    ] o.a.s.c.SolrConfig Using Lucene MatchVersion: 7.1.0
   [junit4]   2> 1972845 INFO  (qtp862959865-23731) [    ] o.a.s.s.IndexSchema [collection1_shard2_replica_n0] Schema name=test
   [junit4]   2> 1972884 WARN  (qtp862959865-23731) [    ] o.a.s.s.IndexSchema Field lowerfilt1and2 is not multivalued and destination for multiple copyFields (2)
   [junit4]   2> 1972884 WARN  (qtp862959865-23731) [    ] o.a.s.s.IndexSchema Field text is not multivalued and destination for multiple copyFields (3)
   [junit4]   2> 1972884 INFO  (qtp862959865-23731) [    ] o.a.s.s.IndexSchema Loaded schema test/1.6 with uniqueid field id
   [junit4]   2> 1972884 INFO  (qtp862959865-23731) [    ] o.a.s.c.CoreContainer Creating SolrCore 'collection1_shard2_replica_n0' using configuration from collection collection1, trusted=true
   [junit4]   2> 1972885 INFO  (qtp862959865-23731) [    ] o.a.s.m.r.SolrJmxReporter JMX monitoring for 'solr.core.collection1.shard2.replica_n0' (registry 'solr.core.collection1.shard2.replica_n0') enabled at server: com.sun.jmx.mbeanserver.JmxMBeanServer@74279a61
   [junit4]   2> 1972885 INFO  (qtp862959865-23731) [    ] o.a.s.c.SolrCore solr.RecoveryStrategy.Builder
   [junit4]   2> 1972885 INFO  (qtp862959865-23731) [    ] o.a.s.c.SolrCore [[collection1_shard2_replica_n0] ] Opening new SolrCore at [/home/jenkins/workspace/Lucene-Solr-7.x-Linux/solr/build/solr-core/test/J1/temp/solr.handler.TestSQLHandler_3F0677B4D21C37A1-001/shard-1-001/cores/collection1_shard2_replica_n0], dataDir=[/home/jenkins/workspace/Lucene-Solr-7.x-Linux/solr/build/solr-core/test/J1/temp/solr.handler.TestSQLHandler_3F0677B4D21C37A1-001/shard-1-001/cores/collection1_shard2_replica_n0/data/]
   [junit4]   2> 1972914 INFO  (qtp862959865-23731) [    ] o.a.s.u.UpdateHandler Using UpdateLog implementation: org.apache.solr.update.UpdateLog
   [junit4]   2> 1972914 INFO  (qtp862959865-23731) [    ] o.a.s.u.UpdateLog Initializing UpdateLog: dataDir= defaultSyncLevel=FLUSH numRecordsToKeep=100 maxNumLogsToKeep=10 numVersionBuckets=65536
   [junit4]   2> 1972915 INFO  (qtp862959865-23731) [    ] o.a.s.u.CommitTracker Hard AutoCommit: disabled
   [junit4]   2> 1972915 INFO  (qtp862959865-23731) [    ] o.a.s.u.CommitTracker Soft AutoCommit: disabled
   [junit4]   2> 1972916 INFO  (qtp862959865-23731) [    ] o.a.s.s.SolrIndexSearcher Opening [Searcher@3c08fbc8[collection1_shard2_replica_n0] main]
   [junit4]   2> 1972916 INFO  (qtp862959865-23731) [    ] o.a.s.r.ManagedResourceStorage Configured ZooKeeperStorageIO with znodeBase: /configs/conf1
   [junit4]   2> 1972917 INFO  (qtp862959865-23731) [    ] o.a.s.r.ManagedResourceStorage Loaded null at path _rest_managed.json using ZooKeeperStorageIO:path=/configs/conf1
   [junit4]   2> 1972918 INFO  (searcherExecutor-7825-thread-1) [    ] o.a.s.c.SolrCore [collection1_shard2_replica_n0] Registered new searcher Searcher@3c08fbc8[collection1_shard2_replica_n0] main{ExitableDirectoryReader(UninvertingDirectoryReader())}
   [junit4]   2> 1972918 INFO  (qtp862959865-23731) [    ] o.a.s.u.UpdateLog Could not find max version in index or recent updates, using new clock 1572466683995488256
   [junit4]   2> 1972920 INFO  (qtp862959865-23731) [    ] o.a.s.c.ShardLeaderElectionContext Enough replicas found to continue.
   [junit4]   2> 1972920 INFO  (qtp862959865-23731) [    ] o.a.s.c.ShardLeaderElectionContext I may be the new leader - try and sync
   [junit4]   2> 1972920 INFO  (qtp862959865-23731) [    ] o.a.s.c.SyncStrategy Sync replicas to http://127.0.0.1:34855/zi_m/collection1_shard2_replica_n0/
   [junit4]   2> 1972920 INFO  (qtp862959865-23731) [    ] o.a.s.c.SyncStrategy Sync Success - now sync replicas to me
   [junit4]   2> 1972920 INFO  (qtp862959865-23731) [    ] o.a.s.c.SyncStrategy http://127.0.0.1:34855/zi_m/collection1_shard2_replica_n0/ has no replicas
   [junit4]   2> 1972920 INFO  (qtp862959865-23731) [    ] o.a.s.c.ShardLeaderElectionContext Found all replicas participating in election, clear LIR
   [junit4]   2> 1972921 INFO  (qtp862959865-23731) [    ] o.a.s.c.ShardLeaderElectionContext I am the new leader: http://127.0.0.1:34855/zi_m/collection1_shard2_replica_n0/ shard2
   [junit4]   2> 1973072 INFO  (qtp862959865-23731) [    ] o.a.s.c.ZkController I am the leader, no recovery necessary
   [junit4]   2> 1973073 INFO  (qtp862959865-23731) [    ] o.a.s.s.HttpSolrCall [admin] webapp=null path=/admin/cores params={qt=/admin/cores&collection.configName=conf1&name=collection1_shard2_replica_n0&action=CREATE&collection=collection1&shard=shard2&wt=javabin&version=2&replicaType=NRT} status=0 QTime=1236
   [junit4]   2> 1973074 INFO  (qtp862959865-23735) [    ] o.a.s.s.HttpSolrCall [admin] webapp=null path=/admin/collections params={node=127.0.0.1:34855_zi_m&action=ADDREPLICA&collection=collection1&shard=shard2&type=NRT&wt=javabin&version=2} status=0 QTime=1238
   [junit4]   2> 1973163 INFO  (TEST-TestSQLHandler.doTest-seed#[3F0677B4D21C37A1]) [    ] o.a.s.c.AbstractFullDistribZkTestBase create jetty 2 in directory /home/jenkins/workspace/Lucene-Solr-7.x-Linux/solr/build/solr-core/test/J1/temp/solr.handler.TestSQLHandler_3F0677B4D21C37A1-001/shard-2-001 of type NRT
   [junit4]   2> 1973163 INFO  (TEST-TestSQLHandler.doTest-seed#[3F0677B4D21C37A1]) [    ] o.e.j.s.Server jetty-9.3.14.v20161028
   [junit4]   2> 1973164 INFO  (TEST-TestSQLHandler.doTest-seed#[3F0677B4D21C37A1]) [    ] o.e.j.s.h.ContextHandler Started o.e.j.s.ServletContextHandler@78a19bdf{/zi_m,null,AVAILABLE}
   [junit4]   2> 1973164 INFO  (TEST-TestSQLHandler.doTest-seed#[3F0677B4D21C37A1]) [    ] o.e.j.s.AbstractConnector Started ServerConnector@30bf230a{HTTP/1.1,[http/1.1]}{127.0.0.1:45017}
   [junit4]   2> 1973164 INFO  (TEST-TestSQLHandler.doTest-seed#[3F0677B4D21C37A1]) [    ] o.e.j.s.Server Started @1974242ms
   [junit4]   2> 1973164 INFO  (TEST-TestSQLHandler.doTest-seed#[3F0677B4D21C37A1]) [    ] o.a.s.c.s.e.JettySolrRunner Jetty properties: {hostContext=/zi_m, solrconfig=solrconfig.xml, solr.data.dir=/home/jenkins/workspace/Lucene-Solr-7.x-Linux/solr/build/solr-core/test/J1/temp/solr.handler.TestSQLHandler_3F0677B4D21C37A1-001/tempDir-001/jetty2, hostPort=45017, coreRootDirectory=/home/jenkins/workspace/Lucene-Solr-7.x-Linux/solr/build/solr-core/test/J1/temp/solr.handler.TestSQLHandler_3F0677B4D21C37A1-001/shard-2-001/cores}
   [junit4]   2> 1973164 ERROR (TEST-TestSQLHandler.doTest-seed#[3F0677B4D21C37A1]) [    ] o.a.s.s.StartupLoggingUtils Missing Java Option solr.log.dir. Logging may be missing or incomplete.
   [junit4]   2> 1973164 INFO  (TEST-TestSQLHandler.doTest-seed#[3F0677B4D21C37A1]) [    ] o.a.s.s.SolrDispatchFilter  ___      _       Welcome to Apache Solr? version 7.1.0
   [junit4]   2> 1973164 INFO  (TEST-TestSQLHandler.doTest-seed#[3F0677B4D21C37A1]) [    ] o.a.s.s.SolrDispatchFilter / __| ___| |_ _   Starting in cloud mode on port null
   [junit4]   2> 1973164 INFO  (TEST-TestSQLHandler.doTest-seed#[3F0677B4D21C37A1]) [    ] o.a.s.s.SolrDispatchFilter \__ \/ _ \ | '_|  Install dir: null, Default config dir: null
   [junit4]   2> 1973164 INFO  (TEST-TestSQLHandler.doTest-seed#[3F0677B4D21C37A1]) [    ] o.a.s.s.SolrDispatchFilter |___/\___/_|_|    Start time: 2017-07-09T17:24:50.177989Z
   [junit4]   2> 1973166 INFO  (TEST-TestSQLHandler.doTest-seed#[3F0677B4D21C37A1]) [    ] o.a.s.s.SolrDispatchFilter Loading solr.xml from SolrHome (not found in ZooKeeper)
   [junit4]   2> 1973166 INFO  (TEST-TestSQLHandler.doTest-seed#[3F0677B4D21C37A1]) [    ] o.a.s.c.SolrXmlConfig Loading container configuration from /home/jenkins/workspace/Lucene-Solr-7.x-Linux/solr/build/solr-core/test/J1/temp/solr.handler.TestSQLHandler_3F0677B4D21C37A1-001/shard-2-001/solr.xml
   [junit4]   2> 1973168 INFO  (TEST-TestSQLHandler.doTest-seed#[3F0677B4D21C37A1]) [    ] o.a.s.c.SolrXmlConfig MBean server found: com.sun.jmx.mbeanserver.JmxMBeanServer@74279a61, but no JMX reporters were configured - adding default JMX reporter.
   [junit4]   2> 1973169 INFO  (TEST-TestSQLHandler.doTest-seed#[3F0677B4D21C37A1]) [    ] o.a.s.c.ZkContainer Zookeeper client=127.0.0.1:38697/solr
   [junit4]   2> 1973172 INFO  (TEST-TestSQLHandler.doTest-seed#[3F0677B4D21C37A1]) [    ] o.a.s.c.c.ZkStateReader Updated live nodes from ZooKeeper... (0) -> (2)
   [junit4]   2> 1973173 INFO  (TEST-TestSQLHandler.doTest-seed#[3F0677B4D21C37A1]) [    ] o.a.s.c.Overseer Overseer (id=null) closing
   [junit4]   2> 1973173 INFO  (TEST-TestSQLHandler.doTest-seed#[3F0677B4D21C37A1]) [    ] o.a.s.c.ZkController Register node as live in ZooKeeper:/live_nodes/127.0.0.1:45017_zi_m
   [junit4]   2> 1973174 INFO  (zkCallback-2972-thread-1) [    ] o.a.s.c.c.ZkStateReader Updated live nodes from ZooKeeper... (2) -> (3)
   [junit4]   2> 1973174 INFO  (zkCallback-2967-thread-1) [    ] o.a.s.c.c.ZkStateReader Updated live nodes from ZooKeeper... (2) -> (3)
   [junit4]   2> 1973174 INFO  (zkCallback-2960-thread-2) [    ] o.a.s.c.c.ZkStateReader Updated live nodes from ZooKeeper... (2) -> (3)
   [junit4]   2> 1973174 INFO  (zkCallback-2978-thread-1) [    ] o.a.s.c.c.ZkStateReader Updated live nodes from ZooKeeper... (2) -> (3)
   [junit4]   2> 1973198 INFO  (TEST-TestSQLHandler.doTest-seed#[3F0677B4D21C37A1]) [    ] o.a.s.m.r.SolrJmxReporter JMX monitoring for 'solr.node' (registry 'solr.node') enabled at server: com.sun.jmx.mbeanserver.JmxMBeanServer@74279a61
   [junit4]   2> 1973201 INFO  (TEST-TestSQLHandler.doTest-seed#[3F0677B4D21C37A1]) [    ] o.a.s.m.r.SolrJmxReporter JMX monitoring for 'solr.jvm' (registry 'solr.jvm') enabled at server: com.sun.jmx.mbeanserver.JmxMBeanServer@74279a61
   [junit4]   2> 1973201 INFO  (TEST-TestSQLHandler.doTest-seed#[3F0677B4D21C37A1]) [    ] o.a.s.m.r.SolrJmxReporter JMX monitoring for 'solr.jetty' (registry 'solr.jetty') enabled at server: com.sun.jmx.mbeanserver.JmxMBeanServer@74279a61
   [junit4]   2> 1973202 INFO  (TEST-TestSQLHandler.doTest-seed#[3F0677B4D21C37A1]) [    ] o.a.s.c.CorePropertiesLocator Found 0 core definitions underneath /home/jenkins/workspace/Lucene-Solr-7.x-Linux/solr/build/solr-core/test/J1/temp/solr.handler.TestSQLHandler_3F0677B4D21C37A1-001/shard-2-001/cores
   [junit4]   2> 1973216 INFO  (qtp1061413061-23765) [    ] o.a.s.h.a.CollectionsHandler Invoked Collection Action :addreplica with params node=127.0.0.1:45017_zi_m&action=ADDREPLICA&collection=collection1&shard=shard1&type=NRT&wt=javabin&version=2 and sendToOCPQueue=true
   [junit4]   2> 1973217 INFO  (OverseerCollectionConfigSetProcessor-98279167479906308-127.0.0.1:46431_zi_m-n_0000000000) [    ] o.a.s.c.OverseerTaskQueue Response ZK path: /overseer/collection-queue-work/qnr-0000000004 doesn't exist.  Requestor may have disconnected from ZooKeeper
   [junit4]   2> 1973217 INFO  (OverseerThreadFactory-7812-thread-4) [    ] o.a.s.c.AddReplicaCmd Node Identified 127.0.0.1:45017_zi_m for creating new replica
   [junit4]   2> 1973218 INFO  (qtp1061413061-23767) [    ] o.a.s.h.a.CoreAdminOperation core create command qt=/admin/cores&collection.configName=conf1&name=collection1_shard1_replica_n0&action=CREATE&collection=collection1&shard=shard1&wt=javabin&version=2&replicaType=NRT
   [junit4]   2> 1973218 INFO  (qtp1061413061-23767) [    ] o.a.s.c.TransientSolrCoreCacheDefault Allocating transient cache for 4 transient cores
   [junit4]   2> 1974225 INFO  (qtp1061413061-23767) [    ] o.a.s.c.SolrConfig Using Lucene MatchVersion: 7.1.0
   [junit4]   2> 1974232 INFO  (qtp1061413061-23767) [    ] o.a.s.s.IndexSchema [collection1_shard1_replica_n0] Schema name=test
   [junit4]   2> 1974310 WARN  (qtp1061413061-23767) [    ] o.a.s.s.IndexSchema Field lowerfilt1and2 is not multivalued and destination for multiple copyFields (2)
   [junit4]   2> 1974310 WARN  (qtp1061413061-23767) [    ] o.a.s.s.IndexSchema Field text is not multivalued and destination for multiple copyFields (3)
   [junit4]   2> 1974310 INFO  (qtp1061413061-23767) [    ] o.a.s.s.IndexSchema Loaded schema test/1.6 with uniqueid field id
   [junit4]   2> 1974310 INFO  (qtp1061413061-23767) [    ] o.a.s.c.CoreContainer Creating SolrCore 'collection1_shard1_replica_n0' using configuration from collection collection1, trusted=true
   [junit4]   2> 1974311 INFO  (qtp1061413061-23767) [    ] o.a.s.m.r.SolrJmxReporter JMX monitoring for 'solr.core.collection1.shard1.replica_n0' (registry 'solr.core.collection1.shard1.replica_n0') enabled at server: com.sun.jmx.mbeanserver.JmxMBeanServer@74279a61
   [junit4]   2> 1974311 INFO  (qtp1061413061-23767) [    ] o.a.s.c.SolrCore solr.RecoveryStrategy.Builder
   [junit4]   2> 1974311 INFO  (qtp1061413061-23767) [    ] o.a.s.c.SolrCore [[collection1_shard1_replica_n0] ] Opening new SolrCore at [/home/jenkins/workspace/Lucene-Solr-7.x-Linux/solr/build/solr-core/test/J1/temp/solr.handler.TestSQLHandler_3F0677B4D21C37A1-001/shard-2-001/cores/collection1_shard1_replica_n0], dataDir=[/home/jenkins/workspace/Lucene-Solr-7.x-Linux/solr/build/solr-core/test/J1/temp/solr.handler.TestSQLHandler_3F0677B4D21C37A1-001/shard-2-001/cores/collection1_shard1_replica_n0/data/]
   [junit4]   2> 1974355 INFO  (qtp1061413061-23767) [    ] o.a.s.u.UpdateHandler Using UpdateLog implementation: org.apache.solr.update.UpdateLog
   [junit4]   2> 1974355 INFO  (qtp1061413061-23767) [    ] o.a.s.u.UpdateLog Initializing UpdateLog: dataDir= defaultSyncLevel=FLUSH numRecordsToKeep=100 maxNumLogsToKeep=10 numVersionBuckets=65536
   [junit4]   2> 1974356 INFO  (qtp1061413061-23767) [    ] o.a.s.u.CommitTracker Hard AutoCommit: disabled
   [junit4]   2> 1974356 INFO  (qtp1061413061-23767) [    ] o.a.s.u.CommitTracker Soft AutoCommit: disabled
   [junit4]   2> 1974358 INFO  (qtp1061413061-23767) [    ] o.a.s.s.SolrIndexSearcher Opening [Searcher@5e9a0d7f[collection1_shard1_replica_n0] main]
   [junit4]   2> 1974359 INFO  (qtp1061413061-23767) [    ] o.a.s.r.ManagedResourceStorage Configured ZooKeeperStorageIO with znodeBase: /configs/conf1
   [junit4]   2> 1974359 INFO  (qtp1061413061-23767) [    ] o.a.s.r.ManagedResourceStorage Loaded null at path _rest_managed.json using ZooKeeperStorageIO:path=/configs/conf1
   [junit4]   2> 1974361 INFO  (searcherExecutor-7835-thread-1) [    ] o.a.s.c.SolrCore [collection1_shard1_replica_n0] Registered new searcher Searcher@5e9a0d7f[collection1_shard1_replica_n0] main{ExitableDirectoryReader(UninvertingDirectoryReader())}
   [junit4]   2> 1974361 INFO  (qtp1061413061-23767) [    ] o.a.s.u.UpdateLog Could not find max version in index or recent updates, using new clock 1572466685508583424
   [junit4]   2> 1974364 INFO  (qtp1061413061-23767) [    ] o.a.s.c.ShardLeaderElectionContext Enough replicas found to continue.
   [junit4]   2> 1974364 INFO  (qtp1061413061-23767) [    ] o.a.s.c.ShardLeaderElectionContext I may be the new leader - try and sync
   [junit4]   2> 1974364 INFO  (qtp1061413061-23767) [    ] o.a.s.c.SyncStrategy Sync replicas to http://127.0.0.1:45017/zi_m/collection1_shard1_replica_n0/
   [junit4]   2> 1974365 INFO  (qtp1061413061-23767) [    ] o.a.s.c.SyncStrategy Sync Success - now sync replicas to me
   [junit4]   2> 1974365 INFO  (qtp1061413061-23767) [    ] o.a.s.c.SyncStrategy http://127.0.0.1:45017/zi_m/collection1_shard1_replica_n0/ has no replicas
   [junit4]   2> 1974365 INFO  (qtp1061413061-23767) [    ] o.a.s.c.ShardLeaderElectionContext Found all replicas participating in election, clear LIR
   [junit4]   2> 1974366 INFO  (qtp1061413061-23767) [    ] o.a.s.c.ShardLeaderElectionContext I am the new leader: http://127.0.0.1:45017/zi_m/collection1_shard1_replica_n0/ shard1
   [junit4]   2> 1974516 INFO  (qtp1061413061-23767) [    ] o.a.s.c.ZkController I am the leader, no recovery necessary
   [junit4]   2> 1974518 INFO  (qtp1061413061-23767) [    ] o.a.s.s.HttpSolrCall [admin] webapp=null path=/admin/cores params={qt=/admin/cores&collection.configName=conf1&name=collection1_shard1_replica_n0&action=CREATE&collection=collection1&shard=shard1&wt=javabin&version=2&replicaType=NRT} status=0 QTime=1300
   [junit4]   2> 1974518 INFO  (qtp1061413061-23765) [    ] o.a.s.s.HttpSolrCall [admin] webapp=null path=/admin/collections params={node=127.0.0.1:45017_zi_m&action=ADDREPLICA&collection=collection1&shard=shard1&type=NRT&wt=javabin&version=2} status=0 QTime=1302
   [junit4]   2> 1974624 INFO  (TEST-TestSQLHandler.doTest-seed#[3F0677B4D21C37A1]) [    ] o.a.s.c.AbstractFullDistribZkTestBase create jetty 3 in directory /home/jenkins/workspace/Lucene-Solr-7.x-Linux/solr/build/solr-core/test/J1/temp/solr.handler.TestSQLHandler_3F0677B4D21C37A1-001/shard-3-001 of type NRT
   [junit4]   2> 1974624 INFO  (TEST-TestSQLHandler.doTest-seed#[3F0677B4D21C37A1]) [    ] o.e.j.s.Server jetty-9.3.14.v20161028
   [junit4]   2> 1974624 INFO  (TEST-TestSQLHandler.doTest-seed#[3F0677B4D21C37A1]) [    ] o.e.j.s.h.ContextHandler Started o.e.j.s.ServletContextHandler@363e7670{/zi_m,null,AVAILABLE}
   [junit4]   2> 1974625 INFO  (TEST-TestSQLHandler.doTest-seed#[3F0677B4D21C37A1]) [    ] o.e.j.s.AbstractConnector Started ServerConnector@615b8df1{HTTP/1.1,[http/1.1]}{127.0.0.1:44899}
   [junit4]   2> 1974625 INFO  (TEST-TestSQLHandler.doTest-seed#[3F0677B4D21C37A1]) [    ] o.e.j.s.Server Started @1975703ms
   [junit4]   2> 1974625 INFO  (TEST-TestSQLHandler.doTest-seed#[3F0677B4D21C37A1]) [    ] o.a.s.c.s.e.JettySolrRunner Jetty properties: {hostContext=/zi_m, solrconfig=solrconfig.xml, solr.data.dir=/home/jenkins/workspace/Lucene-Solr-7.x-Linux/solr/build/solr-core/test/J1/temp/solr.handler.TestSQLHandler_3F0677B4D21C37A1-001/tempDir-001/jetty3, hostPort=44899, coreRootDirectory=/home/jenkins/workspace/Lucene-Solr-7.x-Linux/solr/build/solr-core/test/J1/../../../../../../../../../home/jenkins/workspace/Lucene-Solr-7.x-Linux/solr/build/solr-core/test/J1/temp/solr.handler.TestSQLHandler_3F0677B4D21C37A1-001/shard-3-001/cores}
   [junit4]   2> 1974625 ERROR (TEST-TestSQLHandler.doTest-seed#[3F0677B4D21C37A1]) [    ] o.a.s.s.StartupLoggingUtils Missing Java Option solr.log.dir. Logging may be missing or incomplete.
   [junit4]   2> 1974625 INFO  (TEST-TestSQLHandler.doTest-seed#[3F0677B4D21C37A1]) [    ] o.a.s.s.SolrDispatchFilter  ___      _       Welcome to Apache Solr? version 7.1.0
   [junit4]   2> 1974625 INFO  (TEST-TestSQLHandler.doTest-seed#[3F0677B4D21C37A1]) [    ] o.a.s.s.SolrDispatchFilter / __| ___| |_ _   Starting in cloud mode on port null
   [junit4]   2> 1974625 INFO  (TEST-TestSQLHandler.doTest-seed#[3F0677B4D21C37A1]) [    ] o.a.s.s.SolrDispatchFilter \__ \/ _ \ | '_|  Install dir: null, Default config dir: null
   [junit4]   2> 1974625 INFO  (TEST-TestSQLHandler.doTest-seed#[3F0677B4D21C37A1]) [    ] o.a.s.s.SolrDispatchFilter |___/\___/_|_|    Start time: 2017-07-09T17:24:51.638881Z
   [junit4]   2> 1974627 INFO  (TEST-TestSQLHandler.doTest-seed#[3F0677B4D21C37A1]) [    ] o.a.s.s.SolrDispatchFilter Loading solr.xml from SolrHome (not found in ZooKeeper)
   [junit4]   2> 1974627 INFO  (TEST-TestSQLHandler.doTest-seed#[3F0677B4D21C37A1]) [    ] o.a.s.c.SolrXmlConfig Loading container configuration from /home/jenkins/workspace/Lucene-Solr-7.x-Linux/solr/build/solr-core/test/J1/temp/solr.handler.TestSQLHandler_3F0677B4D21C37A1-001/shard-3-001/solr.xml
   [junit4]   2> 1974628 INFO  (TEST-TestSQLHandler.doTest-seed#[3F0677B4D21C37A1]) [    ] o.a.s.c.SolrXmlConfig MBean server found: com.sun.jmx.mbeanserver.JmxMBeanServer@74279a61, but no JMX reporters were configured - adding default JMX reporter.
   [junit4]   2> 1974630 INFO  (TEST-TestSQLHandler.doTest-seed#[3F0677B4D21C37A1]) [    ] o.a.s.c.ZkContainer Zookeeper client=127.0.0.1:38697/solr
   [junit4]   2> 1974633 INFO  (TEST-TestSQLHandler.doTest-seed#[3F0677B4D21C37A1]) [    ] o.a.s.c.c.ZkStateReader Updated live nodes from ZooKeeper... (0) -> (3)
   [junit4]   2> 1974633 INFO  (TEST-TestSQLHandler.doTest-seed#[3F0677B4D21C37A1]) [    ] o.a.s.c.Overseer Overseer (id=null) closing
   [junit4]   2> 1974634 INFO  (TEST-TestSQLHandler.doTest-seed#[3F0677B4D21C37A1]) [    ] o.a.s.c.ZkController Register node as live in ZooKeeper:/live_nodes/127.0.0.1:44899_zi_m
   [junit4]   2> 1974634 INFO  (zkCallback-2978-thread-1) [    ] o.a.s.c.c.ZkStateReader Updated live nodes from ZooKeeper... (3) -> (4)
   [junit4]   2> 1974634 INFO  (zkCallback-2972-thread-1) [    ] o.a.s.c.c.ZkStateReader Updated live nodes from ZooKeeper... (3) -> (4)
   [junit4]   2> 1974634 INFO  (zkCallback-2967-thread-1) [    ] o.a.s.c.c.ZkStateReader Updated live nodes from ZooKeeper... (3) -> (4)
   [junit4]   2> 1974634 INFO  (zkCallback-2960-thread-2) [    ] o.a.s.c.c.ZkStateReader Updated live nodes from ZooKeeper... (3) -> (4)
   [junit4]   2> 1974635 INFO  (zkCallback-2984-thread-1) [    ] o.a.s.c.c.ZkStateReader Updated live nodes from ZooKeeper... (3) -> (4)
   [junit4]   2> 1974673 INFO  (TEST-TestSQLHandler.doTest-seed#[3F0677B4D21C37A1]) [    ] o.a.s.m.r.SolrJmxReporter JMX monitoring for 'solr.node' (registry 'solr.node') enabled at server: com.sun.jmx.mbeanserver.JmxMBeanServer@74279a61
   [junit4]   2> 1974679 INFO 

[...truncated too long message...]

.truncated 3 lines...]
   [junit4] JVM J0: stderr was not empty, see: /home/jenkins/workspace/Lucene-Solr-7.x-Linux/solr/build/contrib/solr-analytics/test/temp/junit4-J0-20170709_173315_68917820438121597061886.syserr
   [junit4] >>> JVM J0 emitted unexpected output (verbatim) ----
   [junit4] Java HotSpot(TM) 64-Bit Server VM warning: Option UseConcMarkSweepGC was deprecated in version 9.0 and will likely be removed in a future release.
   [junit4] <<< JVM J0: EOF ----

[...truncated 3 lines...]
   [junit4] JVM J1: stderr was not empty, see: /home/jenkins/workspace/Lucene-Solr-7.x-Linux/solr/build/contrib/solr-analytics/test/temp/junit4-J1-20170709_173315_6894374012595662496824.syserr
   [junit4] >>> JVM J1 emitted unexpected output (verbatim) ----
   [junit4] Java HotSpot(TM) 64-Bit Server VM warning: Option UseConcMarkSweepGC was deprecated in version 9.0 and will likely be removed in a future release.
   [junit4] <<< JVM J1: EOF ----

[...truncated 499 lines...]
   [junit4] JVM J2: stderr was not empty, see: /home/jenkins/workspace/Lucene-Solr-7.x-Linux/solr/build/contrib/solr-clustering/test/temp/junit4-J2-20170709_173346_1747686294787488738753.syserr
   [junit4] >>> JVM J2 emitted unexpected output (verbatim) ----
   [junit4] Java HotSpot(TM) 64-Bit Server VM warning: Option UseConcMarkSweepGC was deprecated in version 9.0 and will likely be removed in a future release.
   [junit4] <<< JVM J2: EOF ----

[...truncated 3 lines...]
   [junit4] JVM J1: stderr was not empty, see: /home/jenkins/workspace/Lucene-Solr-7.x-Linux/solr/build/contrib/solr-clustering/test/temp/junit4-J1-20170709_173346_17410892222022020136669.syserr
   [junit4] >>> JVM J1 emitted unexpected output (verbatim) ----
   [junit4] Java HotSpot(TM) 64-Bit Server VM warning: Option UseConcMarkSweepGC was deprecated in version 9.0 and will likely be removed in a future release.
   [junit4] <<< JVM J1: EOF ----

[...truncated 3 lines...]
   [junit4] JVM J0: stderr was not empty, see: /home/jenkins/workspace/Lucene-Solr-7.x-Linux/solr/build/contrib/solr-clustering/test/temp/junit4-J0-20170709_173346_1741010827574158668553.syserr
   [junit4] >>> JVM J0 emitted unexpected output (verbatim) ----
   [junit4] Java HotSpot(TM) 64-Bit Server VM warning: Option UseConcMarkSweepGC was deprecated in version 9.0 and will likely be removed in a future release.
   [junit4] <<< JVM J0: EOF ----

[...truncated 1131 lines...]
   [junit4] JVM J1: stderr was not empty, see: /home/jenkins/workspace/Lucene-Solr-7.x-Linux/solr/build/contrib/solr-dataimporthandler-extras/test/temp/junit4-J1-20170709_173405_0688090793932192504121.syserr
   [junit4] >>> JVM J1 emitted unexpected output (verbatim) ----
   [junit4] Java HotSpot(TM) 64-Bit Server VM warning: Option UseConcMarkSweepGC was deprecated in version 9.0 and will likely be removed in a future release.
   [junit4] <<< JVM J1: EOF ----

[...truncated 3 lines...]
   [junit4] JVM J0: stderr was not empty, see: /home/jenkins/workspace/Lucene-Solr-7.x-Linux/solr/build/contrib/solr-dataimporthandler-extras/test/temp/junit4-J0-20170709_173405_0685301769237850644356.syserr
   [junit4] >>> JVM J0 emitted unexpected output (verbatim) ----
   [junit4] Java HotSpot(TM) 64-Bit Server VM warning: Option UseConcMarkSweepGC was deprecated in version 9.0 and will likely be removed in a future release.
   [junit4] <<< JVM J0: EOF ----

[...truncated 596 lines...]
   [junit4] JVM J0: stderr was not empty, see: /home/jenkins/workspace/Lucene-Solr-7.x-Linux/solr/build/contrib/solr-dataimporthandler/test/temp/junit4-J0-20170709_173411_79012210037898557672601.syserr
   [junit4] >>> JVM J0 emitted unexpected output (verbatim) ----
   [junit4] Java HotSpot(TM) 64-Bit Server VM warning: Option UseConcMarkSweepGC was deprecated in version 9.0 and will likely be removed in a future release.
   [junit4] <<< JVM J0: EOF ----

   [junit4] JVM J2: stderr was not empty, see: /home/jenkins/workspace/Lucene-Solr-7.x-Linux/solr/build/contrib/solr-dataimporthandler/test/temp/junit4-J2-20170709_173411_79014324935892396270423.syserr
   [junit4] >>> JVM J2 emitted unexpected output (verbatim) ----
   [junit4] Java HotSpot(TM) 64-Bit Server VM warning: Option UseConcMarkSweepGC was deprecated in version 9.0 and will likely be removed in a future release.
   [junit4] <<< JVM J2: EOF ----

   [junit4] JVM J1: stderr was not empty, see: /home/jenkins/workspace/Lucene-Solr-7.x-Linux/solr/build/contrib/solr-dataimporthandler/test/temp/junit4-J1-20170709_173411_7901558472441112856909.syserr
   [junit4] >>> JVM J1 emitted unexpected output (verbatim) ----
   [junit4] Java HotSpot(TM) 64-Bit Server VM warning: Option UseConcMarkSweepGC was deprecated in version 9.0 and will likely be removed in a future release.
   [junit4] <<< JVM J1: EOF ----

[...truncated 503 lines...]
   [junit4] JVM J0: stderr was not empty, see: /home/jenkins/workspace/Lucene-Solr-7.x-Linux/solr/build/contrib/solr-cell/test/temp/junit4-J0-20170709_173434_78114964936607498863078.syserr
   [junit4] >>> JVM J0 emitted unexpected output (verbatim) ----
   [junit4] Java HotSpot(TM) 64-Bit Server VM warning: Option UseConcMarkSweepGC was deprecated in version 9.0 and will likely be removed in a future release.
   [junit4] <<< JVM J0: EOF ----

[...truncated 3 lines...]
   [junit4] JVM J2: stderr was not empty, see: /home/jenkins/workspace/Lucene-Solr-7.x-Linux/solr/build/contrib/solr-cell/test/temp/junit4-J2-20170709_173434_78210650808671217014660.syserr
   [junit4] >>> JVM J2 emitted unexpected output (verbatim) ----
   [junit4] Java HotSpot(TM) 64-Bit Server VM warning: Option UseConcMarkSweepGC was deprecated in version 9.0 and will likely be removed in a future release.
   [junit4] <<< JVM J2: EOF ----

[...truncated 3 lines...]
   [junit4] JVM J1: stderr was not empty, see: /home/jenkins/workspace/Lucene-Solr-7.x-Linux/solr/build/contrib/solr-cell/test/temp/junit4-J1-20170709_173434_78113240438226633875061.syserr
   [junit4] >>> JVM J1 emitted unexpected output (verbatim) ----
   [junit4] Java HotSpot(TM) 64-Bit Server VM warning: Option UseConcMarkSweepGC was deprecated in version 9.0 and will likely be removed in a future release.
   [junit4] <<< JVM J1: EOF ----

[...truncated 507 lines...]
   [junit4] JVM J0: stderr was not empty, see: /home/jenkins/workspace/Lucene-Solr-7.x-Linux/solr/build/contrib/solr-langid/test/temp/junit4-J0-20170709_173446_2906923940501365532856.syserr
   [junit4] >>> JVM J0 emitted unexpected output (verbatim) ----
   [junit4] Java HotSpot(TM) 64-Bit Server VM warning: Option UseConcMarkSweepGC was deprecated in version 9.0 and will likely be removed in a future release.
   [junit4] <<< JVM J0: EOF ----

   [junit4] JVM J1: stderr was not empty, see: /home/jenkins/workspace/Lucene-Solr-7.x-Linux/solr/build/contrib/solr-langid/test/temp/junit4-J1-20170709_173446_29014763245402538616659.syserr
   [junit4] >>> JVM J1 emitted unexpected output (verbatim) ----
   [junit4] Java HotSpot(TM) 64-Bit Server VM warning: Option UseConcMarkSweepGC was deprecated in version 9.0 and will likely be removed in a future release.
   [junit4] <<< JVM J1: EOF ----

[...truncated 587 lines...]
   [junit4] JVM J2: stderr was not empty, see: /home/jenkins/workspace/Lucene-Solr-7.x-Linux/solr/build/contrib/solr-ltr/test/temp/junit4-J2-20170709_173452_36210032133769257902068.syserr
   [junit4] >>> JVM J2 emitted unexpected output (verbatim) ----
   [junit4] Java HotSpot(TM) 64-Bit Server VM warning: Option UseConcMarkSweepGC was deprecated in version 9.0 and will likely be removed in a future release.
   [junit4] <<< JVM J2: EOF ----

[...truncated 3 lines...]
   [junit4] JVM J0: stderr was not empty, see: /home/jenkins/workspace/Lucene-Solr-7.x-Linux/solr/build/contrib/solr-ltr/test/temp/junit4-J0-20170709_173452_3626962427993052658697.syserr
   [junit4] >>> JVM J0 emitted unexpected output (verbatim) ----
   [junit4] Java HotSpot(TM) 64-Bit Server VM warning: Option UseConcMarkSweepGC was deprecated in version 9.0 and will likely be removed in a future release.
   [junit4] <<< JVM J0: EOF ----

[...truncated 6 lines...]
   [junit4] JVM J1: stderr was not empty, see: /home/jenkins/workspace/Lucene-Solr-7.x-Linux/solr/build/contrib/solr-ltr/test/temp/junit4-J1-20170709_173452_3629262803259362483824.syserr
   [junit4] >>> JVM J1 emitted unexpected output (verbatim) ----
   [junit4] Java HotSpot(TM) 64-Bit Server VM warning: Option UseConcMarkSweepGC was deprecated in version 9.0 and will likely be removed in a future release.
   [junit4] <<< JVM J1: EOF ----

[...truncated 538 lines...]
   [junit4] JVM J1: stderr was not empty, see: /home/jenkins/workspace/Lucene-Solr-7.x-Linux/solr/build/contrib/solr-uima/test/temp/junit4-J1-20170709_173517_9208479622292382618824.syserr
   [junit4] >>> JVM J1 emitted unexpected output (verbatim) ----
   [junit4] Java HotSpot(TM) 64-Bit Server VM warning: Option UseConcMarkSweepGC was deprecated in version 9.0 and will likely be removed in a future release.
   [junit4] <<< JVM J1: EOF ----

[...truncated 3 lines...]
   [junit4] JVM J0: stderr was not empty, see: /home/jenkins/workspace/Lucene-Solr-7.x-Linux/solr/build/contrib/solr-uima/test/temp/junit4-J0-20170709_173517_92010093514091003932901.syserr
   [junit4] >>> JVM J0 emitted unexpected output (verbatim) ----
   [junit4] Java HotSpot(TM) 64-Bit Server VM warning: Option UseConcMarkSweepGC was deprecated in version 9.0 and will likely be removed in a future release.
   [junit4] <<< JVM J0: EOF ----

[...truncated 494 lines...]
   [junit4] JVM J0: stderr was not empty, see: /home/jenkins/workspace/Lucene-Solr-7.x-Linux/solr/build/contrib/solr-velocity/test/temp/junit4-J0-20170709_173529_94212954291617155037580.syserr
   [junit4] >>> JVM J0 emitted unexpected output (verbatim) ----
   [junit4] Java HotSpot(TM) 64-Bit Server VM warning: Option UseConcMarkSweepGC was deprecated in version 9.0 and will likely be removed in a future release.
   [junit4] <<< JVM J0: EOF ----

[...truncated 28984 lines...]