You are viewing a plain text version of this content. The canonical link for it is here.
Posted to dev@jmeter.apache.org by Apache Jenkins Server <je...@builds.apache.org> on 2018/02/14 18:29:20 UTC

Build failed in Jenkins: JMeter-trunk #6675

See <https://builds.apache.org/job/JMeter-trunk/6675/display/redirect?page=changes>

Changes:

[fschumacher] Don't start a new JVM for each junit test when using complete-junit

This cuts down the time to complete the junit tests considerably. It
takes less then two minutes on my machine.

------------------------------------------
[...truncated 187.65 KB...]
   [jmeter] Created the tree successfully using testfiles/BatchTestLocal.jmx
   [jmeter] Starting the test @ Wed Feb 14 18:28:28 UTC 2018 (1518632908912)
   [jmeter] Waiting for possible Shutdown/StopTestNow/Heapdump message on port 4445
   [jmeter] summary +      6 in 00:00:01 =    5.8/s Avg:   122 Min:    14 Max:   255 Err:     0 (0.00%) Active: 1 Started: 1 Finished: 0
   [jmeter] java.lang.RuntimeException: java.io.IOException: No space left on device
   [jmeter] 	at org.jacoco.agent.rt.internal_290345e.core.data.ExecutionDataWriter.visitClassExecution(ExecutionDataWriter.java:105)
   [jmeter] 	at org.jacoco.agent.rt.internal_290345e.core.data.ExecutionDataStore.accept(ExecutionDataStore.java:169)
   [jmeter] 	at org.jacoco.agent.rt.internal_290345e.core.runtime.RuntimeData.collect(RuntimeData.java:87)
   [jmeter] 	at org.jacoco.agent.rt.internal_290345e.output.FileOutput.writeExecutionData(FileOutput.java:56)
   [jmeter] 	at org.jacoco.agent.rt.internal_290345e.Agent.shutdown(Agent.java:137)
   [jmeter] 	at org.jacoco.agent.rt.internal_290345e.Agent$1.run(Agent.java:54)
   [jmeter] Caused by: java.io.IOException: No space left on device
   [jmeter] 	at java.io.FileOutputStream.writeBytes(Native Method)
   [jmeter] 	at java.io.FileOutputStream.write(FileOutputStream.java:326)
   [jmeter] 	at java.io.DataOutputStream.write(DataOutputStream.java:107)
   [jmeter] 	at java.io.DataOutputStream.writeUTF(DataOutputStream.java:401)
   [jmeter] 	at java.io.DataOutputStream.writeUTF(DataOutputStream.java:323)
   [jmeter] 2018-02-14 18:29:19,443 StandardJMeterEngine ERROR Unable to write to stream BatchTestLocal.log for appender jmeter-log: org.apache.logging.log4j.core.appender.AppenderLoggingException: Error writing to stream BatchTestLocal.log	at org.jacoco.agent.rt.internal_290345e.core.data.ExecutionDataWriter.visitClassExecution(ExecutionDataWriter.java:102)
   [jmeter] 2018-02-14 18:29:19,445 StandardJMeterEngine ERROR An exception occurred processing Appender jmeter-log org.apache.logging.log4j.core.appender.AppenderLoggingException: Error writing to stream BatchTestLocal.log
   [jmeter] 
   [jmeter] 	... 5 more
   [jmeter] 	at org.apache.logging.log4j.core.appender.OutputStreamManager.writeToDestination(OutputStreamManager.java:264)
   [jmeter] 	at org.apache.logging.log4j.core.appender.FileManager.writeToDestination(FileManager.java:261)
   [jmeter] 	at org.apache.logging.log4j.core.appender.OutputStreamManager.flushBuffer(OutputStreamManager.java:294)
   [jmeter] 	at org.apache.logging.log4j.core.appender.OutputStreamManager.flush(OutputStreamManager.java:303)
   [jmeter] 	at org.apache.logging.log4j.core.appender.AbstractOutputStreamAppender.directEncodeEvent(AbstractOutputStreamAppender.java:179)
   [jmeter] 	at org.apache.logging.log4j.core.appender.AbstractOutputStreamAppender.tryAppend(AbstractOutputStreamAppender.java:170)
   [jmeter] 	at org.apache.logging.log4j.core.appender.AbstractOutputStreamAppender.append(AbstractOutputStreamAppender.java:161)
   [jmeter] 	at org.apache.logging.log4j.core.config.AppenderControl.tryCallAppender(AppenderControl.java:156)
   [jmeter] 	at org.apache.logging.log4j.core.config.AppenderControl.callAppender0(AppenderControl.java:129)
   [jmeter] 	at org.apache.logging.log4j.core.config.AppenderControl.callAppenderPreventRecursion(AppenderControl.java:120)
   [jmeter] 	at org.apache.logging.log4j.core.config.AppenderControl.callAppender(AppenderControl.java:84)
   [jmeter] 	at org.apache.logging.log4j.core.config.LoggerConfig.callAppenders(LoggerConfig.java:448)
   [jmeter] 	at org.apache.logging.log4j.core.config.LoggerConfig.processLogEvent(LoggerConfig.java:433)
   [jmeter] 	at org.apache.logging.log4j.core.config.LoggerConfig.log(LoggerConfig.java:417)
   [jmeter] 	at org.apache.logging.log4j.core.config.LoggerConfig.log(LoggerConfig.java:403)
   [jmeter] 	at org.apache.logging.log4j.core.config.AwaitCompletionReliabilityStrategy.log(AwaitCompletionReliabilityStrategy.java:63)
   [jmeter] 	at org.apache.logging.log4j.core.Logger.logMessage(Logger.java:146)
   [jmeter] 	at org.apache.logging.log4j.spi.AbstractLogger.tryLogMessage(AbstractLogger.java:2163)
   [jmeter] 	at org.apache.logging.log4j.spi.AbstractLogger.logMessageTrackRecursion(AbstractLogger.java:2118)
   [jmeter] 	at org.apache.logging.log4j.spi.AbstractLogger.logMessageSafely(AbstractLogger.java:2101)
   [jmeter] 	at org.apache.logging.log4j.spi.AbstractLogger.logMessage(AbstractLogger.java:2012)
   [jmeter] 	at org.apache.logging.log4j.spi.AbstractLogger.logIfEnabled(AbstractLogger.java:1883)
   [jmeter] 	at org.apache.logging.slf4j.Log4jLogger.warn(Log4jLogger.java:244)
   [jmeter] 	at org.apache.jmeter.reporters.ResultCollector.finalizeFileOutput(ResultCollector.java:619)
   [jmeter] 	at org.apache.jmeter.reporters.ResultCollector.testEnded(ResultCollector.java:302)
   [jmeter] 	at org.apache.jmeter.reporters.ResultCollector.testEnded(ResultCollector.java:345)
   [jmeter] 	at org.apache.jmeter.engine.StandardJMeterEngine.notifyTestListenersOfEnd(StandardJMeterEngine.java:227)
   [jmeter] 	at org.apache.jmeter.engine.StandardJMeterEngine.run(StandardJMeterEngine.java:495)
   [jmeter] 	at java.lang.Thread.run(Thread.java:748)
   [jmeter] Caused by: java.io.IOException: No space left on device
   [jmeter] 	at java.io.FileOutputStream.writeBytes(Native Method)
   [jmeter] 	at java.io.FileOutputStream.write(FileOutputStream.java:326)
   [jmeter] 	at org.apache.logging.log4j.core.appender.OutputStreamManager.writeToDestination(OutputStreamManager.java:262)
   [jmeter] 	... 28 more
   [jmeter] 
   [jmeter] 2018-02-14 18:29:19,450 StandardJMeterEngine ERROR Unable to write to stream BatchTestLocal.log for appender jmeter-log: org.apache.logging.log4j.core.appender.AppenderLoggingException: Error writing to stream BatchTestLocal.log
   [jmeter] 2018-02-14 18:29:19,451 StandardJMeterEngine ERROR An exception occurred processing Appender jmeter-log org.apache.logging.log4j.core.appender.AppenderLoggingException: Error writing to stream BatchTestLocal.log
   [jmeter] 	at org.apache.logging.log4j.core.appender.OutputStreamManager.writeToDestination(OutputStreamManager.java:264)
   [jmeter] 	at org.apache.logging.log4j.core.appender.FileManager.writeToDestination(FileManager.java:261)
   [jmeter] 	at org.apache.logging.log4j.core.appender.OutputStreamManager.flushBuffer(OutputStreamManager.java:294)
   [jmeter] 	at org.apache.logging.log4j.core.appender.OutputStreamManager.flush(OutputStreamManager.java:303)
   [jmeter] 	at org.apache.logging.log4j.core.appender.AbstractOutputStreamAppender.directEncodeEvent(AbstractOutputStreamAppender.java:179)
   [jmeter] 	at org.apache.logging.log4j.core.appender.AbstractOutputStreamAppender.tryAppend(AbstractOutputStreamAppender.java:170)
   [jmeter] 	at org.apache.logging.log4j.core.appender.AbstractOutputStreamAppender.append(AbstractOutputStreamAppender.java:161)
   [jmeter] 	at org.apache.logging.log4j.core.config.AppenderControl.tryCallAppender(AppenderControl.java:156)
   [jmeter] 	at org.apache.logging.log4j.core.config.AppenderControl.callAppender0(AppenderControl.java:129)
   [jmeter] 	at org.apache.logging.log4j.core.config.AppenderControl.callAppenderPreventRecursion(AppenderControl.java:120)
   [jmeter] 	at org.apache.logging.log4j.core.config.AppenderControl.callAppender(AppenderControl.java:84)
   [jmeter] 	at org.apache.logging.log4j.core.config.LoggerConfig.callAppenders(LoggerConfig.java:448)
   [jmeter] 	at org.apache.logging.log4j.core.config.LoggerConfig.processLogEvent(LoggerConfig.java:433)
   [jmeter] 	at org.apache.logging.log4j.core.config.LoggerConfig.log(LoggerConfig.java:417)
   [jmeter] 	at org.apache.logging.log4j.core.config.LoggerConfig.log(LoggerConfig.java:403)
   [jmeter] 	at org.apache.logging.log4j.core.config.AwaitCompletionReliabilityStrategy.log(AwaitCompletionReliabilityStrategy.java:63)
   [jmeter] 	at org.apache.logging.log4j.core.Logger.logMessage(Logger.java:146)
   [jmeter] 	at org.apache.logging.log4j.spi.AbstractLogger.tryLogMessage(AbstractLogger.java:2163)
   [jmeter] 	at org.apache.logging.log4j.spi.AbstractLogger.logMessageTrackRecursion(AbstractLogger.java:2118)
   [jmeter] 	at org.apache.logging.log4j.spi.AbstractLogger.logMessageSafely(AbstractLogger.java:2101)
   [jmeter] 	at org.apache.logging.log4j.spi.AbstractLogger.logMessage(AbstractLogger.java:2012)
   [jmeter] 	at org.apache.logging.log4j.spi.AbstractLogger.logIfEnabled(AbstractLogger.java:1883)
   [jmeter] 	at org.apache.logging.slf4j.Log4jLogger.warn(Log4jLogger.java:244)
   [jmeter] 	at org.apache.jmeter.reporters.ResultCollector.finalizeFileOutput(ResultCollector.java:619)
   [jmeter] 	at org.apache.jmeter.reporters.ResultCollector.testEnded(ResultCollector.java:302)
   [jmeter] 	at org.apache.jmeter.reporters.ResultCollector.testEnded(ResultCollector.java:345)
   [jmeter] 	at org.apache.jmeter.engine.StandardJMeterEngine.notifyTestListenersOfEnd(StandardJMeterEngine.java:227)
   [jmeter] 	at org.apache.jmeter.engine.StandardJMeterEngine.run(StandardJMeterEngine.java:495)
   [jmeter] 	at java.lang.Thread.run(Thread.java:748)
   [jmeter] Caused by: java.io.IOException: No space left on device
   [jmeter] 	at java.io.FileOutputStream.writeBytes(Native Method)
   [jmeter] 	at java.io.FileOutputStream.write(FileOutputStream.java:326)
   [jmeter] 	at org.apache.logging.log4j.core.appender.OutputStreamManager.writeToDestination(OutputStreamManager.java:262)
   [jmeter] 	... 28 more
   [jmeter] 
   [jmeter] summary +    127 in 00:00:49 =    2.6/s Avg:   117 Min:     1 Max:   241 Err:    16 (12.60%) Active: 0 Started: 1 Finished: 1
   [jmeter] summary =    133 in 00:00:50 =    2.7/s Avg:   118 Min:     1 Max:   255 Err:    16 (12.03%)
   [jmeter] Tidying up ...    @ Wed Feb 14 18:29:19 UTC 2018 (1518632959455)
   [jmeter] ... end of run
 [loadfile] Do not set property file2.csv as its length is 0.

BUILD FAILED
<https://builds.apache.org/job/JMeter-trunk/ws/trunk/build.xml>:2778: CSV Files are not identical.
        <https://builds.apache.org/job/JMeter-trunk/ws/trunk/bin/testfiles/BatchTestLocal.csv>
        label,responseCode,responseMessage,threadName,dataType,success,failureMessage,bytes,grpThreads,allThreads,URL,Filename,SampleCount,ErrorCount
Setup 1,200,OK,Setup Thread Group 1-1,text,true,,0,1,1,null,,1,0
Java 1 C1=1,200,OK,Thread Group 1-1,text,true,,10,1,1,null,,1,0
Java 1 C1=1,200,OK,Thread Group 1-1,text,true,,10,1,1,null,,1,0
Java 1 C1=1,200,OK,Thread Group 1-1,text,true,,10,1,1,null,,1,0
Loop5 C1=1 C2=1 C3=1,200,OK,Thread Group 1-1,text,true,,0,1,1,null,,1,0
Loop5 C1=1 C2=2 C3=2,200,OK,Thread Group 1-1,text,true,,0,1,1,null,,1,0
Loop5 C1=1 C2=3 C3=3,200,OK,Thread Group 1-1,text,true,,0,1,1,null,,1,0
If Test C1=1 C2=3 C3=3,200,OK,Thread Group 1-1,text,true,,0,1,1,null,,1,0
Loop3 C1=1 C2=3 C3=3,200,OK,Thread Group 1-1,text,true,,0,1,1,null,,1,0
Module,200,OK,Thread Group 1-1,text,true,,0,1,1,null,,1,0
Loop3 C1=1 C2=3 C3=3,200,OK,Thread Group 1-1,text,true,,0,1,1,null,,1,0
Module,200,OK,Thread Group 1-1,text,true,,0,1,1,null,,1,0
Loop3 C1=1 C2=3 C3=3,200,OK,Thread Group 1-1,text,true,,0,1,1,null,,1,0
Module,200,OK,Thread Group 1-1,text,true,,0,1,1,null,,1,0
Loop5 C1=1 C2=4 C3=4,200,OK,Thread Group 1-1,text,true,,0,1,1,null,,1,0
Loop5 C1=1 C2=5 C3=5,200,OK,Thread Group 1-1,text,true,,0,1,1,null,,1,0
Java If once 1,,,Thread Group 1-1,text,false,,0,1,1,null,,1,1
Java If once 2,200,OK,Thread Group 1-1,text,true,,0,1,1,null,,1,0
Java If all 1,,,Thread Group 1-1,text,false,,0,1,1,null,,1,1
Java OK,200,OK,Thread Group 1-1,text,true,,0,1,1,null,,1,0
Java If once 1,,,Thread Group 1-1,text,false,,0,1,1,null,,1,1
Java If once 2,200,OK,Thread Group 1-1,text,true,,0,1,1,null,,1,0
Java If all 1,,,Thread Group 1-1,text,false,,0,1,1,null,,1,1
Java OK,200,OK,Thread Group 1-1,text,true,,0,1,1,null,,1,0
Java 1 C1=2,200,OK,Thread Group 1-1,text,true,,10,1,1,null,,1,0
Java 1 C1=2,200,OK,Thread Group 1-1,text,true,,10,1,1,null,,1,0
Java 1 C1=2,200,OK,Thread Group 1-1,text,true,,10,1,1,null,,1,0
Loop5 C1=2 C2=1 C3=6,200,OK,Thread Group 1-1,text,true,,0,1,1,null,,1,0
If Test C1=2 C2=1 C3=6,200,OK,Thread Group 1-1,text,true,,0,1,1,null,,1,0
Loop3 C1=2 C2=1 C3=6,200,OK,Thread Group 1-1,text,true,,0,1,1,null,,1,0
Module,200,OK,Thread Group 1-1,text,true,,0,1,1,null,,1,0
Loop3 C1=2 C2=1 C3=6,200,OK,Thread Group 1-1,text,true,,0,1,1,null,,1,0
Module,200,OK,Thread Group 1-1,text,true,,0,1,1,null,,1,0
Loop3 C1=2 C2=1 C3=6,200,OK,Thread Group 1-1,text,true,,0,1,1,null,,1,0
Module,200,OK,Thread Group 1-1,text,true,,0,1,1,null,,1,0
Loop5 C1=2 C2=2 C3=7,200,OK,Thread Group 1-1,text,true,,0,1,1,null,,1,0
Loop5 C1=2 C2=3 C3=8,200,OK,Thread Group 1-1,text,true,,0,1,1,null,,1,0
Loop5 C1=2 C2=4 C3=9,200,OK,Thread Group 1-1,text,true,,0,1,1,null,,1,0
If Test C1=2 C2=4 C3=9,200,OK,Thread Group 1-1,text,true,,0,1,1,null,,1,0
Loop3 C1=2 C2=4 C3=9,200,OK,Thread Group 1-1,text,true,,0,1,1,null,,1,0
Module,200,OK,Thread Group 1-1,text,true,,0,1,1,null,,1,0
Loop3 C1=2 C2=4 C3=9,200,OK,Thread Group 1-1,text,true,,0,1,1,null,,1,0
Module,200,OK,Thread Group 1-1,text,true,,0,1,1,null,,1,0
Loop3 C1=2 C2=4 C3=9,200,OK,Thread Group 1-1,text,true,,0,1,1,null,,1,0
Module,200,OK,Thread Group 1-1,text,true,,0,1,1,null,,1,0
Loop5 C1=2 C2=5 C3=10,200,OK,Thread Group 1-1,text,true,,0,1,1,null,,1,0
Java If once 1,,,Thread Group 1-1,text,false,,0,1,1,null,,1,1
Java If once 2,200,OK,Thread Group 1-1,text,true,,0,1,1,null,,1,0
Java If all 1,,,Thread Group 1-1,text,false,,0,1,1,null,,1,1
Java OK,200,OK,Thread Group 1-1,text,true,,0,1,1,null,,1,0
Java If once 1,,,Thread Group 1-1,text,false,,0,1,1,null,,1,1
Java If once 2,200,OK,Thread Group 1-1,text,true,,0,1,1,null,,1,0
Java If all 1,,,Thread Group 1-1,text,false,,0,1,1,null,,1,1
Java OK,200,OK,Thread Group 1-1,text,true,,0,1,1,null,,1,0
Java 1 C1=1,200,OK,Thread Group 1-2,text,true,,10,1,1,null,,1,0
Java 1 C1=1,200,OK,Thread Group 1-2,text,true,,10,1,1,null,,1,0
Java 1 C1=1,200,OK,Thread Group 1-2,text,true,,10,1,1,null,,1,0
Loop5 C1=1 C2=1 C3=11,200,OK,Thread Group 1-2,text,true,,0,1,1,null,,1,0
Loop5 C1=1 C2=2 C3=12,200,OK,Thread Group 1-2,text,true,,0,1,1,null,,1,0
If Test C1=1 C2=2 C3=12,200,OK,Thread Group 1-2,text,true,,0,1,1,null,,1,0
Loop3 C1=1 C2=2 C3=12,200,OK,Thread Group 1-2,text,true,,0,1,1,null,,1,0
Module,200,OK,Thread Group 1-2,text,true,,0,1,1,null,,1,0
Loop3 C1=1 C2=2 C3=12,200,OK,Thread Group 1-2,text,true,,0,1,1,null,,1,0
Module,200,OK,Thread Group 1-2,text,true,,0,1,1,null,,1,0
Loop3 C1=1 C2=2 C3=12,200,OK,Thread Group 1-2,text,true,,0,1,1,null,,1,0
Module,200,OK,Thread Group 1-2,text,true,,0,1,1,null,,1,0
Loop5 C1=1 C2=3 C3=13,200,OK,Thread Group 1-2,text,true,,0,1,1,null,,1,0
Loop5 C1=1 C2=4 C3=14,200,OK,Thread Group 1-2,text,true,,0,1,1,null,,1,0
Loop5 C1=1 C2=5 C3=15,200,OK,Thread Group 1-2,text,true,,0,1,1,null,,1,0
If Test C1=1 C2=5 C3=15,200,OK,Thread Group 1-2,text,true,,0,1,1,null,,1,0
Loop3 C1=1 C2=5 C3=15,200,OK,Thread Group 1-2,text,true,,0,1,1,null,,1,0
Module,200,OK,Thread Group 1-2,text,true,,0,1,1,null,,1,0
Loop3 C1=1 C2=5 C3=15,200,OK,Thread Group 1-2,text,true,,0,1,1,null,,1,0
Module,200,OK,Thread Group 1-2,text,true,,0,1,1,null,,1,0
Loop3 C1=1 C2=5 C3=15,200,OK,Thread Group 1-2,text,true,,0,1,1,null,,1,0
Module,200,OK,Thread Group 1-2,text,true,,0,1,1,null,,1,0
Java If once 1,,,Thread Group 1-2,text,false,,0,1,1,null,,1,1
Java If once 2,200,OK,Thread Group 1-2,text,true,,0,1,1,null,,1,0
Java If all 1,,,Thread Group 1-2,text,false,,0,1,1,null,,1,1
Java OK,200,OK,Thread Group 1-2,text,true,,0,1,1,null,,1,0
Java If once 1,,,Thread Group 1-2,text,false,,0,1,1,null,,1,1
Java If once 2,200,OK,Thread Group 1-2,text,true,,0,1,1,null,,1,0
Java If all 1,,,Thread Group 1-2,text,false,,0,1,1,null,,1,1
Java OK,200,OK,Thread Group 1-2,text,true,,0,1,1,null,,1,0
Java 1 C1=2,200,OK,Thread Group 1-2,text,true,,10,1,1,null,,1,0
Java 1 C1=2,200,OK,Thread Group 1-2,text,true,,10,1,1,null,,1,0
Java 1 C1=2,200,OK,Thread Group 1-2,text,true,,10,1,1,null,,1,0
Loop5 C1=2 C2=1 C3=16,200,OK,Thread Group 1-2,text,true,,0,1,1,null,,1,0
Loop5 C1=2 C2=2 C3=17,200,OK,Thread Group 1-2,text,true,,0,1,1,null,,1,0
Loop5 C1=2 C2=3 C3=18,200,OK,Thread Group 1-2,text,true,,0,1,1,null,,1,0
If Test C1=2 C2=3 C3=18,200,OK,Thread Group 1-2,text,true,,0,1,1,null,,1,0
Loop3 C1=2 C2=3 C3=18,200,OK,Thread Group 1-2,text,true,,0,1,1,null,,1,0
Module,200,OK,Thread Group 1-2,text,true,,0,1,1,null,,1,0
Loop3 C1=2 C2=3 C3=18,200,OK,Thread Group 1-2,text,true,,0,1,1,null,,1,0
Module,200,OK,Thread Group 1-2,text,true,,0,1,1,null,,1,0
Loop3 C1=2 C2=3 C3=18,200,OK,Thread Group 1-2,text,true,,0,1,1,null,,1,0
Module,200,OK,Thread Group 1-2,text,true,,0,1,1,null,,1,0
Loop5 C1=2 C2=4 C3=19,200,OK,Thread Group 1-2,text,true,,0,1,1,null,,1,0
Loop5 C1=2 C2=5 C3=20,200,OK,Thread Group 1-2,text,true,,0,1,1,null,,1,0
Java If once 1,,,Thread Group 1-2,text,false,,0,1,1,null,,1,1
Java If once 2,200,OK,Thread Group 1-2,text,true,,0,1,1,null,,1,0
Java If all 1,,,Thread Group 1-2,text,false,,0,1,1,null,,1,1
Java OK,200,OK,Thread Group 1-2,text,true,,0,1,1,null,,1,0
Java If once 1,,,Thread Group 1-2,text,false,,0,1,1,null,,1,1
Java If once 2,200,OK,Thread Group 1-2,text,true,,0,1,1,null,,1,0
Java If all 1,,,Thread Group 1-2,text,false,,0,1,1,null,,1,1
Java OK,200,OK,Thread Group 1-2,text,true,,0,1,1,null,,1,0
"HTTP ""Request,",200,OK,Thread Group 2-1,text,true,,134648,1,1,file:testfiles/BatchTestLocal.jmx,,1,0
1 1,200,OK,Thread Group 2-1,text,true,,0,1,1,null,,1,0
2 2,200,OK,Thread Group 2-1,text,true,,0,1,1,null,,1,0
3 3,200,OK,Thread Group 2-1,text,true,,0,1,1,null,,1,0
0 4,200,OK,Thread Group 2-1,text,true,,0,1,1,null,,1,0
NAME USER1,200,OK,Thread Group 3-1,text,true,,0,1,1,null,,1,0
TG1 = 3,200,OK,Thread Group 4-1,text,true,,0,1,1,null,,1,0
TG OO = 1,200,OK,Thread Group 4-1,text,true,,0,1,1,null,,1,0
TG Loop =3,200,OK,Thread Group 4-1,text,true,,0,1,1,null,,1,0
TG2 = 3,200,OK,Thread Group 4-1,text,true,,0,1,1,null,,1,0
TG1 = 3,200,OK,Thread Group 4-1,text,true,,0,1,1,null,,1,0
TG Loop =3,200,OK,Thread Group 4-1,text,true,,0,1,1,null,,1,0
TG2 = 3,200,OK,Thread Group 4-1,text,true,,0,1,1,null,,1,0
TG1 = 3,200,OK,Thread Group 4-1,text,true,,0,1,1,null,,1,0
TG Loop =3,200,OK,Thread Group 4-1,text,true,,0,1,1,null,,1,0
TG2 = 3,200,OK,Thread Group 4-1,text,true,,0,1,1,null,,1,0
CSV_VAR=2,200,OK,CSV Test 6-1,text,true,,0,1,1,null,,1,0
CSV_VAR=3,200,OK,CSV Test 6-1,text,true,,0,1,1,null,,1,0
CSV_VAR=1,200,OK,CSV Test 6-1,text,true,,0,1,1,null,,1,0
CSV_VAR=2,200,OK,CSV Test 6-1,text,true,,0,1,1,null,,1,0
BSH Counter: 1,200,OK,Bug 48943 7-1,text,true,,0,1,1,null,,1,0
BSH Counter: 2,200,OK,Bug 48943 7-1,text,true,,0,1,1,null,,1,0
BSH Counter: 3,200,OK,Bug 48943 7-1,text,true,,0,1,1,null,,1,0
BSF Sampler,200,OK,BSF/JSR 8-1,text,true,,3,1,1,null,,1,0
JSR223 Sampler,200,OK,BSF/JSR 8-1,text,true,,3,1,1,null,,1,0
Post 1,200,OK,Post Thread Group 1-1,text,true,,0,1,1,null,,1,0

        <https://builds.apache.org/job/JMeter-trunk/ws/trunk/bin/BatchTestLocal.csv>
        ${file2.csv}

Total time: 3 minutes 8 seconds
Build step 'Invoke Ant' marked build as failure
[locks-and-latches] Releasing all the locks
[locks-and-latches] All the locks released
Archiving artifacts
Recording test results
ERROR: Step ?Publish JUnit test result report? failed: Test reports were found but none of them are new. Did leafNodes run? 
For example, <https://builds.apache.org/job/JMeter-trunk/ws/trunk/reports/TEST-org.apache.commons.cli.avalon.ClutilTestCase.xml> is 22 days old


Jenkins build is back to normal : JMeter-trunk #6677

Posted by Apache Jenkins Server <je...@builds.apache.org>.
See <https://builds.apache.org/job/JMeter-trunk/6677/display/redirect>


Build failed in Jenkins: JMeter-trunk #6676

Posted by Apache Jenkins Server <je...@builds.apache.org>.
See <https://builds.apache.org/job/JMeter-trunk/6676/display/redirect>

------------------------------------------
[...truncated 396.83 KB...]
     [echo] Checking xmlpull-1.1.3.1.jar
     [echo] Deleting xmlpull-* (excluding xmlpull-1.1.3.1.jar)

setproxy:

_get_jarfile:
     [echo] Fetching: lib/xmlpull-1.1.3.1.jar
      [get] Getting: https://repo1.maven.org/maven2/xmlpull/xmlpull/1.1.3.1/xmlpull-1.1.3.1.jar
      [get] To: <https://builds.apache.org/job/JMeter-trunk/ws/trunk/build/xmlpull-1.1.3.1.jar>

_checkMD5:
     [echo] Checksum OK: xmlpull-1.1.3.1.jar
     [move] Moving 1 file to <https://builds.apache.org/job/JMeter-trunk/ws/trunk/lib>
     [move] Attempting to rename: <https://builds.apache.org/job/JMeter-trunk/ws/trunk/build/xmlpull-1.1.3.1.jar> to <https://builds.apache.org/job/JMeter-trunk/ws/trunk/lib/xmlpull-1.1.3.1.jar>

setproxy:

_get_zipfile:

_check_exists:

_check_jarfile:
     [echo] Checking xpp3_min-1.1.4c.jar
     [echo] Deleting xpp3_min-1.1.4c.jar (excluding xpp3_min-1.1.4c.jar)

setproxy:

_get_jarfile:
     [echo] Fetching: lib/xpp3_min-1.1.4c.jar
      [get] Getting: https://repo1.maven.org/maven2/xpp3/xpp3_min/1.1.4c/xpp3_min-1.1.4c.jar
      [get] To: <https://builds.apache.org/job/JMeter-trunk/ws/trunk/build/xpp3_min-1.1.4c.jar>

_checkMD5:
     [echo] Checksum OK: xpp3_min-1.1.4c.jar
     [move] Moving 1 file to <https://builds.apache.org/job/JMeter-trunk/ws/trunk/lib>
     [move] Attempting to rename: <https://builds.apache.org/job/JMeter-trunk/ws/trunk/build/xpp3_min-1.1.4c.jar> to <https://builds.apache.org/job/JMeter-trunk/ws/trunk/lib/xpp3_min-1.1.4c.jar>

setproxy:

_get_zipfile:

_check_exists:

_check_jarfile:
     [echo] Checking xstream-1.4.10.jar
     [echo] Deleting xstream-* (excluding xstream-1.4.10.jar)

setproxy:

_get_jarfile:
     [echo] Fetching: lib/xstream-1.4.10.jar
      [get] Getting: https://repo1.maven.org/maven2/com/thoughtworks/xstream/xstream/1.4.10/xstream-1.4.10.jar
      [get] To: <https://builds.apache.org/job/JMeter-trunk/ws/trunk/build/xstream-1.4.10.jar>

_checkMD5:
     [echo] Checksum OK: xstream-1.4.10.jar
     [move] Moving 1 file to <https://builds.apache.org/job/JMeter-trunk/ws/trunk/lib>
     [move] Attempting to rename: <https://builds.apache.org/job/JMeter-trunk/ws/trunk/build/xstream-1.4.10.jar> to <https://builds.apache.org/job/JMeter-trunk/ws/trunk/lib/xstream-1.4.10.jar>

setproxy:

_get_zipfile:

_check_exists:

_check_jarfile:
     [echo] Checking hsqldb-2.4.0.jar
     [echo] Deleting hsqldb-* (excluding hsqldb-2.4.0.jar)

setproxy:

_get_jarfile:
     [echo] Fetching: <https://builds.apache.org/job/JMeter-trunk/ws/trunk/lib/opt/hsqldb-2.4.0.jar>
      [get] Getting: https://repo1.maven.org/maven2/org/hsqldb/hsqldb/2.4.0/hsqldb-2.4.0.jar
      [get] To: <https://builds.apache.org/job/JMeter-trunk/ws/trunk/build/hsqldb-2.4.0.jar>

_checkMD5:
     [echo] Checksum OK: hsqldb-2.4.0.jar
     [move] Moving 1 file to <https://builds.apache.org/job/JMeter-trunk/ws/trunk/lib/opt>
     [move] Attempting to rename: <https://builds.apache.org/job/JMeter-trunk/ws/trunk/build/hsqldb-2.4.0.jar> to <https://builds.apache.org/job/JMeter-trunk/ws/trunk/lib/opt/hsqldb-2.4.0.jar>

setproxy:

_get_zipfile:

_check_exists:

_check_jarfile:
     [echo] Checking activemq-all-5.15.2.jar
     [echo] Deleting activemq-all-* (excluding activemq-all-5.15.2.jar)

setproxy:

_get_jarfile:
     [echo] Fetching: <https://builds.apache.org/job/JMeter-trunk/ws/trunk/lib/opt/activemq-all-5.15.2.jar>
      [get] Getting: https://repo1.maven.org/maven2/org/apache/activemq/activemq-all/5.15.2/activemq-all-5.15.2.jar
      [get] To: <https://builds.apache.org/job/JMeter-trunk/ws/trunk/build/activemq-all-5.15.2.jar>

_checkMD5:
     [echo] Checksum OK: activemq-all-5.15.2.jar
     [move] Moving 1 file to <https://builds.apache.org/job/JMeter-trunk/ws/trunk/lib/opt>
     [move] Attempting to rename: <https://builds.apache.org/job/JMeter-trunk/ws/trunk/build/activemq-all-5.15.2.jar> to <https://builds.apache.org/job/JMeter-trunk/ws/trunk/lib/opt/activemq-all-5.15.2.jar>

setproxy:

_get_zipfile:

_check_exists:

_check_jarfile:
     [echo] Checking mina-core-2.0.16.jar
     [echo] Deleting mina-core-* (excluding mina-core-2.0.16.jar)

setproxy:

_get_jarfile:
     [echo] Fetching: <https://builds.apache.org/job/JMeter-trunk/ws/trunk/lib/opt/mina-core-2.0.16.jar>
      [get] Getting: https://repo1.maven.org/maven2/org/apache/mina/mina-core/2.0.16/mina-core-2.0.16.jar
      [get] To: <https://builds.apache.org/job/JMeter-trunk/ws/trunk/build/mina-core-2.0.16.jar>

_checkMD5:
     [echo] Checksum OK: mina-core-2.0.16.jar
     [move] Moving 1 file to <https://builds.apache.org/job/JMeter-trunk/ws/trunk/lib/opt>
     [move] Attempting to rename: <https://builds.apache.org/job/JMeter-trunk/ws/trunk/build/mina-core-2.0.16.jar> to <https://builds.apache.org/job/JMeter-trunk/ws/trunk/lib/opt/mina-core-2.0.16.jar>

setproxy:

_get_zipfile:

_check_exists:

_check_jarfile:
     [echo] Checking ftplet-api-1.1.1.jar
     [echo] Deleting ftplet-api-* (excluding ftplet-api-1.1.1.jar)

setproxy:

_get_jarfile:
     [echo] Fetching: <https://builds.apache.org/job/JMeter-trunk/ws/trunk/lib/opt/ftplet-api-1.1.1.jar>
      [get] Getting: https://repo1.maven.org/maven2/org/apache/ftpserver/ftplet-api/1.1.1/ftplet-api-1.1.1.jar
      [get] To: <https://builds.apache.org/job/JMeter-trunk/ws/trunk/build/ftplet-api-1.1.1.jar>

_checkMD5:
     [echo] Checksum OK: ftplet-api-1.1.1.jar
     [move] Moving 1 file to <https://builds.apache.org/job/JMeter-trunk/ws/trunk/lib/opt>
     [move] Attempting to rename: <https://builds.apache.org/job/JMeter-trunk/ws/trunk/build/ftplet-api-1.1.1.jar> to <https://builds.apache.org/job/JMeter-trunk/ws/trunk/lib/opt/ftplet-api-1.1.1.jar>

setproxy:

_get_zipfile:

_check_exists:

_check_jarfile:
     [echo] Checking ftpserver-core-1.1.1.jar
     [echo] Deleting ftpserver-core-* (excluding ftpserver-core-1.1.1.jar)

setproxy:

_get_jarfile:
     [echo] Fetching: <https://builds.apache.org/job/JMeter-trunk/ws/trunk/lib/opt/ftpserver-core-1.1.1.jar>
      [get] Getting: https://repo1.maven.org/maven2/org/apache/ftpserver/ftpserver-core/1.1.1/ftpserver-core-1.1.1.jar
      [get] To: <https://builds.apache.org/job/JMeter-trunk/ws/trunk/build/ftpserver-core-1.1.1.jar>

_checkMD5:
     [echo] Checksum OK: ftpserver-core-1.1.1.jar
     [move] Moving 1 file to <https://builds.apache.org/job/JMeter-trunk/ws/trunk/lib/opt>
     [move] Attempting to rename: <https://builds.apache.org/job/JMeter-trunk/ws/trunk/build/ftpserver-core-1.1.1.jar> to <https://builds.apache.org/job/JMeter-trunk/ws/trunk/lib/opt/ftpserver-core-1.1.1.jar>

setproxy:

_get_zipfile:

_check_exists:

_check_jarfile:
     [echo] Checking org.jacoco.ant-0.8.0-nodeps.jar
     [echo] Deleting org.jacoco.ant-0.8.0-nodeps.jar (excluding org.jacoco.ant-0.8.0-nodeps.jar)

setproxy:

_get_jarfile:
     [echo] Fetching: <https://builds.apache.org/job/JMeter-trunk/ws/trunk/lib/opt/org.jacoco.ant-0.8.0-nodeps.jar>
      [get] Getting: https://repo1.maven.org/maven2/org/jacoco/org.jacoco.ant/0.8.0/org.jacoco.ant-0.8.0-nodeps.jar
      [get] To: <https://builds.apache.org/job/JMeter-trunk/ws/trunk/build/org.jacoco.ant-0.8.0-nodeps.jar>

_checkMD5:
     [echo] Checksum OK: org.jacoco.ant-0.8.0-nodeps.jar
     [move] Moving 1 file to <https://builds.apache.org/job/JMeter-trunk/ws/trunk/lib/opt>
     [move] Attempting to rename: <https://builds.apache.org/job/JMeter-trunk/ws/trunk/build/org.jacoco.ant-0.8.0-nodeps.jar> to <https://builds.apache.org/job/JMeter-trunk/ws/trunk/lib/opt/org.jacoco.ant-0.8.0-nodeps.jar>

setproxy:

_get_zipfile:

_check_exists:

_check_jarfile:
     [echo] Checking sonarqube-ant-task-2.5.jar
     [echo] Deleting sonarqube-ant-task-* (excluding sonarqube-ant-task-2.5.jar)

setproxy:

_get_jarfile:
     [echo] Fetching: <https://builds.apache.org/job/JMeter-trunk/ws/trunk/lib/opt/sonarqube-ant-task-2.5.jar>
      [get] Getting: https://repo1.maven.org/maven2/org/sonarsource/scanner/ant/sonarqube-ant-task/2.5/sonarqube-ant-task-2.5.jar
      [get] To: <https://builds.apache.org/job/JMeter-trunk/ws/trunk/build/sonarqube-ant-task-2.5.jar>

_checkMD5:
     [echo] Checksum OK: sonarqube-ant-task-2.5.jar
     [move] Moving 1 file to <https://builds.apache.org/job/JMeter-trunk/ws/trunk/lib/opt>
     [move] Attempting to rename: <https://builds.apache.org/job/JMeter-trunk/ws/trunk/build/sonarqube-ant-task-2.5.jar> to <https://builds.apache.org/job/JMeter-trunk/ws/trunk/lib/opt/sonarqube-ant-task-2.5.jar>

setproxy:

_get_zipfile:

download_checkstyle:

_process_checkstyle_jars:

_check_exists:

_check_jarfile:
     [echo] Checking checkstyle-8.8-all.jar
     [echo] Deleting checkstyle-8.8-all.jar (excluding checkstyle-8.8-all.jar)

setproxy:

_get_jarfile:
     [echo] Fetching: lib/opt/checkstyle-8.8-all.jar
      [get] Getting: https://downloads.sourceforge.net/checkstyle/checkstyle/8.8/checkstyle-8.8-all.jar?ts=1518698942471&use_mirror=autoselect/checkstyle-8.8-all.jar
      [get] To: <https://builds.apache.org/job/JMeter-trunk/ws/trunk/build/checkstyle-8.8-all.jar>
      [get] https://downloads.sourceforge.net/checkstyle/checkstyle/8.8/checkstyle-8.8-all.jar?ts=1518698942471&use_mirror=autoselect/checkstyle-8.8-all.jar moved to http://cfhcable.dl.sourceforge.net/project/checkstyle/checkstyle/8.8/checkstyle-8.8-all.jar

BUILD FAILED
<https://builds.apache.org/job/JMeter-trunk/ws/trunk/build.xml>:3470: The following error occurred while executing this line:
<https://builds.apache.org/job/JMeter-trunk/ws/trunk/build.xml>:3414: The following error occurred while executing this line:
<https://builds.apache.org/job/JMeter-trunk/ws/trunk/build.xml>:3219: The following error occurred while executing this line:
<https://builds.apache.org/job/JMeter-trunk/ws/trunk/build.xml>:3263: The following error occurred while executing this line:
<https://builds.apache.org/job/JMeter-trunk/ws/trunk/build.xml>:3293: Redirection detected from https to http. Protocol switch unsafe, not allowed.

Total time: 25 seconds
Build step 'Invoke Ant' marked build as failure
[locks-and-latches] Releasing all the locks
[locks-and-latches] All the locks released
Archiving artifacts
Recording test results
ERROR: Step ?Publish JUnit test result report? failed: No test report files were found. Configuration error?