You are viewing a plain text version of this content. The canonical link for it is here.
Posted to builds@solr.apache.org by Apache Jenkins Server <je...@builds.apache.org> on 2023/12/30 16:48:49 UTC

[JENKINS] Solr ยป Solr-Smoketest-9.4 - Build # 177 - Failure!

Build: https://ci-builds.apache.org/job/Solr/job/Solr-Smoketest-9.4/177/

Log: 
Started by timer
Running as SYSTEM
[EnvInject] - Loading node environment variables.
Building remotely on lucene-solr-1 (solr lucene) in workspace /home/jenkins/jenkins-slave/workspace/Solr/Solr-Smoketest-9.4
[WS-CLEANUP] Deleting project workspace...
[WS-CLEANUP] Deferred wipeout is used...
[WS-CLEANUP] Done
The recommended git tool is: NONE
No credentials specified
Cloning the remote Git repository
Cloning repository https://github.com/apache/solr.git
 > git init /home/jenkins/jenkins-slave/workspace/Solr/Solr-Smoketest-9.4 # timeout=10
Fetching upstream changes from https://github.com/apache/solr.git
 > git --version # timeout=10
 > git --version # 'git version 2.17.1'
 > git fetch --tags --progress -- https://github.com/apache/solr.git +refs/heads/*:refs/remotes/origin/* # timeout=10
 > git config remote.origin.url https://github.com/apache/solr.git # timeout=10
 > git config --add remote.origin.fetch +refs/heads/*:refs/remotes/origin/* # timeout=10
Avoid second fetch
 > git rev-parse origin/branch_9_4^{commit} # timeout=10
Checking out Revision 8d6e6d06123e8ae68426a4d450aa5f0bf8de0bfc (origin/branch_9_4)
 > git config core.sparsecheckout # timeout=10
 > git checkout -f 8d6e6d06123e8ae68426a4d450aa5f0bf8de0bfc # timeout=10
 > git branch -a -v --no-abbrev # timeout=10
 > git checkout -b branch_9_4 8d6e6d06123e8ae68426a4d450aa5f0bf8de0bfc # timeout=10
Commit message: "SOLR-17098: Only use ZK ACLs for default ZK Host"
 > git rev-list --no-walk 8d6e6d06123e8ae68426a4d450aa5f0bf8de0bfc # timeout=10
No emails were triggered.
provisioning config files...
copy managed file [gradle.properties] to file:/home/jenkins/jenkins-slave/workspace/Solr/Solr-Smoketest-9.4/gradle.properties
[Gradle] - Launching build.
[Solr-Smoketest-9.4] $ /home/jenkins/jenkins-slave/workspace/Solr/Solr-Smoketest-9.4/gradlew -Dversion.suffix= -Dgradle.user.home=/home/jenkins/jenkins-slave/workspace/Solr/.gradle -Porg.gradle.daemon=false -Pvalidation.git.failOnModified=false --continue -x signJarsPublication clean assembleRelease
Downloading gradle-wrapper.jar from https://raw.githubusercontent.com/gradle/gradle/v7.6.0/gradle/wrapper/gradle-wrapper.jar
To honour the JVM settings for this build a single-use Daemon process will be forked. See https://docs.gradle.org/7.6/userguide/gradle_daemon.html#sec:disabling_the_daemon.
Daemon will be stopped at the end of the build 
> Task :buildSrc:compileJava
> Task :buildSrc:compileGroovy NO-SOURCE
> Task :buildSrc:processResources NO-SOURCE
> Task :buildSrc:classes
> Task :buildSrc:jar
> Task :buildSrc:assemble
> Task :buildSrc:compileTestJava NO-SOURCE
> Task :buildSrc:compileTestGroovy NO-SOURCE
> Task :buildSrc:processTestResources NO-SOURCE
> Task :buildSrc:testClasses UP-TO-DATE
> Task :buildSrc:test NO-SOURCE
> Task :buildSrc:check UP-TO-DATE
> Task :buildSrc:build
> Task :clean
> Task :solr:clean UP-TO-DATE
> Task :solr:api:clean
> Task :solr:benchmark:clean
> Task :solr:core:clean
> Task :solr:distribution:clean UP-TO-DATE
> Task :solr:docker:clean UP-TO-DATE
> Task :solr:documentation:clean UP-TO-DATE
> Task :solr:example:clean UP-TO-DATE
> Task :solr:modules:clean UP-TO-DATE
> Task :solr:packaging:clean UP-TO-DATE
> Task :solr:prometheus-exporter:clean
> Task :solr:server:clean
> Task :solr:solr-ref-guide:clean
> Task :solr:solrj:clean
> Task :solr:solrj-streaming:clean
> Task :solr:solrj-zookeeper:clean
> Task :solr:test-framework:clean
> Task :solr:webapp:clean
> Task :solr:modules:analysis-extras:clean
> Task :solr:modules:analytics:clean
> Task :solr:modules:clustering:clean
> Task :solr:modules:extraction:clean
> Task :solr:modules:gcs-repository:clean
> Task :solr:modules:hadoop-auth:clean
> Task :solr:modules:hdfs:clean
> Task :solr:modules:jaegertracer-configurator:clean
> Task :solr:modules:jwt-auth:clean
> Task :solr:modules:langid:clean
> Task :solr:modules:ltr:clean
> Task :solr:modules:opentelemetry:clean
> Task :solr:modules:s3-repository:clean
> Task :solr:modules:scripting:clean
> Task :solr:modules:sql:clean
> Task :mavenLocalClean UP-TO-DATE
> Task :solr-missing-doclet:compileJava
> Task :solr-missing-doclet:processResources NO-SOURCE
> Task :solr-missing-doclet:classes
> Task :solr-missing-doclet:jar
> Task :gitStatus
> Task :checkJdkInternalsExportedToGradle
> Task :solr:api:compileJava
> Task :solr:api:processResources NO-SOURCE
> Task :solr:api:classes
> Task :solr:api:jar
> Task :solr:api:generateMetadataFileForJarsPublication SKIPPED
> Task :solr:api:generatePomFileForJarsPublication
> Task :solr:api:renderJavadoc
> Task :solr:api:javadoc SKIPPED
> Task :solr:api:javadocJar
> Task :solr:api:sourcesJar
> Task :solr:api:publishJarsPublicationToBuildRepository

> Task :solr:api:resolve
SLF4J: No SLF4J providers were found.
SLF4J: Defaulting to no-operation (NOP) logger implementation
SLF4J: See https://www.slf4j.org/codes.html#noProviders for further details.

> Task :solr:solrj:openApiGenerate
################################################################################
# Thanks for using OpenAPI Generator.                                          #
# Please consider donation to help us maintain this project ๐Ÿ™                 #
# https://opencollective.com/openapi_generator/donate                          #
################################################################################
Successfully generated code to /home/jenkins/jenkins-slave/workspace/Solr/Solr-Smoketest-9.4/solr/solrj/build/generated/

> Task :spotlessInternalRegisterDependencies
> Task :solr:solrj:generatedSpotlessHelper
> Task :solr:solrj:generatedSpotless

> Task :solr:solrj:compileJava
Note: Some input files use or override a deprecated API.
Note: Recompile with -Xlint:deprecation for details.

> Task :solr:solrj-streaming:compileJava
Note: Some input files use or override a deprecated API.
Note: Recompile with -Xlint:deprecation for details.

> Task :solr:solrj-zookeeper:compileJava
Note: Some input files use or override a deprecated API.
Note: Recompile with -Xlint:deprecation for details.

> Task :solr:core:compileJava
Note: Some input files use or override a deprecated API.
Note: Recompile with -Xlint:deprecation for details.

> Task :solr:core:processResources
> Task :solr:core:classes
> Task :solr:core:jar
> Task :solr:core:generateMetadataFileForJarsPublication SKIPPED
> Task :solr:core:generatePomFileForJarsPublication
> Task :solr:solrj:renderJavadoc
> Task :solr:solrj-streaming:renderJavadoc
> Task :solr:solrj-zookeeper:renderJavadoc
> Task :solr:core:renderJavadoc
> Task :solr:core:javadoc SKIPPED
> Task :solr:core:javadocJar
> Task :solr:core:sourcesJar
> Task :solr:core:publishJarsPublicationToBuildRepository

> Task :solr:prometheus-exporter:compileJava
Note: Some input files use or override a deprecated API.
Note: Recompile with -Xlint:deprecation for details.

> Task :solr:prometheus-exporter:processResources NO-SOURCE
> Task :solr:prometheus-exporter:classes
> Task :solr:prometheus-exporter:jar
> Task :solr:prometheus-exporter:generateMetadataFileForJarsPublication SKIPPED
> Task :solr:prometheus-exporter:generatePomFileForJarsPublication
> Task :solr:prometheus-exporter:renderJavadoc
> Task :solr:prometheus-exporter:javadoc SKIPPED
> Task :solr:prometheus-exporter:javadocJar
> Task :solr:prometheus-exporter:sourcesJar
> Task :solr:prometheus-exporter:publishJarsPublicationToBuildRepository
> Task :solr:solrj:processResources
> Task :solr:solrj:classes
> Task :solr:solrj:jar
> Task :solr:solrj:generateMetadataFileForJarsPublication SKIPPED
> Task :solr:solrj:generatePomFileForJarsPublication
> Task :solr:solrj:javadoc SKIPPED
> Task :solr:solrj:javadocJar
> Task :solr:solrj:sourcesJar
> Task :solr:solrj:publishJarsPublicationToBuildRepository
> Task :solr:solrj-streaming:processResources
> Task :solr:solrj-streaming:classes
> Task :solr:solrj-streaming:jar
> Task :solr:solrj-streaming:generateMetadataFileForJarsPublication SKIPPED
> Task :solr:solrj-streaming:generatePomFileForJarsPublication
> Task :solr:solrj-streaming:javadoc SKIPPED
> Task :solr:solrj-streaming:javadocJar
> Task :solr:solrj-streaming:sourcesJar
> Task :solr:solrj-streaming:publishJarsPublicationToBuildRepository
> Task :solr:solrj-zookeeper:processResources NO-SOURCE
> Task :solr:solrj-zookeeper:classes
> Task :solr:solrj-zookeeper:jar
> Task :solr:solrj-zookeeper:generateMetadataFileForJarsPublication SKIPPED
> Task :solr:solrj-zookeeper:generatePomFileForJarsPublication
> Task :solr:solrj-zookeeper:javadoc SKIPPED
> Task :solr:solrj-zookeeper:javadocJar
> Task :solr:solrj-zookeeper:sourcesJar
> Task :solr:solrj-zookeeper:publishJarsPublicationToBuildRepository

> Task :solr:test-framework:compileJava
Note: Some input files use or override a deprecated API.
Note: Recompile with -Xlint:deprecation for details.

> Task :solr:test-framework:processResources
> Task :solr:test-framework:classes
> Task :solr:test-framework:jar
> Task :solr:test-framework:generateMetadataFileForJarsPublication SKIPPED
> Task :solr:test-framework:generatePomFileForJarsPublication
> Task :solr:test-framework:renderJavadoc
> Task :solr:test-framework:javadoc SKIPPED
> Task :solr:test-framework:javadocJar
> Task :solr:test-framework:sourcesJar
> Task :solr:test-framework:publishJarsPublicationToBuildRepository

> Task :solr:modules:analysis-extras:compileJava
Note: /home/jenkins/jenkins-slave/workspace/Solr/Solr-Smoketest-9.4/solr/modules/analysis-extras/src/java/org/apache/solr/schema/ICUCollationField.java uses or overrides a deprecated API.
Note: Recompile with -Xlint:deprecation for details.

> Task :solr:modules:analysis-extras:processResources NO-SOURCE
> Task :solr:modules:analysis-extras:classes
> Task :solr:modules:analysis-extras:jar
> Task :solr:modules:analysis-extras:generateMetadataFileForJarsPublication SKIPPED
> Task :solr:modules:analysis-extras:generatePomFileForJarsPublication
> Task :solr:modules:analysis-extras:renderJavadoc
> Task :solr:modules:analysis-extras:javadoc SKIPPED
> Task :solr:modules:analysis-extras:javadocJar
> Task :solr:modules:analysis-extras:sourcesJar
> Task :solr:modules:analysis-extras:publishJarsPublicationToBuildRepository

> Task :solr:modules:analytics:compileJava
Note: Some input files use or override a deprecated API.
Note: Recompile with -Xlint:deprecation for details.

> Task :solr:modules:analytics:processResources NO-SOURCE
> Task :solr:modules:analytics:classes
> Task :solr:modules:analytics:jar
> Task :solr:modules:analytics:generateMetadataFileForJarsPublication SKIPPED
> Task :solr:modules:analytics:generatePomFileForJarsPublication
> Task :solr:modules:analytics:renderJavadoc
> Task :solr:modules:analytics:javadoc SKIPPED
> Task :solr:modules:analytics:javadocJar
> Task :solr:modules:analytics:sourcesJar
> Task :solr:modules:analytics:publishJarsPublicationToBuildRepository
> Task :solr:modules:clustering:compileJava
> Task :solr:modules:clustering:processResources NO-SOURCE
> Task :solr:modules:clustering:classes
> Task :solr:modules:clustering:jar
> Task :solr:modules:clustering:generateMetadataFileForJarsPublication SKIPPED
> Task :solr:modules:clustering:generatePomFileForJarsPublication
> Task :solr:modules:clustering:renderJavadoc
> Task :solr:modules:clustering:javadoc SKIPPED
> Task :solr:modules:clustering:javadocJar
> Task :solr:modules:clustering:sourcesJar
> Task :solr:modules:clustering:publishJarsPublicationToBuildRepository

> Task :solr:modules:extraction:compileJava
Note: /home/jenkins/jenkins-slave/workspace/Solr/Solr-Smoketest-9.4/solr/modules/extraction/src/java/org/apache/solr/handler/extraction/ExtractingDocumentLoader.java uses or overrides a deprecated API.
Note: Recompile with -Xlint:deprecation for details.

> Task :solr:modules:extraction:processResources
> Task :solr:modules:extraction:classes
> Task :solr:modules:extraction:jar
> Task :solr:modules:extraction:generateMetadataFileForJarsPublication SKIPPED
> Task :solr:modules:extraction:generatePomFileForJarsPublication
> Task :solr:modules:extraction:renderJavadoc
> Task :solr:modules:extraction:javadoc SKIPPED
> Task :solr:modules:extraction:javadocJar
> Task :solr:modules:extraction:sourcesJar
> Task :solr:modules:extraction:publishJarsPublicationToBuildRepository

> Task :solr:modules:gcs-repository:compileJava
Note: /home/jenkins/jenkins-slave/workspace/Solr/Solr-Smoketest-9.4/solr/modules/gcs-repository/src/java/org/apache/solr/gcs/GCSConfigParser.java uses or overrides a deprecated API.
Note: Recompile with -Xlint:deprecation for details.

> Task :solr:modules:gcs-repository:processResources NO-SOURCE
> Task :solr:modules:gcs-repository:classes
> Task :solr:modules:gcs-repository:jar
> Task :solr:modules:gcs-repository:generateMetadataFileForJarsPublication SKIPPED
> Task :solr:modules:gcs-repository:generatePomFileForJarsPublication
> Task :solr:modules:gcs-repository:renderJavadoc
> Task :solr:modules:gcs-repository:javadoc SKIPPED
> Task :solr:modules:gcs-repository:javadocJar
> Task :solr:modules:gcs-repository:sourcesJar
> Task :solr:modules:gcs-repository:publishJarsPublicationToBuildRepository

> Task :solr:modules:hadoop-auth:compileJava
Note: Some input files use or override a deprecated API.
Note: Recompile with -Xlint:deprecation for details.

> Task :solr:modules:hadoop-auth:processResources NO-SOURCE
> Task :solr:modules:hadoop-auth:classes
> Task :solr:modules:hadoop-auth:jar
> Task :solr:modules:hadoop-auth:generateMetadataFileForJarsPublication SKIPPED
> Task :solr:modules:hadoop-auth:generatePomFileForJarsPublication
> Task :solr:modules:hadoop-auth:renderJavadoc
> Task :solr:modules:hadoop-auth:javadoc SKIPPED
> Task :solr:modules:hadoop-auth:javadocJar
> Task :solr:modules:hadoop-auth:sourcesJar
> Task :solr:modules:hadoop-auth:publishJarsPublicationToBuildRepository

> Task :solr:modules:hdfs:compileJava
Note: Some input files use or override a deprecated API.
Note: Recompile with -Xlint:deprecation for details.

> Task :solr:modules:hdfs:processResources NO-SOURCE
> Task :solr:modules:hdfs:classes
> Task :solr:modules:hdfs:jar
> Task :solr:modules:hdfs:generateMetadataFileForJarsPublication SKIPPED
> Task :solr:modules:hdfs:generatePomFileForJarsPublication
> Task :solr:modules:hdfs:renderJavadoc
> Task :solr:modules:hdfs:javadoc SKIPPED
> Task :solr:modules:hdfs:javadocJar
> Task :solr:modules:hdfs:sourcesJar
> Task :solr:modules:hdfs:publishJarsPublicationToBuildRepository
> Task :solr:modules:jaegertracer-configurator:compileJava
> Task :solr:modules:jaegertracer-configurator:processResources NO-SOURCE
> Task :solr:modules:jaegertracer-configurator:classes
> Task :solr:modules:jaegertracer-configurator:jar
> Task :solr:modules:jaegertracer-configurator:generateMetadataFileForJarsPublication SKIPPED
> Task :solr:modules:jaegertracer-configurator:generatePomFileForJarsPublication
> Task :solr:modules:jaegertracer-configurator:renderJavadoc
> Task :solr:modules:jaegertracer-configurator:javadoc SKIPPED
> Task :solr:modules:jaegertracer-configurator:javadocJar
> Task :solr:modules:jaegertracer-configurator:sourcesJar
> Task :solr:modules:jaegertracer-configurator:publishJarsPublicationToBuildRepository
> Task :solr:modules:jwt-auth:compileJava
> Task :solr:modules:jwt-auth:processResources NO-SOURCE
> Task :solr:modules:jwt-auth:classes
> Task :solr:modules:jwt-auth:jar
> Task :solr:modules:jwt-auth:generateMetadataFileForJarsPublication SKIPPED
> Task :solr:modules:jwt-auth:generatePomFileForJarsPublication
> Task :solr:modules:jwt-auth:renderJavadoc
> Task :solr:modules:jwt-auth:javadoc SKIPPED
> Task :solr:modules:jwt-auth:javadocJar
> Task :solr:modules:jwt-auth:sourcesJar
> Task :solr:modules:jwt-auth:publishJarsPublicationToBuildRepository

> Task :solr:modules:langid:compileJava
Note: Some input files use or override a deprecated API.
Note: Recompile with -Xlint:deprecation for details.

> Task :solr:modules:langid:processResources
> Task :solr:modules:langid:classes
> Task :solr:modules:langid:jar
> Task :solr:modules:langid:generateMetadataFileForJarsPublication SKIPPED
> Task :solr:modules:langid:generatePomFileForJarsPublication
> Task :solr:modules:langid:renderJavadoc
> Task :solr:modules:langid:javadoc SKIPPED
> Task :solr:modules:langid:javadocJar
> Task :solr:modules:langid:sourcesJar
> Task :solr:modules:langid:publishJarsPublicationToBuildRepository

> Task :solr:modules:ltr:compileJava
Note: Some input files use or override a deprecated API.
Note: Recompile with -Xlint:deprecation for details.

> Task :solr:modules:ltr:processResources NO-SOURCE
> Task :solr:modules:ltr:classes
> Task :solr:modules:ltr:jar
> Task :solr:modules:ltr:generateMetadataFileForJarsPublication SKIPPED
> Task :solr:modules:ltr:generatePomFileForJarsPublication
> Task :solr:modules:ltr:renderJavadoc
> Task :solr:modules:ltr:javadoc SKIPPED
> Task :solr:modules:ltr:javadocJar
> Task :solr:modules:ltr:sourcesJar
> Task :solr:modules:ltr:publishJarsPublicationToBuildRepository
> Task :solr:modules:opentelemetry:compileJava
> Task :solr:modules:opentelemetry:processResources NO-SOURCE
> Task :solr:modules:opentelemetry:classes
> Task :solr:modules:opentelemetry:jar
> Task :solr:modules:opentelemetry:generateMetadataFileForJarsPublication SKIPPED
> Task :solr:modules:opentelemetry:generatePomFileForJarsPublication
> Task :solr:modules:opentelemetry:renderJavadoc
> Task :solr:modules:opentelemetry:javadoc SKIPPED
> Task :solr:modules:opentelemetry:javadocJar
> Task :solr:modules:opentelemetry:sourcesJar
> Task :solr:modules:opentelemetry:publishJarsPublicationToBuildRepository
> Task :solr:modules:s3-repository:compileJava
> Task :solr:modules:s3-repository:processResources NO-SOURCE
> Task :solr:modules:s3-repository:classes
> Task :solr:modules:s3-repository:jar
> Task :solr:modules:s3-repository:generateMetadataFileForJarsPublication SKIPPED
> Task :solr:modules:s3-repository:generatePomFileForJarsPublication
> Task :solr:modules:s3-repository:renderJavadoc
> Task :solr:modules:s3-repository:javadoc SKIPPED
> Task :solr:modules:s3-repository:javadocJar
> Task :solr:modules:s3-repository:sourcesJar
> Task :solr:modules:s3-repository:publishJarsPublicationToBuildRepository

> Task :solr:modules:scripting:compileJava
Note: /home/jenkins/jenkins-slave/workspace/Solr/Solr-Smoketest-9.4/solr/modules/scripting/src/java/org/apache/solr/scripting/xslt/XSLTUpdateRequestHandler.java uses or overrides a deprecated API.
Note: Recompile with -Xlint:deprecation for details.

> Task :solr:modules:scripting:processResources NO-SOURCE
> Task :solr:modules:scripting:classes
> Task :solr:modules:scripting:jar
> Task :solr:modules:scripting:generateMetadataFileForJarsPublication SKIPPED
> Task :solr:modules:scripting:generatePomFileForJarsPublication
> Task :solr:modules:scripting:renderJavadoc
> Task :solr:modules:scripting:javadoc SKIPPED
> Task :solr:modules:scripting:javadocJar
> Task :solr:modules:scripting:sourcesJar
> Task :solr:modules:scripting:publishJarsPublicationToBuildRepository

> Task :solr:modules:sql:compileJava
Note: Some input files use or override a deprecated API.
Note: Recompile with -Xlint:deprecation for details.

> Task :solr:modules:sql:processResources
> Task :solr:modules:sql:classes
> Task :solr:modules:sql:jar
> Task :solr:modules:sql:generateMetadataFileForJarsPublication SKIPPED
> Task :solr:modules:sql:generatePomFileForJarsPublication
> Task :solr:modules:sql:renderJavadoc
> Task :solr:modules:sql:javadoc SKIPPED
> Task :solr:modules:sql:javadocJar
> Task :solr:modules:sql:sourcesJar
> Task :solr:modules:sql:publishJarsPublicationToBuildRepository

> Task :mavenToLocalFolder
Local maven artifacts (poms, jars) created at: /home/jenkins/jenkins-slave/workspace/Solr/Solr-Smoketest-9.4/build/maven-local

> Task :checkWorkingCopyClean
> Task :solr:distribution:assembleSourceTgz
> Task :solr:docker:createBodySnippetDockerfile
> Task :solr:docker:createDockerfileLocal
> Task :solr:docker:assemblePackaging
> Task :solr:documentation:changesToHtml
> Task :solr:documentation:copyDocumentationAssets
> Task :solr:documentation:markdownToHtml
> Task :solr:documentation:copyChangesToHtmlForMiniSite
> Task :solr:documentation:copyMiniDocumentationAssets
> Task :solr:documentation:createMiniDocumentationIndex
> Task :solr:documentation:documentationMinimal
> Task :solr:core:assemblePostJar
> Task :solr:example:assemblePackaging
> Task :solr:prometheus-exporter:assemblePackaging
> Task :solr:webapp:compileJava NO-SOURCE
> Task :solr:webapp:processResources NO-SOURCE
> Task :solr:webapp:classes UP-TO-DATE
> Task :solr:webapp:war
> Task :solr:server:assemblePackaging
> Task :solr:modules:analysis-extras:assemblePackaging
> Task :solr:modules:analytics:assemblePackaging
> Task :solr:modules:clustering:assemblePackaging
> Task :solr:modules:extraction:assemblePackaging
> Task :solr:modules:gcs-repository:assemblePackaging
> Task :solr:modules:hadoop-auth:assemblePackaging
> Task :solr:modules:hdfs:assemblePackaging
> Task :solr:modules:jaegertracer-configurator:assemblePackaging
> Task :solr:modules:jwt-auth:assemblePackaging
> Task :solr:modules:langid:assemblePackaging
> Task :solr:modules:ltr:assemblePackaging
> Task :solr:modules:opentelemetry:assemblePackaging
> Task :solr:modules:s3-repository:assemblePackaging
> Task :solr:modules:scripting:assemblePackaging
> Task :solr:modules:sql:assemblePackaging
> Task :solr:packaging:fullDistTar
> Task :solr:packaging:slimDistTar
> Task :solr:distribution:computeChecksums
> Task :solr:distribution:prepareGitRev
> Task :solr:docker:createDockerfileOfficialFull
> Task :solr:docker:createDockerfileOfficialSlim
> Task :solr:distribution:assembleRelease

Deprecated Gradle features were used in this build, making it incompatible with Gradle 8.0.

You can use '--warning-mode all' to show the individual deprecation warnings and determine if they come from your own scripts or plugins.

See https://docs.gradle.org/7.6/userguide/command_line_interface.html#sec:command_line_warnings

BUILD SUCCESSFUL in 4m 13s
246 actionable tasks: 238 executed, 8 up-to-date
Build step 'Invoke Gradle script' changed build result to SUCCESS
Run condition [Always] enabling perform for step [Execute shell]
[Solr-Smoketest-9.4] $ /bin/bash /tmp/jenkins6778734835876505766.sh
Installing Python script requirements
Defaulting to user installation because normal site-packages is not writeable
Collecting six~=1.16.0
  Using cached six-1.16.0-py2.py3-none-any.whl (11 kB)
ERROR: Could not find a version that satisfies the requirement Jinja2~=3.1.1 (from versions: 2.0rc1, 2.0, 2.1, 2.1.1, 2.2, 2.2.1, 2.3, 2.3.1, 2.4, 2.4.1, 2.5, 2.5.1, 2.5.2, 2.5.3, 2.5.4, 2.5.5, 2.6, 2.7, 2.7.1, 2.7.2, 2.7.3, 2.8, 2.8.1, 2.9, 2.9.1, 2.9.2, 2.9.3, 2.9.4, 2.9.5, 2.9.6, 2.10, 2.10.1, 2.10.2, 2.10.3, 2.11.0, 2.11.1, 2.11.2, 2.11.3, 3.0.0a1, 3.0.0rc1, 3.0.0rc2, 3.0.0, 3.0.1, 3.0.2, 3.0.3)
ERROR: No matching distribution found for Jinja2~=3.1.1
Starting Smoke tester in folder /home/jenkins/jenkins-slave/workspace/Solr/Solr-Smoketest-9.4
Java 11 JAVA_HOME=/home/jenkins/tools/java/latest11
NOTE: output encoding is UTF-8
NOTE: Not running @Nightly or @BadApple tests. Please verify that recent Jenkins runs have passed.

Load release URL "file:///home/jenkins/jenkins-slave/workspace/Solr/Solr-Smoketest-9.4/solr/distribution/build/release"...

Get KEYS...
    Downloading online KEYS file https://archive.apache.org/dist/solr/KEYS
Downloading https://archive.apache.org/dist/solr/KEYS
    0.3 MB in 1.16 sec (0.3 MB/sec)

Test Solr...
  test basics...
  check changes HTML...
  download solr-9.4.1-slim.tgz...
Downloading file:///home/jenkins/jenkins-slave/workspace/Solr/Solr-Smoketest-9.4/solr/distribution/build/release/solr-9.4.1-slim.tgz
    61.0 MB in 0.05 sec (1281.6 MB/sec)
    verify sha512 digest
  download solr-9.4.1-src.tgz...
Downloading file:///home/jenkins/jenkins-slave/workspace/Solr/Solr-Smoketest-9.4/solr/distribution/build/release/solr-9.4.1-src.tgz
    86.0 MB in 0.06 sec (1342.4 MB/sec)
    verify sha512 digest
  download solr-9.4.1.tgz...
Downloading file:///home/jenkins/jenkins-slave/workspace/Solr/Solr-Smoketest-9.4/solr/distribution/build/release/solr-9.4.1.tgz
    267.8 MB in 0.20 sec (1350.4 MB/sec)
    verify sha512 digest
  unpack solr-9.4.1.tgz...
  solr-9.4.1.tgz
    Checking LICENSE.txt
    Checking NOTICE.txt
    Checking README.txt
    Checking CHANGES.txt
    Checking bin
    Checking modules
    Checking docker
    Checking prometheus-exporter
    Checking docs
    Checking example
    Checking licenses
    Checking server
    Checking lib
    verify JAR metadata/identity/no javax.* or java.* classes...
      **WARNING**: skipping check of /home/jenkins/jenkins-slave/workspace/Solr/Solr-Smoketest-9.4/_tmp/smoke_1703950524/unpack/solr-9.4.1/server/solr-webapp/webapp/WEB-INF/lib/jakarta.xml.bind-api-2.3.3.jar: it has javax.* classes
      **WARNING**: skipping check of /home/jenkins/jenkins-slave/workspace/Solr/Solr-Smoketest-9.4/_tmp/smoke_1703950524/unpack/solr-9.4.1/server/solr-webapp/webapp/WEB-INF/lib/jakarta.annotation-api-1.3.5.jar: it has javax.* classes
      **WARNING**: skipping check of /home/jenkins/jenkins-slave/workspace/Solr/Solr-Smoketest-9.4/_tmp/smoke_1703950524/unpack/solr-9.4.1/server/solr-webapp/webapp/WEB-INF/lib/jakarta.ws.rs-api-2.1.6.jar: it has javax.* classes
      **WARNING**: skipping check of /home/jenkins/jenkins-slave/workspace/Solr/Solr-Smoketest-9.4/_tmp/smoke_1703950524/unpack/solr-9.4.1/server/solr-webapp/webapp/WEB-INF/lib/jakarta.inject-2.6.1.jar: it has javax.* classes
      **WARNING**: skipping check of /home/jenkins/jenkins-slave/workspace/Solr/Solr-Smoketest-9.4/_tmp/smoke_1703950524/unpack/solr-9.4.1/server/solr-webapp/webapp/WEB-INF/lib/jakarta.validation-api-2.0.2.jar: it has javax.* classes
      **WARNING**: skipping check of /home/jenkins/jenkins-slave/workspace/Solr/Solr-Smoketest-9.4/_tmp/smoke_1703950524/unpack/solr-9.4.1/server/lib/ext/jetty-servlet-api-4.0.6.jar: it has javax.* classes
      **WARNING**: skipping check of /home/jenkins/jenkins-slave/workspace/Solr/Solr-Smoketest-9.4/_tmp/smoke_1703950524/unpack/solr-9.4.1/modules/extraction/lib/jakarta.activation-1.2.2.jar: it has javax.* classes
      **WARNING**: skipping check of /home/jenkins/jenkins-slave/workspace/Solr/Solr-Smoketest-9.4/_tmp/smoke_1703950524/unpack/solr-9.4.1/modules/extraction/lib/jakarta.activation-api-1.2.2.jar: it has javax.* classes
      **WARNING**: skipping check of /home/jenkins/jenkins-slave/workspace/Solr/Solr-Smoketest-9.4/_tmp/smoke_1703950524/unpack/solr-9.4.1/modules/extraction/lib/unit-api-1.0.jar: it has javax.* classes
    copying unpacked distribution for Java 11 ...
    test solr example w/ Java 11...
      start Solr instance (log=/home/jenkins/jenkins-slave/workspace/Solr/Solr-Smoketest-9.4/_tmp/smoke_1703950524/unpack/solr-9.4.1-java11/solr-example.log)...
No process found for Solr node running on port 8983
      Running techproducts example on port 8983 from /home/jenkins/jenkins-slave/workspace/Solr/Solr-Smoketest-9.4/_tmp/smoke_1703950524/unpack/solr-9.4.1-java11
*** [WARN] *** Your open file limit is currently 60000.  
 It should be set to 65000 to avoid operational disruption. 
 If you no longer wish to see this warning, set SOLR_ULIMIT_CHECKS to false in your profile or solr.in.sh
*** [WARN] ***  Your Max Processes Limit is currently 30000. 
 It should be set to 65000 to avoid operational disruption. 
 If you no longer wish to see this warning, set SOLR_ULIMIT_CHECKS to false in your profile or solr.in.sh
Creating Solr home directory /home/jenkins/jenkins-slave/workspace/Solr/Solr-Smoketest-9.4/_tmp/smoke_1703950524/unpack/solr-9.4.1-java11/example/techproducts/solr

Starting up Solr on port 8983 using command:
"bin/solr" start -p 8983 -s "example/techproducts/solr"

*** [WARN] *** Your open file limit is currently 60000.  
 It should be set to 65000 to avoid operational disruption. 
 If you no longer wish to see this warning, set SOLR_ULIMIT_CHECKS to false in your profile or solr.in.sh
*** [WARN] ***  Your Max Processes Limit is currently 30000. 
 It should be set to 65000 to avoid operational disruption. 
 If you no longer wish to see this warning, set SOLR_ULIMIT_CHECKS to false in your profile or solr.in.sh
Waiting up to 180 seconds to see Solr running on port 8983 [|]   [/]   [-]   [\]   [|]  
Started Solr server on port 8983 (pid=16119). Happy searching!

    
Created new core 'techproducts'
Indexing tech product example docs from /home/jenkins/jenkins-slave/workspace/Solr/Solr-Smoketest-9.4/_tmp/smoke_1703950524/unpack/solr-9.4.1-java11/example/exampledocs
SimplePostTool version 9.4.1
Posting files to [base] url http://localhost:8983/solr/techproducts/update using content-type application/xml...
POSTing file mp500.xml to [base]
POSTing file ipod_video.xml to [base]
POSTing file monitor2.xml to [base]
POSTing file gb18030-example.xml to [base]
POSTing file vidcard.xml to [base]
POSTing file money.xml to [base]
POSTing file hd.xml to [base]
POSTing file ipod_other.xml to [base]
POSTing file sd500.xml to [base]
POSTing file solr.xml to [base]
POSTing file utf8-example.xml to [base]
POSTing file monitor.xml to [base]
POSTing file manufacturers.xml to [base]
POSTing file mem.xml to [base]
14 files indexed.
COMMITting Solr index changes to http://localhost:8983/solr/techproducts/update...
Time spent: 0:00:00.618
      test utf8...
      run query...
      stop server using: bin/solr stop -p 8983
Sending stop command to Solr running on port 8983 ... waiting up to 180 seconds to allow Jetty process 16119 to stop gracefully.
 [|]   [/]   [-]   [\]        unpack solr-9.4.1-slim.tgz...
  solr-9.4.1-slim.tgz
    Checking LICENSE.txt
    Checking NOTICE.txt
    Checking README.txt
    Checking CHANGES.txt
    Checking bin
    Checking docker
    Checking docs
    Checking example
    Checking licenses
    Checking server
    Checking lib
    verify JAR metadata/identity/no javax.* or java.* classes...
      **WARNING**: skipping check of /home/jenkins/jenkins-slave/workspace/Solr/Solr-Smoketest-9.4/_tmp/smoke_1703950524/unpack/solr-9.4.1-slim/server/solr-webapp/webapp/WEB-INF/lib/jakarta.xml.bind-api-2.3.3.jar: it has javax.* classes
      **WARNING**: skipping check of /home/jenkins/jenkins-slave/workspace/Solr/Solr-Smoketest-9.4/_tmp/smoke_1703950524/unpack/solr-9.4.1-slim/server/solr-webapp/webapp/WEB-INF/lib/jakarta.annotation-api-1.3.5.jar: it has javax.* classes
      **WARNING**: skipping check of /home/jenkins/jenkins-slave/workspace/Solr/Solr-Smoketest-9.4/_tmp/smoke_1703950524/unpack/solr-9.4.1-slim/server/solr-webapp/webapp/WEB-INF/lib/jakarta.ws.rs-api-2.1.6.jar: it has javax.* classes
      **WARNING**: skipping check of /home/jenkins/jenkins-slave/workspace/Solr/Solr-Smoketest-9.4/_tmp/smoke_1703950524/unpack/solr-9.4.1-slim/server/solr-webapp/webapp/WEB-INF/lib/jakarta.inject-2.6.1.jar: it has javax.* classes
      **WARNING**: skipping check of /home/jenkins/jenkins-slave/workspace/Solr/Solr-Smoketest-9.4/_tmp/smoke_1703950524/unpack/solr-9.4.1-slim/server/solr-webapp/webapp/WEB-INF/lib/jakarta.validation-api-2.0.2.jar: it has javax.* classes
      **WARNING**: skipping check of /home/jenkins/jenkins-slave/workspace/Solr/Solr-Smoketest-9.4/_tmp/smoke_1703950524/unpack/solr-9.4.1-slim/server/lib/ext/jetty-servlet-api-4.0.6.jar: it has javax.* classes
    copying unpacked distribution for Java 11 ...
    test solr example w/ Java 11...
      start Solr instance (log=/home/jenkins/jenkins-slave/workspace/Solr/Solr-Smoketest-9.4/_tmp/smoke_1703950524/unpack/solr-9.4.1-slim-java11/solr-example.log)...
No process found for Solr node running on port 8983
      Running techproducts example on port 8983 from /home/jenkins/jenkins-slave/workspace/Solr/Solr-Smoketest-9.4/_tmp/smoke_1703950524/unpack/solr-9.4.1-slim-java11
*** [WARN] *** Your open file limit is currently 60000.  
 It should be set to 65000 to avoid operational disruption. 
 If you no longer wish to see this warning, set SOLR_ULIMIT_CHECKS to false in your profile or solr.in.sh
*** [WARN] ***  Your Max Processes Limit is currently 30000. 
 It should be set to 65000 to avoid operational disruption. 
 If you no longer wish to see this warning, set SOLR_ULIMIT_CHECKS to false in your profile or solr.in.sh
Creating Solr home directory /home/jenkins/jenkins-slave/workspace/Solr/Solr-Smoketest-9.4/_tmp/smoke_1703950524/unpack/solr-9.4.1-slim-java11/example/techproducts/solr

Starting up Solr on port 8983 using command:
"bin/solr" start -p 8983 -s "example/techproducts/solr"

*** [WARN] *** Your open file limit is currently 60000.  
 It should be set to 65000 to avoid operational disruption. 
 If you no longer wish to see this warning, set SOLR_ULIMIT_CHECKS to false in your profile or solr.in.sh
*** [WARN] ***  Your Max Processes Limit is currently 30000. 
 It should be set to 65000 to avoid operational disruption. 
 If you no longer wish to see this warning, set SOLR_ULIMIT_CHECKS to false in your profile or solr.in.sh
Waiting up to 180 seconds to see Solr running on port 8983 [|]   [/]   [-]   [\]   [|]  
Started Solr server on port 8983 (pid=16576). Happy searching!

    
Created new core 'techproducts'
Indexing tech product example docs from /home/jenkins/jenkins-slave/workspace/Solr/Solr-Smoketest-9.4/_tmp/smoke_1703950524/unpack/solr-9.4.1-slim-java11/example/exampledocs
SimplePostTool version 9.4.1
Posting files to [base] url http://localhost:8983/solr/techproducts/update using content-type application/xml...
POSTing file mp500.xml to [base]
POSTing file ipod_video.xml to [base]
POSTing file monitor2.xml to [base]
POSTing file gb18030-example.xml to [base]
POSTing file vidcard.xml to [base]
POSTing file money.xml to [base]
POSTing file hd.xml to [base]
POSTing file ipod_other.xml to [base]
POSTing file sd500.xml to [base]
POSTing file solr.xml to [base]
POSTing file utf8-example.xml to [base]
POSTing file monitor.xml to [base]
POSTing file manufacturers.xml to [base]
POSTing file mem.xml to [base]
14 files indexed.
COMMITting Solr index changes to http://localhost:8983/solr/techproducts/update...
Time spent: 0:00:00.671
      test utf8...
      run query...
      stop server using: bin/solr stop -p 8983
Sending stop command to Solr running on port 8983 ... waiting up to 180 seconds to allow Jetty process 16576 to stop gracefully.
 [|]   [/]   [-]   [\]   [|]        unpack solr-9.4.1-src.tgz...
  solr-9.4.1-src.tgz
    Checking LICENSE.txt
    Checking NOTICE.txt
    Checking README.md
    Checking CONTRIBUTING.md
    Checking CHANGES.txt
    Checking README.adoc
    Checking buildSrc
    Checking dev-docs
    Checking dev-tools
    Checking gradle
    Checking help
    Checking solr
    Checking build.gradle
    Checking gradlew
    Checking gradlew.bat
    Checking settings.gradle
    Checking versions.lock
    Checking versions.props
    Checking benchmark
    Checking bin
    Checking modules
    Checking api
    Checking core
    Checking docker
    Checking documentation
    Checking example
    Checking licenses
    Checking packaging
    Checking distribution
    Checking prometheus-exporter
    Checking server
    Checking solr-ref-guide
    Checking solrj
    Checking solrj-streaming
    Checking solrj-zookeeper
    Checking test-framework
    Checking webapp
    Checking .gitignore
    Checking .gitattributes
    Checking build.gradle
    make sure no JARs/WARs in src dist...
    run "./gradlew --no-daemon check -p solr/documentation"
    run tests w/ Java 11 and testArgs='-Dtests.nightly=false -Dtests.badapples=false '...
    run integration tests w/ Java 11

command "export JAVA_HOME="/home/jenkins/tools/java/latest11" PATH="/home/jenkins/tools/java/latest11/bin:$PATH" JAVACMD="/home/jenkins/tools/java/latest11/bin/java"; ./gradlew --no-daemon integrationTest -Dversion.release=9.4.1" failed:
To honour the JVM settings for this build a single-use Daemon process will be forked. See https://docs.gradle.org/7.6/userguide/gradle_daemon.html#sec:disabling_the_daemon.
Daemon will be stopped at the end of the build 
Gradle Enterprise plugins resolution: https://plugins.gradle.org/m2
Applying com.gradle.enterprise.gradleplugin.GradleEnterprisePlugin via init script
Connection to Gradle Enterprise: https://ge.apache.org, allowUntrustedServer: false
Enforcing Gradle Enterprise: https://ge.apache.org, allowUntrustedServer: false
Applying com.gradle.CommonCustomUserDataGradlePlugin via init script
> Task :buildSrc:compileJava UP-TO-DATE
> Task :buildSrc:compileGroovy NO-SOURCE
> Task :buildSrc:processResources NO-SOURCE
> Task :buildSrc:classes UP-TO-DATE
> Task :buildSrc:jar UP-TO-DATE
> Task :buildSrc:assemble UP-TO-DATE
> Task :buildSrc:compileTestJava NO-SOURCE
> Task :buildSrc:compileTestGroovy NO-SOURCE
> Task :buildSrc:processTestResources NO-SOURCE
> Task :buildSrc:testClasses UP-TO-DATE
> Task :buildSrc:test NO-SOURCE
> Task :buildSrc:check UP-TO-DATE
> Task :buildSrc:build UP-TO-DATE
> Task :solr:docker:createBodySnippetDockerfile
> Task :solr:docker:createDockerfileLocal
> Task :solr:docker:assemblePackaging
> Task :solr:packaging:nodeSetup
> Task :solr:packaging:npmSetup SKIPPED

> Task :solr:packaging:downloadBats

changed 4 packages, and audited 5 packages in 5s

1 critical severity vulnerability

Some issues need review, and may require choosing
a different dependency.

Run `npm audit` for details.

> Task :gitStatus
> Task :checkJdkInternalsExportedToGradle
> Task :solr:api:compileJava UP-TO-DATE
> Task :solr:api:processResources NO-SOURCE
> Task :solr:api:classes UP-TO-DATE
> Task :solr:api:resolve UP-TO-DATE

> Task :solr:solrj:openApiGenerate
################################################################################
# Thanks for using OpenAPI Generator.                                          #
# Please consider donation to help us maintain this project ๐Ÿ™                 #
# https://opencollective.com/openapi_generator/donate                          #
################################################################################
Successfully generated code to /home/jenkins/jenkins-slave/workspace/Solr/Solr-Smoketest-9.4/_tmp/smoke_1703950524/unpack/solr-9.4.1/solr/solrj/build/generated/

> Task :spotlessInternalRegisterDependencies UP-TO-DATE
> Task :solr:solrj:generatedSpotlessHelper
> Task :solr:solrj:generatedSpotless
> Task :solr:solrj:compileJava UP-TO-DATE
> Task :solr:documentation:changesToHtml UP-TO-DATE
> Task :solr:solrj-streaming:compileJava UP-TO-DATE
> Task :solr:documentation:copyDocumentationAssets UP-TO-DATE
> Task :solr:solrj-zookeeper:compileJava UP-TO-DATE
> Task :solr:documentation:markdownToHtml UP-TO-DATE
> Task :solr:documentation:copyChangesToHtmlForMiniSite
> Task :solr:documentation:copyMiniDocumentationAssets
> Task :solr:core:compileJava UP-TO-DATE
> Task :solr:core:processResources UP-TO-DATE
> Task :solr:core:classes UP-TO-DATE
> Task :solr:core:assemblePostJar
> Task :solr:example:assemblePackaging
> Task :solr:prometheus-exporter:compileJava UP-TO-DATE
> Task :solr:prometheus-exporter:processResources NO-SOURCE
> Task :solr:prometheus-exporter:classes UP-TO-DATE
> Task :solr:prometheus-exporter:jar
> Task :solr:prometheus-exporter:assemblePackaging
> Task :solr:api:jar
> Task :solr:documentation:createMiniDocumentationIndex
> Task :solr:documentation:documentationMinimal
> Task :solr:solrj:processResources UP-TO-DATE
> Task :solr:solrj:classes UP-TO-DATE
> Task :solr:solrj:jar
> Task :solr:solrj-streaming:processResources UP-TO-DATE
> Task :solr:solrj-streaming:classes UP-TO-DATE
> Task :solr:solrj-streaming:jar
> Task :solr:solrj-zookeeper:processResources NO-SOURCE
> Task :solr:solrj-zookeeper:classes UP-TO-DATE
> Task :solr:solrj-zookeeper:jar
> Task :solr:webapp:processResources NO-SOURCE
> Task :solr:modules:analysis-extras:compileJava UP-TO-DATE
> Task :solr:modules:analysis-extras:processResources NO-SOURCE
> Task :solr:modules:analysis-extras:classes UP-TO-DATE
> Task :solr:modules:analysis-extras:jar
> Task :solr:modules:analysis-extras:assemblePackaging
> Task :solr:modules:analytics:compileJava UP-TO-DATE
> Task :solr:modules:analytics:processResources NO-SOURCE
> Task :solr:modules:analytics:classes UP-TO-DATE
> Task :solr:core:jar
> Task :solr:webapp:compileJava NO-SOURCE
> Task :solr:webapp:classes UP-TO-DATE
> Task :solr:modules:analytics:jar
> Task :solr:modules:analytics:assemblePackaging
> Task :solr:modules:clustering:compileJava UP-TO-DATE
> Task :solr:modules:clustering:processResources NO-SOURCE
> Task :solr:modules:clustering:classes UP-TO-DATE
> Task :solr:modules:clustering:jar
> Task :solr:modules:clustering:assemblePackaging
> Task :solr:modules:extraction:compileJava UP-TO-DATE
> Task :solr:modules:extraction:processResources UP-TO-DATE
> Task :solr:modules:extraction:classes UP-TO-DATE
> Task :solr:modules:extraction:jar
> Task :solr:modules:extraction:assemblePackaging
> Task :solr:modules:gcs-repository:compileJava UP-TO-DATE
> Task :solr:modules:gcs-repository:processResources NO-SOURCE
> Task :solr:modules:gcs-repository:classes UP-TO-DATE
> Task :solr:modules:gcs-repository:jar
> Task :solr:modules:gcs-repository:assemblePackaging
> Task :solr:modules:hadoop-auth:compileJava UP-TO-DATE
> Task :solr:modules:hadoop-auth:processResources NO-SOURCE
> Task :solr:modules:hadoop-auth:classes UP-TO-DATE
> Task :solr:modules:hadoop-auth:jar
> Task :solr:modules:hadoop-auth:assemblePackaging
> Task :solr:modules:hdfs:compileJava UP-TO-DATE
> Task :solr:modules:hdfs:processResources NO-SOURCE
> Task :solr:modules:hdfs:classes UP-TO-DATE
> Task :solr:modules:hdfs:jar
> Task :solr:modules:hdfs:assemblePackaging
> Task :solr:modules:jaegertracer-configurator:compileJava UP-TO-DATE
> Task :solr:modules:jaegertracer-configurator:processResources NO-SOURCE
> Task :solr:modules:jaegertracer-configurator:classes UP-TO-DATE
> Task :solr:modules:jaegertracer-configurator:jar
> Task :solr:modules:jaegertracer-configurator:assemblePackaging
> Task :solr:modules:jwt-auth:compileJava UP-TO-DATE
> Task :solr:modules:jwt-auth:processResources NO-SOURCE
> Task :solr:modules:jwt-auth:classes UP-TO-DATE
> Task :solr:modules:jwt-auth:jar
> Task :solr:modules:jwt-auth:assemblePackaging
> Task :solr:modules:langid:compileJava UP-TO-DATE
> Task :solr:modules:langid:processResources UP-TO-DATE
> Task :solr:modules:langid:classes UP-TO-DATE
> Task :solr:modules:langid:jar
> Task :solr:modules:langid:assemblePackaging
> Task :solr:modules:ltr:compileJava UP-TO-DATE
> Task :solr:modules:ltr:processResources NO-SOURCE
> Task :solr:modules:ltr:classes UP-TO-DATE
> Task :solr:modules:ltr:jar
> Task :solr:modules:ltr:assemblePackaging
> Task :solr:modules:opentelemetry:compileJava UP-TO-DATE
> Task :solr:modules:opentelemetry:processResources NO-SOURCE
> Task :solr:modules:opentelemetry:classes UP-TO-DATE
> Task :solr:modules:opentelemetry:jar
> Task :solr:modules:opentelemetry:assemblePackaging
> Task :solr:modules:s3-repository:compileJava UP-TO-DATE
> Task :solr:modules:s3-repository:processResources NO-SOURCE
> Task :solr:modules:s3-repository:classes UP-TO-DATE
> Task :solr:modules:s3-repository:jar
> Task :solr:modules:s3-repository:assemblePackaging
> Task :solr:modules:scripting:compileJava UP-TO-DATE
> Task :solr:modules:scripting:processResources NO-SOURCE
> Task :solr:modules:scripting:classes UP-TO-DATE
> Task :solr:modules:scripting:jar
> Task :solr:modules:scripting:assemblePackaging
> Task :solr:modules:sql:compileJava UP-TO-DATE
> Task :solr:modules:sql:processResources UP-TO-DATE
> Task :solr:modules:sql:classes UP-TO-DATE
> Task :solr:modules:sql:jar
> Task :solr:modules:sql:assemblePackaging
> Task :solr:webapp:war
> Task :solr:server:assemblePackaging
> Task :solr:packaging:installFullDist

> Task :solr:packaging:integrationTests
Running BATS tests with Solr base port 40127
1..73
ok 1 auth rejects blockUnknown option with invalid boolean in 2276ms
ok 2 auth rejects updateIncludeFileOnly option with invalid boolean in 2210ms
ok 3 nothing in 12ms
ok 4 create for non cloud mode in 9205ms
ok 5 create for cloud mode in 11261ms
ok 6 create collection in 10038ms
ok 7 reject d option with invalid config dir in 2387ms
ok 8 accept d option with builtin config in 7896ms
ok 9 accept d option with explicit path to config in 5684ms
ok 10 accept n option as config name in 8844ms
ok 11 allow config reuse when n option specifies same config in 10799ms
ok 12 create multisharded collections when s provided in 6803ms
ok 13 create replicated collections when rf provided in 7600ms
ok 14 can delete collections in 11918ms
ok 15 collection delete also deletes zk config in 13333ms
ok 16 deletes accompanying zk config with nondefault name in 13333ms
ok 17 deleteConfig option can opt to leave config in zk in 13138ms
not ok 18 SOLR-16755 test works with noprompt in 226230ms
# (in test file test/test_example_noprompt.bats, line 32)
#   `solr start -e cloud -noprompt' failed
#
# Welcome to the SolrCloud example!
#
# Starting up 2 Solr nodes for your example SolrCloud cluster.
#
# Creating Solr home directory /home/jenkins/jenkins-slave/workspace/Solr/Solr-Smoketest-9.4/_tmp/smoke_1703950524/unpack/solr-9.4.1/solr/packaging/build/solr-9.4.1/example/cloud/node1/solr
# Cloning /home/jenkins/jenkins-slave/workspace/Solr/Solr-Smoketest-9.4/_tmp/smoke_1703950524/unpack/solr-9.4.1/solr/packaging/build/solr-9.4.1/example/cloud/node1 into
#    /home/jenkins/jenkins-slave/workspace/Solr/Solr-Smoketest-9.4/_tmp/smoke_1703950524/unpack/solr-9.4.1/solr/packaging/build/solr-9.4.1/example/cloud/node2
#
# Starting up Solr on port 40127 using command:
# "/home/jenkins/jenkins-slave/workspace/Solr/Solr-Smoketest-9.4/_tmp/smoke_1703950524/unpack/solr-9.4.1/solr/packaging/build/solr-9.4.1/bin/solr" start -cloud -p 40127 -s "build/solr-9.4.1/example/cloud/node1/solr"
#
# Waiting up to 180 seconds to see Solr running on port 40127 [|]   [/]   [-]   [\]   [|]
# Started Solr server on port 40127 (pid=31656). Happy searching!
#
#     
# Starting up Solr on port 40128 using command:
# "/home/jenkins/jenkins-slave/workspace/Solr/Solr-Smoketest-9.4/_tmp/smoke_1703950524/unpack/solr-9.4.1/solr/packaging/build/solr-9.4.1/bin/solr" start -cloud -p 40128 -s "build/solr-9.4.1/example/cloud/node2/solr" -z 127.0.0.1:41127
#
# Waiting up to 180 seconds to see Solr running on port 40128 [|]   [/]   [-]   [\]   [|]   [/]   [-]   [\]   [|]   [/]   [-]   [\]   [|]   [/]   [-]   [\]   [|]   [/]   [-]   [\]   [|]   [/]   [-]   [\]   [|]   [/]   [-]   [\]   [|]   [/]   [-]   [\]   [|]   [/]   [-]   [\]   [|]   [/]   [-]   [\]   [|]   [/]   [-]   [\]   [|]   [/]   [-]   [\]   [|]   [/]   [-]   [\]   [|]   [/]   [-]   [\]   [|]   [/]   [-]   [\]   [|]   [/]   [-]   [\]   [|]   [/]   [-]   [\]   [|]   [/]   [-]   [\]   [|]   [/]   [-]   [\]   [|]   [/]   [-]   [\]   [|]   [/]   [-]   [\]   [|]   [/]   [-]   [\]   [|]   [/]   [-]   [\]   [|]   [/]   [-]   [\]   [|]   [/]   [-]   [\]   [|]   [/]   [-]   [\]   [|]   [/]   [-]   [\]   [|]   [/]   [-]   [\]   [|]   [/]   [-]   [\]   [|]   [/]   [-]   [\]   [|]   [/]   [-]   [\]   [|]   [/]   [-]   [\]   [|]   [/]   [-]   [\]   [|]   [/]   [-]   [\]   [|]   [/]   [-]   [\]   [|]   [/]   [-]   [\]   [|]   [/]   [-]   [\]   [|]   [/]   [-]   [\]   [|]   [/]   [-]   [\]   [|]   [/]   [-]   [\]   [|]   [/]   [-]   [\]   [|]   [/]   [-]   [\]   [|]   [/]   [-]   [\]   [|]   [/]   [-]   [\]   [|]   [/]   [-]   [\]   [|]   [/]   [-]   [\]   [|]   [/]   [-]   [\]   [|]   [/]   [-]   [\]   [|]   [/]   [-]   [\]   [|]   [/]   [-]   [\]   [|]   [/]   [-]   [\]   [|]   [/]   [-]   [\]   [|]   [/]   [-]   [\]   [|]   [/]   [-]   [\]   [|]   [/]   [-]   [\]   [|]   [/]   [-]   [\]   [|]   [/]   [-]   [\]   [|]   [/]   [-]   [\]   [|]   [/]   [-]   [\]   [|]   [/]   [-]   [\]   [|]   [/]   [-]   [\]   [|]   [/]   [-]   [\]   [|]   [/]   [-]   [\]   [|]   [/]   [-]   [\]   [|]   [/]   [-]   [\]   [|]   [/]   [-]   [\]   [|]   [/]   [-]   [\]   [|]   [/]   [-]   [\]   [|]   [/]   [-]   [\]   [|]   [/]   [-]   [\]   [|]   [/]   [-]   [\]   [|]   [/]   [-]   [\]   [|]   [/]   [-]   [\]   [|]   [/]   [-]   [\]   [|]   [/]   [-]   [\]   [|]   [/]   [-]   [\]   [|]   [/]   [-]   [\]   [|]   [/]   [-]   [\]   [|]   [/]   [-]   [\]   [|]   [/]   [-]   [\]   [|]   [/]   [-]   [\]   [|]   [/]   [-]   [\]   [|]   [/]   [-]   [\]   [|]   [/]   [-]   [\]   [|]   [/]   [-]   [\]   [|]   [/]   [-]   [\]   [|]   [/]   [-]   [\]   [|]   [/]   [-]   [\]   [|]   [/]   [-]   [\]   [|]   [/]   [-]   [\]   [|]   [/]   [-]   [\]   [|]   [/]   [-]   [\]  Still not seeing Solr listening on 40128 after 180 seconds!
# 	at org.eclipse.jetty.server.ServerConnector.openAcceptChannel(ServerConnector.java:344) ~[jetty-server-10.0.18.jar:10.0.18]
# 	at org.eclipse.jetty.server.ServerConnector.open(ServerConnector.java:304) ~[jetty-server-10.0.18.jar:10.0.18]
# 	at org.eclipse.jetty.server.Server.lambda$doStart$0(Server.java:402) ~[jetty-server-10.0.18.jar:10.0.18]
# 	at java.base/java.util.stream.ForEachOps$ForEachOp$OfRef.accept(ForEachOps.java:183) ~[?:?]
# 	at java.base/java.util.stream.ReferencePipeline$3$1.accept(ReferencePipeline.java:195) ~[?:?]
# 	at java.base/java.util.stream.ReferencePipeline$2$1.accept(ReferencePipeline.java:177) ~[?:?]
# 	at java.base/java.util.Spliterators$ArraySpliterator.forEachRemaining(Spliterators.java:948) ~[?:?]
# 	at java.base/java.util.stream.AbstractPipeline.copyInto(AbstractPipeline.java:484) ~[?:?]
# 	at java.base/java.util.stream.AbstractPipeline.wrapAndCopyInto(AbstractPipeline.java:474) ~[?:?]
# 	at java.base/java.util.stream.ForEachOps$ForEachOp.evaluateSequential(ForEachOps.java:150) ~[?:?]
# 	at java.base/java.util.stream.ForEachOps$ForEachOp$OfRef.evaluateSequential(ForEachOps.java:173) ~[?:?]
# 	at java.base/java.util.stream.AbstractPipeline.evaluate(AbstractPipeline.java:234) ~[?:?]
# 	at java.base/java.util.stream.ReferencePipeline.forEach(ReferencePipeline.java:497) ~[?:?]
# 	at org.eclipse.jetty.server.Server.doStart(Server.java:398) ~[jetty-server-10.0.18.jar:10.0.18]
# 	at org.eclipse.jetty.util.component.AbstractLifeCycle.start(AbstractLifeCycle.java:93) ~[jetty-util-10.0.18.jar:10.0.18]
# 	at org.eclipse.jetty.xml.XmlConfiguration.main(XmlConfiguration.java:1919) ~[jetty-xml-10.0.18.jar:10.0.18]
# 	at java.base/jdk.internal.reflect.NativeMethodAccessorImpl.invoke0(Native Method) ~[?:?]
# 	at java.base/jdk.internal.reflect.NativeMethodAccessorImpl.invoke(NativeMethodAccessorImpl.java:62) ~[?:?]
# 	at java.base/jdk.internal.reflect.DelegatingMethodAccessorImpl.invoke(DelegatingMethodAccessorImpl.java:43) ~[?:?]
# 	at java.base/java.lang.reflect.Method.invoke(Method.java:566) ~[?:?]
# 	at org.eclipse.jetty.start.Main.invokeMain(Main.java:229) ~[start.jar:10.0.18]
# 	at org.eclipse.jetty.start.Main.start(Main.java:528) ~[start.jar:10.0.18]
# 	at org.eclipse.jetty.start.Main.main(Main.java:76) ~[start.jar:10.0.18]
# Caused by: java.net.BindException: Address already in use
# 	at java.base/sun.nio.ch.Net.bind0(Native Method) ~[?:?]
# 	at java.base/sun.nio.ch.Net.bind(Net.java:459) ~[?:?]
# 	at java.base/sun.nio.ch.Net.bind(Net.java:448) ~[?:?]
# 	at java.base/sun.nio.ch.ServerSocketChannelImpl.bind(ServerSocketChannelImpl.java:227) ~[?:?]
# 	at org.eclipse.jetty.server.ServerConnector.openAcceptChannel(ServerConnector.java:339) ~[jetty-server-10.0.18.jar:10.0.18]
# 	... 22 more
#     
# ERROR: Did not see Solr at http://localhost:40128/solr come online within 30 seconds!
#
# Please find the SOLR_HOME snapshot for failed test #1 at: /home/jenkins/jenkins-slave/workspace/Solr/Solr-Smoketest-9.4/_tmp/smoke_1703950524/unpack/solr-9.4.1/solr/packaging/build/test-output/failure-snapshots/18-1
ok 19 Check export command in 23169ms
ok 20 export fails on non cloud mode in 10449ms
ok 21 using curl to extract a single pdf file in 17831ms
ok 22 using the bin/solr post tool to extract content from pdf in 17278ms
ok 23 using the bin/solr post tool to crawl web site in 19288ms
ok 24 healthcheck on cloud solr in 30834ms
ok 25 start help flag prints help in 182ms
ok 26 stop help flag prints help in 196ms
ok 27 restart help flag prints help in 180ms
ok 28 status help flag prints help in 60ms # skip Currently the status -help flag doesn't return nice help text!
ok 29 healthcheck help flag prints help in 174ms
ok 30 create help flag prints help in 177ms
ok 31 createcore help flag prints help in 175ms
ok 32 createcollection help flag prints help in 174ms
ok 33 delete help flag prints help in 183ms
ok 34 version help flag prints help in 60ms # skip Currently the version -help flag doesn't return nice help text!
ok 35 zk help flag prints help in 194ms
ok 36 auth help flag prints help in 177ms
ok 37 assert help flag prints help in 984ms
ok 38 post help flag prints help in 1001ms
ok 39 SQL Module in 18705ms
ok 40 Hadoop-Auth Module: KerberosPlugin Classloading in 19151ms
ok 41 icu collation in analysis-extras module in 13496ms
ok 42 package detects no running solr in 265ms
ok 43 lifecycle of package in 10085ms
ok 44 deploying and undeploying a collection level package in 14035ms
ok 45 Affinity placement plugin using sysprop in 17506ms
ok 46 Random placement plugin using ENV in 16310ms
ok 47 Check help command in 4231ms
ok 48 basic post with a type specified in 5806ms
ok 49 basic post WITHOUT a type specified in 12432ms
ok 50 crawling a directory in 4799ms
ok 51 crawling a web site in 4916ms
ok 52 commit and optimize and delete in 4072ms
ok 53 args mode in 6617ms
ok 54 stdin mode in 3500ms
ok 55 post solr log into solr via script in 12286ms
ok 56 post solr log into solr via cli in 7327ms
ok 57 allowPaths - backup in 19103ms
ok 58 start solr with ssl in 18697ms
ok 59 use different hostname when not checking peer-name in 31409ms
ok 60 start solr with ssl and auth in 17030ms
ok 61 start solr with client truststore and security manager in 19386ms
ok 62 start solr with mTLS needed in 65843ms
ok 63 start solr with mTLS wanted in 50086ms
ok 64 SOLR-11740 check 'solr stop' connection in 14708ms
ok 65 stop command for single port in 17849ms
ok 66 status detects locally running solr in 7908ms
ok 67 status does not expose cli parameters to end user in 257ms
ok 68 listing out files in 5198ms
ok 69 copying files around in 13242ms
ok 70 upconfig in 2932ms
ok 71 zkcli.sh gets 'solrhome' from 'solr.home' system property in 1255ms
ok 72 zkcli.sh gets 'solrhome' from 'solrhome' command line option in 1251ms
ok 73 Cleanup in 1277ms

> Task :solr:packaging:integrationTests FAILED

FAILURE: Build failed with an exception.

* Where:
Build file '/home/jenkins/jenkins-slave/workspace/Solr/Solr-Smoketest-9.4/_tmp/smoke_1703950524/unpack/solr-9.4.1/solr/packaging/build.gradle' line: 301

* What went wrong:
Execution failed for task ':solr:packaging:integrationTests'.
> Process 'command '/home/jenkins/jenkins-slave/workspace/Solr/Solr-Smoketest-9.4/_tmp/smoke_1703950524/unpack/solr-9.4.1/.gradle/node/packaging/node_modules/bats/bin/bats'' finished with non-zero exit value 1

* Try:
> Run with --stacktrace option to get the stack trace.
> Run with --info or --debug option to get more log output.

* Get more help at https://help.gradle.org

BUILD FAILED in 17m 3s
90 actionable tasks: 56 executed, 34 up-to-date

Publishing build scan...
https://ge.apache.org/s/a2ltappf2a4j4



Traceback (most recent call last):
  File "dev-tools/scripts/smokeTestRelease.py", line 1174, in <module>
    main()
  File "dev-tools/scripts/smokeTestRelease.py", line 1101, in main
    downloadOnly=c.download_only)
  File "dev-tools/scripts/smokeTestRelease.py", line 1162, in smokeTest
    unpackAndVerify(java, tmpDir, 'solr-%s-src.tgz' % version, gitRevision, version, testArgs)
  File "dev-tools/scripts/smokeTestRelease.py", line 553, in unpackAndVerify
    verifyUnpacked(java, artifact, unpackPath, gitRevision, version, testArgs)
  File "dev-tools/scripts/smokeTestRelease.py", line 646, in verifyUnpacked
    java.run_java11('./gradlew --no-daemon integrationTest -Dversion.release=%s' % version, '%s/itest.log' % unpackPath)
  File "dev-tools/scripts/smokeTestRelease.py", line 1010, in run_java
    run('%s; %s' % (cmd_prefix, cmd), logfile)
  File "dev-tools/scripts/smokeTestRelease.py", line 483, in run
    raise RuntimeError('command "%s" failed; see log file %s' % (command, logPath))
RuntimeError: command "export JAVA_HOME="/home/jenkins/tools/java/latest11" PATH="/home/jenkins/tools/java/latest11/bin:$PATH" JAVACMD="/home/jenkins/tools/java/latest11/bin/java"; ./gradlew --no-daemon integrationTest -Dversion.release=9.4.1" failed; see log file /home/jenkins/jenkins-slave/workspace/Solr/Solr-Smoketest-9.4/_tmp/smoke_1703950524/unpack/solr-9.4.1/itest.log
Build step 'Run with timeout' marked build as failure
Email was triggered for: Failure - Any
Sending email for trigger: Failure - Any