You are viewing a plain text version of this content. The canonical link for it is here.
Posted to builds@beam.apache.org by Apache Jenkins Server <je...@builds.apache.org> on 2023/04/12 07:14:07 UTC

Build failed in Jenkins: beam_PostCommit_Java_DataflowV2 #2910

See <https://ci-beam.apache.org/job/beam_PostCommit_Java_DataflowV2/2910/display/redirect>

Changes:


------------------------------------------
[...truncated 62.56 KB...]
INFO:root:pull_licenses_java.py succeed. It took 1.385558 seconds with 16 threads.
Copying licenses from <https://ci-beam.apache.org/job/beam_PostCommit_Java_DataflowV2/ws/src/sdks/java/container/build/target/java_third_party_licenses> to <https://ci-beam.apache.org/job/beam_PostCommit_Java_DataflowV2/ws/src/sdks/java/container/build/target/third_party_licenses.>
Finished license_scripts.sh

> Task :sdks:java:container:goPrepare UP-TO-DATE
> Task :sdks:java:container:java8:copyJavaThirdPartyLicenses

> Task :release:go-licenses:java:dockerRun
W0412 03:57:59.868545      83 library.go:101] "golang.org/x/sys/unix" contains non-Go code that can't be inspected for further dependencies:
/go/pkg/mod/golang.org/x/sys@v0.5.0/unix/asm_linux_amd64.s

> Task :sdks:java:container:goBuild
/home/jenkins/go/bin/go1.20.2 build -o ./build/target/linux_amd64/boot boot.go boot_test.go pathingjar.go pathingjar_test.go

> Task :sdks:java:container:java8:copySdkHarnessLauncher
Execution optimizations have been disabled for task ':sdks:java:container:java8:copySdkHarnessLauncher' to ensure correctness due to the following reasons:
  - Gradle detected a problem with the following location: '<https://ci-beam.apache.org/job/beam_PostCommit_Java_DataflowV2/ws/src/sdks/java/container/build/target'.> Reason: Task ':sdks:java:container:java8:copySdkHarnessLauncher' uses this output of task ':sdks:java:container:downloadCloudProfilerAgent' without declaring an explicit or implicit dependency. This can lead to incorrect results being produced, depending on what order the tasks are executed. Please refer to https://docs.gradle.org/7.5.1/userguide/validation_problems.html#implicit_dependency for more details about this problem.
  - Gradle detected a problem with the following location: '<https://ci-beam.apache.org/job/beam_PostCommit_Java_DataflowV2/ws/src/sdks/java/container/build/target'.> Reason: Task ':sdks:java:container:java8:copySdkHarnessLauncher' uses this output of task ':sdks:java:container:pullLicenses' without declaring an explicit or implicit dependency. This can lead to incorrect results being produced, depending on what order the tasks are executed. Please refer to https://docs.gradle.org/7.5.1/userguide/validation_problems.html#implicit_dependency for more details about this problem.

> Task :release:go-licenses:java:dockerRun
github.com/apache/beam/sdks/v2/go/pkg/beam,https://github.com/apache/beam/blob/sdks/v2.46.0/sdks/go/README.md,Apache-2.0
github.com/apache/beam/sdks/v2/java/container,https://github.com/apache/beam/blob/sdks/v2.46.0/sdks/LICENSE,Apache-2.0
github.com/golang/protobuf,https://github.com/golang/protobuf/blob/v1.5.2/LICENSE,BSD-3-Clause
golang.org/x/net,https://cs.opensource.google/go/x/net/+/v0.5.0:LICENSE,BSD-3-Clause
golang.org/x/sys/unix,https://cs.opensource.google/go/x/sys/+/v0.5.0:LICENSE,BSD-3-Clause
golang.org/x/text,https://cs.opensource.google/go/x/text/+/v0.7.0:LICENSE,BSD-3-Clause
google.golang.org/genproto/googleapis/rpc/status,https://github.com/googleapis/go-genproto/blob/76db0878b65f/LICENSE,Apache-2.0
google.golang.org/grpc,https://github.com/grpc/grpc-go/blob/v1.52.3/LICENSE,Apache-2.0
google.golang.org/protobuf,https://github.com/protocolbuffers/protobuf-go/blob/v1.28.1/LICENSE,BSD-3-Clause
+ chmod -R a+w /output/licenses

> Task :release:go-licenses:java:createLicenses
> Task :sdks:java:container:java8:copyGolangLicenses
> Task :sdks:java:container:java8:dockerPrepare

> Task :sdks:java:container:java8:docker
#1 [internal] load build definition from Dockerfile
#1 transferring dockerfile: 2.58kB done
#1 DONE 0.0s

#2 [internal] load .dockerignore
#2 transferring context: 2B done
#2 DONE 0.0s

#3 [internal] load metadata for docker.io/library/eclipse-temurin:8
#3 DONE 0.3s

#4 [ 1/16] FROM docker.io/library/eclipse-temurin:8@sha256:005d3189b2ec1612c3ade6eadabd1935c312f03aa7905cf0528e9d71980ad512
#4 resolve docker.io/library/eclipse-temurin:8@sha256:005d3189b2ec1612c3ade6eadabd1935c312f03aa7905cf0528e9d71980ad512 0.0s done
#4 CACHED

#5 [internal] load build context
#5 transferring context: 46.89MB 0.4s done
#5 DONE 0.4s

#6 [ 2/16] ADD target/slf4j-api.jar /opt/apache/beam/jars/
#6 DONE 1.1s

#7 [ 3/16] ADD target/slf4j-jdk14.jar /opt/apache/beam/jars/
#7 DONE 0.1s

#8 [ 4/16] ADD target/jcl-over-slf4j.jar /opt/apache/beam/jars/
#8 DONE 0.1s

#9 [ 5/16] ADD target/log4j-over-slf4j.jar /opt/apache/beam/jars/
#9 DONE 0.1s

#10 [ 6/16] ADD target/log4j-to-slf4j.jar /opt/apache/beam/jars/
#10 DONE 0.1s

#11 [ 7/16] ADD target/beam-sdks-java-harness.jar /opt/apache/beam/jars/
#11 DONE 0.1s

#12 [ 8/16] COPY target/jamm.jar target/open-module-agent*.jar /opt/apache/beam/jars/
#12 DONE 0.1s

#13 [ 9/16] COPY target/linux_amd64/boot /opt/apache/beam/
#13 DONE 0.2s

#14 [10/16] COPY target/LICENSE /opt/apache/beam/
#14 DONE 0.1s

#15 [11/16] COPY target/NOTICE /opt/apache/beam/
#15 DONE 0.1s

#16 [12/16] ADD target/third_party_licenses /opt/apache/beam/third_party_licenses/
#16 DONE 0.2s

#17 [13/16] COPY target/LICENSE target/options/* /opt/apache/beam/options/
#17 DONE 0.1s

#18 [14/16] COPY target/go-licenses/* /opt/apache/beam/third_party_licenses/golang/
#18 DONE 0.1s

#19 [15/16] RUN if [ "true" = "false" ] ; then     rm -rf /opt/apache/beam/third_party_licenses ;    fi
#19 DONE 0.3s

#20 [16/16] COPY target/profiler/* /opt/google_cloud_profiler/
#20 DONE 0.1s

#21 exporting to image
#21 exporting layers
#21 exporting layers 0.2s done
#21 writing image sha256:c31e3a9c39138cdce2dc2a3324f8e5683e76682ebc858fbebeba7c049041661d done
#21 naming to docker.io/apache/beam_java8_sdk:2.48.0.dev done
#21 DONE 0.2s

> Task :runners:google-cloud-dataflow-java:buildAndPushDockerJavaContainer
WARNING: `gcloud docker` will not be supported for Docker client versions above 18.03.

As an alternative, use `gcloud auth configure-docker` to configure `docker` to
use `gcloud` as a credential helper, then use `docker` as you would for non-GCR
registries, e.g. `docker pull gcr.io/project-id/my-image`. Add
`--verbosity=error` to silence this warning: `gcloud docker
--verbosity=error -- pull gcr.io/project-id/my-image`.

See: https://cloud.google.com/container-registry/docs/support/deprecation-notices#gcloud-docker

The push refers to repository [us.gcr.io/apache-beam-testing/java-postcommit-it/java]
275dfd5317d1: Preparing
5f70bf18a086: Preparing
df7a06d97f73: Preparing
1d52524ad1f6: Preparing
de20933e7e6b: Preparing
e79668b3e990: Preparing
5c46ab5f10d9: Preparing
4423ad9bb3ed: Preparing
ce11392e6065: Preparing
228156c72e6a: Preparing
0732c73097eb: Preparing
39523acf3f71: Preparing
5efe70f4167c: Preparing
5df617156efb: Preparing
787a24ecee8d: Preparing
533af4d05d89: Preparing
d09fdd9ad3ef: Preparing
04d1dcab20cb: Preparing
b93c1bd012ab: Preparing
5df617156efb: Waiting
0732c73097eb: Waiting
4423ad9bb3ed: Waiting
39523acf3f71: Waiting
ce11392e6065: Waiting
e79668b3e990: Waiting
787a24ecee8d: Waiting
228156c72e6a: Waiting
d09fdd9ad3ef: Waiting
533af4d05d89: Waiting
5c46ab5f10d9: Waiting
04d1dcab20cb: Waiting
b93c1bd012ab: Waiting
5f70bf18a086: Layer already exists
1d52524ad1f6: Pushed
df7a06d97f73: Pushed
e79668b3e990: Pushed
275dfd5317d1: Pushed
de20933e7e6b: Pushed
5c46ab5f10d9: Pushed
ce11392e6065: Pushed
0732c73097eb: Pushed
4423ad9bb3ed: Pushed
228156c72e6a: Pushed
533af4d05d89: Layer already exists
d09fdd9ad3ef: Layer already exists
39523acf3f71: Pushed
04d1dcab20cb: Layer already exists
b93c1bd012ab: Layer already exists
5efe70f4167c: Pushed
5df617156efb: Pushed
787a24ecee8d: Pushed
20230412035738: digest: sha256:b233af0a69d90b89586278694fb4e431518fad6fa6256107ad32e23162b626c0 size: 4296

> Task :runners:google-cloud-dataflow-java:coreSDKJavaRunnerV2IntegrationTest NO-SOURCE
> Task :runners:google-cloud-dataflow-java:examplesJavaRunnerV2IntegrationTest

***********************************************************
***********************************************************
**********************Set Up Pubsub************************
The Pub/Sub topic has been set up for this example: projects/apache-beam-testing/topics/testpipeline-jenkins-0412035827-32c36f68
The Pub/Sub subscription has been set up for this example: projects/apache-beam-testing/subscriptions/testpipeline-jenkins-0412035827-32c36f68
*************************Tear Down*************************
The Pub/Sub topic has been deleted: projects/apache-beam-testing/topics/testpipeline-jenkins-0412035827-32c36f68
The Pub/Sub subscription has been deleted: projects/apache-beam-testing/subscriptions/testpipeline-jenkins-0412035827-32c36f68
***********************************************************
***********************************************************

***********************************************************
***********************************************************
**********************Set Up Pubsub************************
The Pub/Sub topic has been set up for this example: projects/apache-beam-testing/topics/testpipeline-jenkins-0412035827-3ca688e8
The Pub/Sub subscription has been set up for this example: projects/apache-beam-testing/subscriptions/testpipeline-jenkins-0412035827-3ca688e8
*************************Tear Down*************************
The Pub/Sub topic has been deleted: projects/apache-beam-testing/topics/testpipeline-jenkins-0412035827-3ca688e8
The Pub/Sub subscription has been deleted: projects/apache-beam-testing/subscriptions/testpipeline-jenkins-0412035827-3ca688e8
***********************************************************
***********************************************************

> Task :runners:google-cloud-dataflow-java:googleCloudPlatformRunnerV2IntegrationTest

org.apache.beam.sdk.io.gcp.spanner.SpannerReadIT > testReadWithDataBoost FAILED
    java.lang.RuntimeException at SpannerReadIT.java:214

87 tests completed, 1 failed, 2 skipped

> Task :runners:google-cloud-dataflow-java:googleCloudPlatformRunnerV2IntegrationTest FAILED

> Task :runners:google-cloud-dataflow-java:cleanUpDockerJavaImages
Untagged: us.gcr.io/apache-beam-testing/java-postcommit-it/java:20230412035738
Untagged: us.gcr.io/apache-beam-testing/java-postcommit-it/java@sha256:b233af0a69d90b89586278694fb4e431518fad6fa6256107ad32e23162b626c0
Deleted: sha256:c31e3a9c39138cdce2dc2a3324f8e5683e76682ebc858fbebeba7c049041661d
WARNING: Successfully resolved tag to sha256, but it is recommended to use sha256 directly.
Tag: [us.gcr.io/apache-beam-testing/java-postcommit-it/java:20230412035738]
- referencing digest: [us.gcr.io/apache-beam-testing/java-postcommit-it/java@sha256:b233af0a69d90b89586278694fb4e431518fad6fa6256107ad32e23162b626c0]

Deleted [[us.gcr.io/apache-beam-testing/java-postcommit-it/java:20230412035738] (referencing [us.gcr.io/apache-beam-testing/java-postcommit-it/java@sha256:b233af0a69d90b89586278694fb4e431518fad6fa6256107ad32e23162b626c0])].
Removing untagged image us.gcr.io/apache-beam-testing/java-postcommit-it/java@sha256:b233af0a69d90b89586278694fb4e431518fad6fa6256107ad32e23162b626c0
Digests:
- us.gcr.io/apache-beam-testing/java-postcommit-it/java@sha256:b233af0a69d90b89586278694fb4e431518fad6fa6256107ad32e23162b626c0
Deleted [us.gcr.io/apache-beam-testing/java-postcommit-it/java@sha256:b233af0a69d90b89586278694fb4e431518fad6fa6256107ad32e23162b626c0].

FAILURE: Build failed with an exception.

* What went wrong:
Execution failed for task ':runners:google-cloud-dataflow-java:googleCloudPlatformRunnerV2IntegrationTest'.
> There were failing tests. See the report at: file://<https://ci-beam.apache.org/job/beam_PostCommit_Java_DataflowV2/ws/src/runners/google-cloud-dataflow-java/build/reports/tests/googleCloudPlatformRunnerV2IntegrationTest/index.html>

* Try:
> Run with --stacktrace option to get the stack trace.
> Run with --info or --debug option to get more log output.

* Get more help at https://help.gradle.org

Deprecated Gradle features were used in this build, making it incompatible with Gradle 8.0.

You can use '--warning-mode all' to show the individual deprecation warnings and determine if they come from your own scripts or plugins.

See https://docs.gradle.org/7.5.1/userguide/command_line_interface.html#sec:command_line_warnings

Execution optimizations have been disabled for 1 invalid unit(s) of work during this build to ensure correctness.
Please consult deprecation warnings for more details.

BUILD FAILED in 3h 16m 41s
152 actionable tasks: 98 executed, 50 from cache, 4 up-to-date

Publishing build scan...
https://gradle.com/s/rurpbsbqs46mk

Build step 'Invoke Gradle script' changed build result to FAILURE
Build step 'Invoke Gradle script' marked build as failure

---------------------------------------------------------------------
To unsubscribe, e-mail: builds-unsubscribe@beam.apache.org
For additional commands, e-mail: builds-help@beam.apache.org


Jenkins build is back to normal : beam_PostCommit_Java_DataflowV2 #2916

Posted by Apache Jenkins Server <je...@builds.apache.org>.
See <https://ci-beam.apache.org/job/beam_PostCommit_Java_DataflowV2/2916/display/redirect>


---------------------------------------------------------------------
To unsubscribe, e-mail: builds-unsubscribe@beam.apache.org
For additional commands, e-mail: builds-help@beam.apache.org


Build failed in Jenkins: beam_PostCommit_Java_DataflowV2 #2915

Posted by Apache Jenkins Server <je...@builds.apache.org>.
See <https://ci-beam.apache.org/job/beam_PostCommit_Java_DataflowV2/2915/display/redirect>

Changes:


------------------------------------------
[...truncated 66.06 KB...]
> Task :sdks:java:container:java8:docker
#1 [internal] load build definition from Dockerfile
#1 transferring dockerfile:
#1 transferring dockerfile: 2.58kB done
#1 DONE 0.0s

#2 [internal] load .dockerignore
#2 transferring context: 2B done
#2 DONE 0.0s

#3 [internal] load metadata for docker.io/library/eclipse-temurin:8
#3 DONE 0.3s

#4 [ 1/16] FROM docker.io/library/eclipse-temurin:8@sha256:1f41c45c94ce6b02640030362ebd29eaec22ccc65c3e42f3c28f5edd5ca2aab8
#4 resolve docker.io/library/eclipse-temurin:8@sha256:1f41c45c94ce6b02640030362ebd29eaec22ccc65c3e42f3c28f5edd5ca2aab8 0.0s done
#4 CACHED

#5 [internal] load build context
#5 transferring context: 46.89MB 0.5s done
#5 DONE 0.5s

#6 [ 2/16] ADD target/slf4j-api.jar /opt/apache/beam/jars/

> Task :runners:direct-java:shadowTestJar
> Task :sdks:java:extensions:ml:classes
> Task :sdks:java:extensions:ml:jar

> Task :sdks:java:container:java8:docker
#6 DONE 1.4s

#7 [ 3/16] ADD target/slf4j-jdk14.jar /opt/apache/beam/jars/
#7 DONE 0.1s

#8 [ 4/16] ADD target/jcl-over-slf4j.jar /opt/apache/beam/jars/
#8 DONE 0.1s

#9 [ 5/16] ADD target/log4j-over-slf4j.jar /opt/apache/beam/jars/
#9 DONE 0.1s

#10 [ 6/16] ADD target/log4j-to-slf4j.jar /opt/apache/beam/jars/
#10 DONE 0.1s

#11 [ 7/16] ADD target/beam-sdks-java-harness.jar /opt/apache/beam/jars/
#11 DONE 0.1s

#12 [ 8/16] COPY target/jamm.jar target/open-module-agent*.jar /opt/apache/beam/jars/
#12 DONE 0.2s

#13 [ 9/16] COPY target/linux_amd64/boot /opt/apache/beam/
#13 DONE 0.2s

#14 [10/16] COPY target/LICENSE /opt/apache/beam/
#14 DONE 0.1s

#15 [11/16] COPY target/NOTICE /opt/apache/beam/
#15 DONE 0.1s

#16 [12/16] ADD target/third_party_licenses /opt/apache/beam/third_party_licenses/
#16 DONE 0.2s

#17 [13/16] COPY target/LICENSE target/options/* /opt/apache/beam/options/
#17 DONE 0.1s

#18 [14/16] COPY target/go-licenses/* /opt/apache/beam/third_party_licenses/golang/
#18 DONE 0.1s

#19 [15/16] RUN if [ "true" = "false" ] ; then     rm -rf /opt/apache/beam/third_party_licenses ;    fi
#19 DONE 0.4s

#20 [16/16] COPY target/profiler/* /opt/google_cloud_profiler/
#20 DONE 0.1s

#21 exporting to image
#21 exporting layers
#21 exporting layers 0.4s done
#21 writing image sha256:6781dc6d1a87d386e9f322b4b658df546995892a074d69f876f70e6e3dfbe4e5 done
#21 naming to docker.io/apache/beam_java8_sdk:2.48.0.dev done
#21 DONE 0.4s

> Task :runners:google-cloud-dataflow-java:buildAndPushDockerJavaContainer
WARNING: `gcloud docker` will not be supported for Docker client versions above 18.03.

As an alternative, use `gcloud auth configure-docker` to configure `docker` to
use `gcloud` as a credential helper, then use `docker` as you would for non-GCR
registries, e.g. `docker pull gcr.io/project-id/my-image`. Add
`--verbosity=error` to silence this warning: `gcloud docker
--verbosity=error -- pull gcr.io/project-id/my-image`.

See: https://cloud.google.com/container-registry/docs/support/deprecation-notices#gcloud-docker

The push refers to repository [us.gcr.io/apache-beam-testing/java-postcommit-it/java]
b641f39a234f: Preparing
5f70bf18a086: Preparing
490b8295127f: Preparing
4aeada2d2e5b: Preparing
8999b3519a44: Preparing
8acccf15ecd0: Preparing
d092aa550992: Preparing
6353d98c04d4: Preparing
63995b1052cc: Preparing
bce71708e132: Preparing
9ac9cad1cf74: Preparing
97bbe131b72e: Preparing
f683612072f8: Preparing
b9c79a7d3cf4: Preparing
25dafdce988b: Preparing
533af4d05d89: Preparing
d09fdd9ad3ef: Preparing
04d1dcab20cb: Preparing
b93c1bd012ab: Preparing
9ac9cad1cf74: Waiting
533af4d05d89: Waiting
d09fdd9ad3ef: Waiting
97bbe131b72e: Waiting
f683612072f8: Waiting
b9c79a7d3cf4: Waiting
25dafdce988b: Waiting
04d1dcab20cb: Waiting
b93c1bd012ab: Waiting
6353d98c04d4: Waiting
8acccf15ecd0: Waiting
63995b1052cc: Waiting
bce71708e132: Waiting
d092aa550992: Waiting
5f70bf18a086: Layer already exists
4aeada2d2e5b: Pushed
490b8295127f: Pushed
8acccf15ecd0: Pushed
8999b3519a44: Pushed
d092aa550992: Pushed
63995b1052cc: Pushed
9ac9cad1cf74: Pushed
97bbe131b72e: Pushed
bce71708e132: Pushed
6353d98c04d4: Pushed
533af4d05d89: Layer already exists
d09fdd9ad3ef: Layer already exists
04d1dcab20cb: Layer already exists
b93c1bd012ab: Layer already exists
f683612072f8: Pushed
b9c79a7d3cf4: Pushed
25dafdce988b: Pushed
b641f39a234f: Pushed
20230413095741: digest: sha256:7200b902398a3ca75c4a6afd7138d9ee9b3cd55db61b1a31da5b448a916bb733 size: 4296

> Task :runners:google-cloud-dataflow-java:coreSDKJavaRunnerV2IntegrationTest NO-SOURCE
> Task :sdks:java:io:google-cloud-platform:compileTestJava
> Task :examples:java:compileJava

> Task :sdks:java:io:google-cloud-platform:compileTestJava
Note: Some input files use or override a deprecated API.
Note: Recompile with -Xlint:deprecation for details.
Note: Some input files use unchecked or unsafe operations.
Note: Recompile with -Xlint:unchecked for details.

> Task :sdks:java:io:google-cloud-platform:testClasses
> Task :sdks:java:io:google-cloud-platform:testJar

> Task :examples:java:compileJava
Note: Some input files use or override a deprecated API.
Note: Recompile with -Xlint:deprecation for details.
Note: Some input files use unchecked or unsafe operations.
Note: Recompile with -Xlint:unchecked for details.

> Task :examples:java:classes
> Task :examples:java:jar

> Task :examples:java:compileTestJava
Note: Some input files use or override a deprecated API.
Note: Recompile with -Xlint:deprecation for details.
Note: Some input files use unchecked or unsafe operations.
Note: Recompile with -Xlint:unchecked for details.

> Task :examples:java:testClasses
> Task :examples:java:testJar
> Task :runners:google-cloud-dataflow-java:googleCloudPlatformRunnerV2IntegrationTest

org.apache.beam.sdk.io.gcp.spanner.SpannerReadIT > testReadWithDataBoost FAILED
    java.lang.RuntimeException at SpannerReadIT.java:214

87 tests completed, 1 failed, 2 skipped

> Task :runners:google-cloud-dataflow-java:googleCloudPlatformRunnerV2IntegrationTest FAILED
> Task :runners:google-cloud-dataflow-java:examplesJavaRunnerV2IntegrationTest

***********************************************************
***********************************************************
**********************Set Up Pubsub************************
The Pub/Sub topic has been set up for this example: projects/apache-beam-testing/topics/testpipeline-jenkins-0413124027-1719e8f0
The Pub/Sub subscription has been set up for this example: projects/apache-beam-testing/subscriptions/testpipeline-jenkins-0413124027-1719e8f0
*************************Tear Down*************************
The Pub/Sub topic has been deleted: projects/apache-beam-testing/topics/testpipeline-jenkins-0413124027-1719e8f0
The Pub/Sub subscription has been deleted: projects/apache-beam-testing/subscriptions/testpipeline-jenkins-0413124027-1719e8f0
***********************************************************
***********************************************************

***********************************************************
***********************************************************
**********************Set Up Pubsub************************
The Pub/Sub topic has been set up for this example: projects/apache-beam-testing/topics/testpipeline-jenkins-0413124027-1b59a652
The Pub/Sub subscription has been set up for this example: projects/apache-beam-testing/subscriptions/testpipeline-jenkins-0413124027-1b59a652
*************************Tear Down*************************
The Pub/Sub topic has been deleted: projects/apache-beam-testing/topics/testpipeline-jenkins-0413124027-1b59a652
The Pub/Sub subscription has been deleted: projects/apache-beam-testing/subscriptions/testpipeline-jenkins-0413124027-1b59a652
***********************************************************
***********************************************************

> Task :runners:google-cloud-dataflow-java:cleanUpDockerJavaImages
Untagged: us.gcr.io/apache-beam-testing/java-postcommit-it/java:20230413095741
Untagged: us.gcr.io/apache-beam-testing/java-postcommit-it/java@sha256:7200b902398a3ca75c4a6afd7138d9ee9b3cd55db61b1a31da5b448a916bb733
WARNING: Successfully resolved tag to sha256, but it is recommended to use sha256 directly.
Tag: [us.gcr.io/apache-beam-testing/java-postcommit-it/java:20230413095741]
- referencing digest: [us.gcr.io/apache-beam-testing/java-postcommit-it/java@sha256:7200b902398a3ca75c4a6afd7138d9ee9b3cd55db61b1a31da5b448a916bb733]

Deleted [[us.gcr.io/apache-beam-testing/java-postcommit-it/java:20230413095741] (referencing [us.gcr.io/apache-beam-testing/java-postcommit-it/java@sha256:7200b902398a3ca75c4a6afd7138d9ee9b3cd55db61b1a31da5b448a916bb733])].
Removing untagged image us.gcr.io/apache-beam-testing/java-postcommit-it/java@sha256:7200b902398a3ca75c4a6afd7138d9ee9b3cd55db61b1a31da5b448a916bb733
Digests:
- us.gcr.io/apache-beam-testing/java-postcommit-it/java@sha256:7200b902398a3ca75c4a6afd7138d9ee9b3cd55db61b1a31da5b448a916bb733
Deleted [us.gcr.io/apache-beam-testing/java-postcommit-it/java@sha256:7200b902398a3ca75c4a6afd7138d9ee9b3cd55db61b1a31da5b448a916bb733].

FAILURE: Build failed with an exception.

* What went wrong:
Execution failed for task ':runners:google-cloud-dataflow-java:googleCloudPlatformRunnerV2IntegrationTest'.
> There were failing tests. See the report at: file://<https://ci-beam.apache.org/job/beam_PostCommit_Java_DataflowV2/ws/src/runners/google-cloud-dataflow-java/build/reports/tests/googleCloudPlatformRunnerV2IntegrationTest/index.html>

* Try:
> Run with --stacktrace option to get the stack trace.
> Run with --info or --debug option to get more log output.

* Get more help at https://help.gradle.org

Deprecated Gradle features were used in this build, making it incompatible with Gradle 8.0.

You can use '--warning-mode all' to show the individual deprecation warnings and determine if they come from your own scripts or plugins.

See https://docs.gradle.org/7.5.1/userguide/command_line_interface.html#sec:command_line_warnings

Execution optimizations have been disabled for 1 invalid unit(s) of work during this build to ensure correctness.
Please consult deprecation warnings for more details.

BUILD FAILED in 3h 13m 52s
152 actionable tasks: 110 executed, 38 from cache, 4 up-to-date

Publishing build scan...
https://gradle.com/s/57opdba2jl3x4

Build step 'Invoke Gradle script' changed build result to FAILURE
Build step 'Invoke Gradle script' marked build as failure

---------------------------------------------------------------------
To unsubscribe, e-mail: builds-unsubscribe@beam.apache.org
For additional commands, e-mail: builds-help@beam.apache.org


Build failed in Jenkins: beam_PostCommit_Java_DataflowV2 #2914

Posted by Apache Jenkins Server <je...@builds.apache.org>.
See <https://ci-beam.apache.org/job/beam_PostCommit_Java_DataflowV2/2914/display/redirect>

Changes:


------------------------------------------
[...truncated 56.38 KB...]

> Task :release:go-licenses:java:dockerRun
+ go-licenses csv github.com/apache/beam/sdks/v2/java/container
+ tee /output/licenses/list.csv
W0413 03:59:08.095494      79 library.go:101] "golang.org/x/sys/unix" contains non-Go code that can't be inspected for further dependencies:
/go/pkg/mod/golang.org/x/sys@v0.5.0/unix/asm_linux_amd64.s

> Task :sdks:java:extensions:google-cloud-platform-core:compileTestJava
Note: Some input files use or override a deprecated API.
Note: Recompile with -Xlint:deprecation for details.

> Task :sdks:java:extensions:google-cloud-platform-core:testClasses
> Task :sdks:java:extensions:google-cloud-platform-core:testJar
> Task :sdks:java:io:kafka:compileJava
> Task :sdks:java:extensions:ml:compileJava
> Task :sdks:java:extensions:ml:classes

> Task :release:go-licenses:java:dockerRun
+ chmod -R a+w /output/licenses

> Task :release:go-licenses:java:createLicenses
> Task :sdks:java:container:java8:copyGolangLicenses
> Task :sdks:java:extensions:ml:jar
> Task :sdks:java:container:java8:dockerPrepare

> Task :sdks:java:extensions:protobuf:compileTestJava
Note: Some input files use or override a deprecated API.
Note: Recompile with -Xlint:deprecation for details.
Note: Some input files use unchecked or unsafe operations.
Note: Recompile with -Xlint:unchecked for details.

> Task :sdks:java:extensions:protobuf:testClasses
> Task :sdks:java:extensions:protobuf:testJar

> Task :sdks:java:container:java8:docker
#1 [internal] load build definition from Dockerfile
#1 transferring dockerfile: 2.58kB 0.0s done
#1 DONE 0.0s

#2 [internal] load .dockerignore
#2 transferring context: 2B done
#2 DONE 0.0s

#3 [internal] load metadata for docker.io/library/eclipse-temurin:8
#3 DONE 0.3s

#4 [ 1/16] FROM docker.io/library/eclipse-temurin:8@sha256:1f41c45c94ce6b02640030362ebd29eaec22ccc65c3e42f3c28f5edd5ca2aab8
#4 resolve docker.io/library/eclipse-temurin:8@sha256:1f41c45c94ce6b02640030362ebd29eaec22ccc65c3e42f3c28f5edd5ca2aab8 0.1s done
#4 ...

#5 [internal] load build context
#5 transferring context: 46.89MB 0.9s done
#5 DONE 0.9s

#6 [ 2/16] ADD target/slf4j-api.jar /opt/apache/beam/jars/
#6 DONE 1.2s

#4 [ 1/16] FROM docker.io/library/eclipse-temurin:8@sha256:1f41c45c94ce6b02640030362ebd29eaec22ccc65c3e42f3c28f5edd5ca2aab8
#4 ...

#7 [ 3/16] ADD target/slf4j-jdk14.jar /opt/apache/beam/jars/
#7 DONE 0.1s

#8 [ 4/16] ADD target/jcl-over-slf4j.jar /opt/apache/beam/jars/
#8 DONE 0.1s

> Task :runners:direct-java:compileTestJava
Note: Some input files use or override a deprecated API.
Note: Recompile with -Xlint:deprecation for details.
Note: Some input files use unchecked or unsafe operations.
Note: Recompile with -Xlint:unchecked for details.

> Task :runners:direct-java:testClasses

> Task :sdks:java:container:java8:docker

#9 [ 5/16] ADD target/log4j-over-slf4j.jar /opt/apache/beam/jars/
#9 DONE 0.1s

#10 [ 6/16] ADD target/log4j-to-slf4j.jar /opt/apache/beam/jars/
#10 DONE 0.1s

#11 [ 7/16] ADD target/beam-sdks-java-harness.jar /opt/apache/beam/jars/
#11 DONE 0.1s

#4 [ 1/16] FROM docker.io/library/eclipse-temurin:8@sha256:1f41c45c94ce6b02640030362ebd29eaec22ccc65c3e42f3c28f5edd5ca2aab8
#4 ...

#12 [ 8/16] COPY target/jamm.jar target/open-module-agent*.jar /opt/apache/beam/jars/
#12 DONE 0.1s

#13 [ 9/16] COPY target/linux_amd64/boot /opt/apache/beam/
#13 DONE 0.2s

#14 [10/16] COPY target/LICENSE /opt/apache/beam/
#14 DONE 0.1s

#15 [11/16] COPY target/NOTICE /opt/apache/beam/
#15 DONE 0.1s

#16 [12/16] ADD target/third_party_licenses /opt/apache/beam/third_party_licenses/
#16 DONE 0.2s

#17 [13/16] COPY target/LICENSE target/options/* /opt/apache/beam/options/
#17 DONE 0.1s

#4 [ 1/16] FROM docker.io/library/eclipse-temurin:8@sha256:1f41c45c94ce6b02640030362ebd29eaec22ccc65c3e42f3c28f5edd5ca2aab8
#4 ...

#18 [14/16] COPY target/go-licenses/* /opt/apache/beam/third_party_licenses/golang/
#18 DONE 0.1s

#19 [15/16] RUN if [ "true" = "false" ] ; then     rm -rf /opt/apache/beam/third_party_licenses ;    fi
#19 DONE 0.8s

#20 [16/16] COPY target/profiler/* /opt/google_cloud_profiler/
#20 DONE 0.1s

#4 [ 1/16] FROM docker.io/library/eclipse-temurin:8@sha256:1f41c45c94ce6b02640030362ebd29eaec22ccc65c3e42f3c28f5edd5ca2aab8
#4 ...

#21 exporting to image
#21 exporting layers
#21 exporting layers 0.5s done
#21 writing image sha256:1f35e67437af9dcfe80e2f715f22b784ac314d745a333c960a1ae997bdfb80cb done
#21 naming to docker.io/apache/beam_java8_sdk:2.48.0.dev done
#21 DONE 0.5s

#4 [ 1/16] FROM docker.io/library/eclipse-temurin:8@sha256:1f41c45c94ce6b02640030362ebd29eaec22ccc65c3e42f3c28f5edd5ca2aab8

> Task :sdks:java:io:google-cloud-platform:compileJava
> Task :runners:direct-java:shadowTestJar

> Task :runners:google-cloud-dataflow-java:buildAndPushDockerJavaContainer
WARNING: `gcloud docker` will not be supported for Docker client versions above 18.03.

As an alternative, use `gcloud auth configure-docker` to configure `docker` to
use `gcloud` as a credential helper, then use `docker` as you would for non-GCR
registries, e.g. `docker pull gcr.io/project-id/my-image`. Add
`--verbosity=error` to silence this warning: `gcloud docker
--verbosity=error -- pull gcr.io/project-id/my-image`.

See: https://cloud.google.com/container-registry/docs/support/deprecation-notices#gcloud-docker


> Task :sdks:java:io:kafka:compileJava
Note: Some input files use or override a deprecated API.
Note: Recompile with -Xlint:deprecation for details.
Note: Some input files use unchecked or unsafe operations.
Note: Recompile with -Xlint:unchecked for details.

> Task :sdks:java:io:kafka:classes
> Task :sdks:java:io:kafka:jar

> Task :sdks:java:io:google-cloud-platform:compileJava
Note: Some input files use or override a deprecated API.
Note: Recompile with -Xlint:deprecation for details.
Note: Some input files use unchecked or unsafe operations.
Note: Recompile with -Xlint:unchecked for details.

> Task :sdks:java:io:google-cloud-platform:classes
> Task :sdks:java:io:google-cloud-platform:jar
> Task :runners:google-cloud-dataflow-java:compileJava
> Task :examples:java:compileJava
> Task :sdks:java:io:google-cloud-platform:compileTestJava
Note: Some input files use or override a deprecated API.
Note: Recompile with -Xlint:deprecation for details.
Note: Some input files use unchecked or unsafe operations.
Note: Recompile with -Xlint:unchecked for details.

> Task :sdks:java:io:google-cloud-platform:testClasses
> Task :sdks:java:io:google-cloud-platform:testJar

> Task :examples:java:compileJava
Note: Some input files use or override a deprecated API.
Note: Recompile with -Xlint:deprecation for details.
Note: Some input files use unchecked or unsafe operations.
Note: Recompile with -Xlint:unchecked for details.

> Task :examples:java:classes
> Task :examples:java:jar

> Task :examples:java:compileTestJava
Note: Some input files use or override a deprecated API.
Note: Recompile with -Xlint:deprecation for details.
Note: Some input files use unchecked or unsafe operations.
Note: Recompile with -Xlint:unchecked for details.

> Task :examples:java:testClasses
> Task :examples:java:testJar

> Task :runners:google-cloud-dataflow-java:compileJava
Note: Some input files use or override a deprecated API.
Note: Recompile with -Xlint:deprecation for details.
Note: Some input files use unchecked or unsafe operations.
Note: Recompile with -Xlint:unchecked for details.

> Task :runners:google-cloud-dataflow-java:classes
> Task :runners:google-cloud-dataflow-java:jar
> Task :runners:google-cloud-dataflow-java:coreSDKJavaRunnerV2IntegrationTest NO-SOURCE
> Task :runners:google-cloud-dataflow-java:examplesJavaRunnerV2IntegrationTest
> Task :runners:google-cloud-dataflow-java:googleCloudPlatformRunnerV2IntegrationTest

org.apache.beam.sdk.io.gcp.spanner.SpannerReadIT > testReadWithDataBoost FAILED
    java.lang.RuntimeException at SpannerReadIT.java:214

87 tests completed, 1 failed, 2 skipped

> Task :runners:google-cloud-dataflow-java:googleCloudPlatformRunnerV2IntegrationTest FAILED

> Task :runners:google-cloud-dataflow-java:cleanUpDockerJavaImages
WARNING: Successfully resolved tag to sha256, but it is recommended to use sha256 directly.
Tag: [us.gcr.io/apache-beam-testing/java-postcommit-it/java:20230413035744]
- referencing digest: [us.gcr.io/apache-beam-testing/java-postcommit-it/java@sha256:c55701cb28396b8021a2d1004ebd2a06591ecff5c1ff645f584cc0af6a07ff3a]

Deleted [[us.gcr.io/apache-beam-testing/java-postcommit-it/java:20230413035744] (referencing [us.gcr.io/apache-beam-testing/java-postcommit-it/java@sha256:c55701cb28396b8021a2d1004ebd2a06591ecff5c1ff645f584cc0af6a07ff3a])].
Digests:
- us.gcr.io/apache-beam-testing/java-postcommit-it/java@sha256:c55701cb28396b8021a2d1004ebd2a06591ecff5c1ff645f584cc0af6a07ff3a
Deleted [us.gcr.io/apache-beam-testing/java-postcommit-it/java@sha256:c55701cb28396b8021a2d1004ebd2a06591ecff5c1ff645f584cc0af6a07ff3a].

FAILURE: Build failed with an exception.

* What went wrong:
Execution failed for task ':runners:google-cloud-dataflow-java:googleCloudPlatformRunnerV2IntegrationTest'.
> There were failing tests. See the report at: file://<https://ci-beam.apache.org/job/beam_PostCommit_Java_DataflowV2/ws/src/runners/google-cloud-dataflow-java/build/reports/tests/googleCloudPlatformRunnerV2IntegrationTest/index.html>

* Try:
> Run with --stacktrace option to get the stack trace.
> Run with --info or --debug option to get more log output.

* Get more help at https://help.gradle.org

Deprecated Gradle features were used in this build, making it incompatible with Gradle 8.0.

You can use '--warning-mode all' to show the individual deprecation warnings and determine if they come from your own scripts or plugins.

See https://docs.gradle.org/7.5.1/userguide/command_line_interface.html#sec:command_line_warnings

Execution optimizations have been disabled for 1 invalid unit(s) of work during this build to ensure correctness.
Please consult deprecation warnings for more details.

BUILD FAILED in 3h 14m 52s
152 actionable tasks: 118 executed, 30 from cache, 4 up-to-date

Publishing build scan...
https://gradle.com/s/4j3zqi7wvkml4

Build step 'Invoke Gradle script' changed build result to FAILURE
Build step 'Invoke Gradle script' marked build as failure

---------------------------------------------------------------------
To unsubscribe, e-mail: builds-unsubscribe@beam.apache.org
For additional commands, e-mail: builds-help@beam.apache.org


Build failed in Jenkins: beam_PostCommit_Java_DataflowV2 #2913

Posted by Apache Jenkins Server <je...@builds.apache.org>.
See <https://ci-beam.apache.org/job/beam_PostCommit_Java_DataflowV2/2913/display/redirect>

Changes:


------------------------------------------
[...truncated 62.98 KB...]
go: downloading golang.org/x/sys v0.5.0
go: downloading google.golang.org/grpc v1.52.3
go: downloading google.golang.org/protobuf v1.28.1
go: downloading google.golang.org/genproto v0.0.0-20230110181048-76db0878b65f
go: downloading golang.org/x/text v0.7.0
go: added github.com/apache/beam/sdks/v2 v2.46.0
go: added github.com/golang/protobuf v1.5.2
go: added golang.org/x/net v0.5.0
go: added golang.org/x/sys v0.5.0
go: added golang.org/x/text v0.7.0
go: added google.golang.org/genproto v0.0.0-20230110181048-76db0878b65f
go: added google.golang.org/grpc v1.52.3
go: added google.golang.org/protobuf v1.28.1
+ go-licenses save github.com/apache/beam/sdks/v2/java/container --save_path=/output/licenses
W0412 21:59:56.798275      38 library.go:101] "golang.org/x/sys/unix" contains non-Go code that can't be inspected for further dependencies:
/go/pkg/mod/golang.org/x/sys@v0.5.0/unix/asm_linux_amd64.s
+ go-licenses csv github.com/apache/beam/sdks/v2/java/container
+ tee /output/licenses/list.csv
W0412 22:00:01.023070      84 library.go:101] "golang.org/x/sys/unix" contains non-Go code that can't be inspected for further dependencies:
/go/pkg/mod/golang.org/x/sys@v0.5.0/unix/asm_linux_amd64.s
github.com/apache/beam/sdks/v2/go/pkg/beam,https://github.com/apache/beam/blob/sdks/v2.46.0/sdks/go/README.md,Apache-2.0
github.com/apache/beam/sdks/v2/java/container,https://github.com/apache/beam/blob/sdks/v2.46.0/sdks/LICENSE,Apache-2.0
github.com/golang/protobuf,https://github.com/golang/protobuf/blob/v1.5.2/LICENSE,BSD-3-Clause
golang.org/x/net,https://cs.opensource.google/go/x/net/+/v0.5.0:LICENSE,BSD-3-Clause
golang.org/x/sys/unix,https://cs.opensource.google/go/x/sys/+/v0.5.0:LICENSE,BSD-3-Clause
golang.org/x/text,https://cs.opensource.google/go/x/text/+/v0.7.0:LICENSE,BSD-3-Clause
google.golang.org/genproto/googleapis/rpc/status,https://github.com/googleapis/go-genproto/blob/76db0878b65f/LICENSE,Apache-2.0
google.golang.org/grpc,https://github.com/grpc/grpc-go/blob/v1.52.3/LICENSE,Apache-2.0
google.golang.org/protobuf,https://github.com/protocolbuffers/protobuf-go/blob/v1.28.1/LICENSE,BSD-3-Clause
+ chmod -R a+w /output/licenses

> Task :release:go-licenses:java:createLicenses
> Task :sdks:java:container:java8:copyGolangLicenses
> Task :sdks:java:container:java8:dockerPrepare

> Task :sdks:java:container:java8:docker
#1 [internal] load build definition from Dockerfile
#1 transferring dockerfile: 2.58kB 0.0s done
#1 DONE 0.0s

#2 [internal] load .dockerignore
#2 transferring context: 2B done
#2 DONE 0.0s

#3 [internal] load metadata for docker.io/library/eclipse-temurin:8
#3 DONE 0.3s

#4 [ 1/16] FROM docker.io/library/eclipse-temurin:8@sha256:1f41c45c94ce6b02640030362ebd29eaec22ccc65c3e42f3c28f5edd5ca2aab8
#4 resolve docker.io/library/eclipse-temurin:8@sha256:1f41c45c94ce6b02640030362ebd29eaec22ccc65c3e42f3c28f5edd5ca2aab8 0.0s done
#4 CACHED

#5 [internal] load build context
#5 transferring context: 46.89MB 0.4s done
#5 DONE 0.4s

#6 [ 2/16] ADD target/slf4j-api.jar /opt/apache/beam/jars/
#6 DONE 1.7s

#7 [ 3/16] ADD target/slf4j-jdk14.jar /opt/apache/beam/jars/
#7 DONE 0.1s

#8 [ 4/16] ADD target/jcl-over-slf4j.jar /opt/apache/beam/jars/
#8 DONE 0.1s

#9 [ 5/16] ADD target/log4j-over-slf4j.jar /opt/apache/beam/jars/
#9 DONE 0.1s

#10 [ 6/16] ADD target/log4j-to-slf4j.jar /opt/apache/beam/jars/
#10 DONE 0.1s

#11 [ 7/16] ADD target/beam-sdks-java-harness.jar /opt/apache/beam/jars/
#11 DONE 0.1s

#12 [ 8/16] COPY target/jamm.jar target/open-module-agent*.jar /opt/apache/beam/jars/
#12 DONE 0.1s

#13 [ 9/16] COPY target/linux_amd64/boot /opt/apache/beam/
#13 DONE 0.2s

#14 [10/16] COPY target/LICENSE /opt/apache/beam/
#14 DONE 0.1s

#15 [11/16] COPY target/NOTICE /opt/apache/beam/
#15 DONE 0.1s

#16 [12/16] ADD target/third_party_licenses /opt/apache/beam/third_party_licenses/
#16 DONE 0.3s

#17 [13/16] COPY target/LICENSE target/options/* /opt/apache/beam/options/
#17 DONE 0.1s

#18 [14/16] COPY target/go-licenses/* /opt/apache/beam/third_party_licenses/golang/
#18 DONE 0.1s

#19 [15/16] RUN if [ "true" = "false" ] ; then     rm -rf /opt/apache/beam/third_party_licenses ;    fi
#19 DONE 0.8s

#20 [16/16] COPY target/profiler/* /opt/google_cloud_profiler/
#20 DONE 0.4s

#21 exporting to image
#21 exporting layers
#21 exporting layers 0.2s done
#21 writing image sha256:1743cbb7c822f9a832ab1af3a5bae59175051e2ab70c0e5243ac171345d4a71e done
#21 naming to docker.io/apache/beam_java8_sdk:2.48.0.dev done
#21 DONE 0.2s

> Task :runners:google-cloud-dataflow-java:buildAndPushDockerJavaContainer
WARNING: `gcloud docker` will not be supported for Docker client versions above 18.03.

As an alternative, use `gcloud auth configure-docker` to configure `docker` to
use `gcloud` as a credential helper, then use `docker` as you would for non-GCR
registries, e.g. `docker pull gcr.io/project-id/my-image`. Add
`--verbosity=error` to silence this warning: `gcloud docker
--verbosity=error -- pull gcr.io/project-id/my-image`.

See: https://cloud.google.com/container-registry/docs/support/deprecation-notices#gcloud-docker

The push refers to repository [us.gcr.io/apache-beam-testing/java-postcommit-it/java]
3ac9ad0aa9a8: Preparing
5f70bf18a086: Preparing
4f1378e4e00f: Preparing
f74500ad8544: Preparing
15bb96458e20: Preparing
e6019076a62c: Preparing
87072b031455: Preparing
9f4dbbe71c34: Preparing
7d91698f776e: Preparing
0ab71bbcc183: Preparing
dc23278b1cae: Preparing
c1e6782b12f1: Preparing
a350abe92807: Preparing
40c8bff19cae: Preparing
04ab3e09f8f8: Preparing
533af4d05d89: Preparing
d09fdd9ad3ef: Preparing
04d1dcab20cb: Preparing
b93c1bd012ab: Preparing
87072b031455: Waiting
0ab71bbcc183: Waiting
9f4dbbe71c34: Waiting
dc23278b1cae: Waiting
7d91698f776e: Waiting
c1e6782b12f1: Waiting
a350abe92807: Waiting
e6019076a62c: Waiting
40c8bff19cae: Waiting
04d1dcab20cb: Waiting
b93c1bd012ab: Waiting
04ab3e09f8f8: Waiting
d09fdd9ad3ef: Waiting
5f70bf18a086: Layer already exists
f74500ad8544: Pushed
4f1378e4e00f: Pushed
e6019076a62c: Pushed
15bb96458e20: Pushed
7d91698f776e: Pushed
3ac9ad0aa9a8: Pushed
87072b031455: Pushed
9f4dbbe71c34: Pushed
0ab71bbcc183: Pushed
dc23278b1cae: Pushed
533af4d05d89: Layer already exists
c1e6782b12f1: Pushed
a350abe92807: Pushed
d09fdd9ad3ef: Layer already exists
04d1dcab20cb: Layer already exists
b93c1bd012ab: Layer already exists
04ab3e09f8f8: Pushed
40c8bff19cae: Pushed
20230412215838: digest: sha256:57791d9a32945bde03b5d23646b8a1c688b5a83db624b46babf3177f25fa51d6 size: 4296

> Task :runners:google-cloud-dataflow-java:coreSDKJavaRunnerV2IntegrationTest NO-SOURCE
> Task :runners:google-cloud-dataflow-java:examplesJavaRunnerV2IntegrationTest

***********************************************************
***********************************************************
**********************Set Up Pubsub************************
The Pub/Sub topic has been set up for this example: projects/apache-beam-testing/topics/testpipeline-jenkins-0412220045-7c08e233
The Pub/Sub subscription has been set up for this example: projects/apache-beam-testing/subscriptions/testpipeline-jenkins-0412220045-7c08e233
*************************Tear Down*************************
The Pub/Sub topic has been deleted: projects/apache-beam-testing/topics/testpipeline-jenkins-0412220045-7c08e233
The Pub/Sub subscription has been deleted: projects/apache-beam-testing/subscriptions/testpipeline-jenkins-0412220045-7c08e233
***********************************************************
***********************************************************

***********************************************************
***********************************************************
**********************Set Up Pubsub************************
The Pub/Sub topic has been set up for this example: projects/apache-beam-testing/topics/testpipeline-jenkins-0412220044-f7c521b8
The Pub/Sub subscription has been set up for this example: projects/apache-beam-testing/subscriptions/testpipeline-jenkins-0412220044-f7c521b8
*************************Tear Down*************************
The Pub/Sub topic has been deleted: projects/apache-beam-testing/topics/testpipeline-jenkins-0412220044-f7c521b8
The Pub/Sub subscription has been deleted: projects/apache-beam-testing/subscriptions/testpipeline-jenkins-0412220044-f7c521b8
***********************************************************
***********************************************************

> Task :runners:google-cloud-dataflow-java:googleCloudPlatformRunnerV2IntegrationTest

org.apache.beam.sdk.io.gcp.spanner.SpannerReadIT > testReadWithDataBoost FAILED
    java.lang.RuntimeException at SpannerReadIT.java:214

87 tests completed, 1 failed, 2 skipped

> Task :runners:google-cloud-dataflow-java:googleCloudPlatformRunnerV2IntegrationTest FAILED

> Task :runners:google-cloud-dataflow-java:cleanUpDockerJavaImages
Untagged: us.gcr.io/apache-beam-testing/java-postcommit-it/java:20230412215838
Untagged: us.gcr.io/apache-beam-testing/java-postcommit-it/java@sha256:57791d9a32945bde03b5d23646b8a1c688b5a83db624b46babf3177f25fa51d6
Deleted: sha256:1743cbb7c822f9a832ab1af3a5bae59175051e2ab70c0e5243ac171345d4a71e
WARNING: Successfully resolved tag to sha256, but it is recommended to use sha256 directly.
Tag: [us.gcr.io/apache-beam-testing/java-postcommit-it/java:20230412215838]
- referencing digest: [us.gcr.io/apache-beam-testing/java-postcommit-it/java@sha256:57791d9a32945bde03b5d23646b8a1c688b5a83db624b46babf3177f25fa51d6]

Deleted [[us.gcr.io/apache-beam-testing/java-postcommit-it/java:20230412215838] (referencing [us.gcr.io/apache-beam-testing/java-postcommit-it/java@sha256:57791d9a32945bde03b5d23646b8a1c688b5a83db624b46babf3177f25fa51d6])].
Removing untagged image us.gcr.io/apache-beam-testing/java-postcommit-it/java@sha256:57791d9a32945bde03b5d23646b8a1c688b5a83db624b46babf3177f25fa51d6
Digests:
- us.gcr.io/apache-beam-testing/java-postcommit-it/java@sha256:57791d9a32945bde03b5d23646b8a1c688b5a83db624b46babf3177f25fa51d6
Deleted [us.gcr.io/apache-beam-testing/java-postcommit-it/java@sha256:57791d9a32945bde03b5d23646b8a1c688b5a83db624b46babf3177f25fa51d6].

FAILURE: Build failed with an exception.

* What went wrong:
Execution failed for task ':runners:google-cloud-dataflow-java:googleCloudPlatformRunnerV2IntegrationTest'.
> There were failing tests. See the report at: file://<https://ci-beam.apache.org/job/beam_PostCommit_Java_DataflowV2/ws/src/runners/google-cloud-dataflow-java/build/reports/tests/googleCloudPlatformRunnerV2IntegrationTest/index.html>

* Try:
> Run with --stacktrace option to get the stack trace.
> Run with --info or --debug option to get more log output.

* Get more help at https://help.gradle.org

Deprecated Gradle features were used in this build, making it incompatible with Gradle 8.0.

You can use '--warning-mode all' to show the individual deprecation warnings and determine if they come from your own scripts or plugins.

See https://docs.gradle.org/7.5.1/userguide/command_line_interface.html#sec:command_line_warnings

Execution optimizations have been disabled for 1 invalid unit(s) of work during this build to ensure correctness.
Please consult deprecation warnings for more details.

BUILD FAILED in 3h 17m 21s
152 actionable tasks: 98 executed, 50 from cache, 4 up-to-date

Publishing build scan...
https://gradle.com/s/fmhw3z5mcbb2k

Build step 'Invoke Gradle script' changed build result to FAILURE
Build step 'Invoke Gradle script' marked build as failure

---------------------------------------------------------------------
To unsubscribe, e-mail: builds-unsubscribe@beam.apache.org
For additional commands, e-mail: builds-help@beam.apache.org


Build failed in Jenkins: beam_PostCommit_Java_DataflowV2 #2912

Posted by Apache Jenkins Server <je...@builds.apache.org>.
See <https://ci-beam.apache.org/job/beam_PostCommit_Java_DataflowV2/2912/display/redirect?page=changes>

Changes:

[noreply] update documentation (#26201)


------------------------------------------
[...truncated 62.65 KB...]

> Task :sdks:java:container:java8:copyJavaThirdPartyLicenses

> Task :sdks:java:container:goBuild
/home/jenkins/go/bin/go1.20.2 build -o ./build/target/linux_amd64/boot boot.go boot_test.go pathingjar.go pathingjar_test.go
go: downloading golang.org/x/net v0.9.0
go: downloading google.golang.org/genproto v0.0.0-20230403163135-c38d8f061ccd

> Task :release:go-licenses:java:dockerRun
+ go-licenses csv github.com/apache/beam/sdks/v2/java/container
+ tee /output/licenses/list.csv
W0412 15:58:16.907576      86 library.go:101] "golang.org/x/sys/unix" contains non-Go code that can't be inspected for further dependencies:
/go/pkg/mod/golang.org/x/sys@v0.5.0/unix/asm_linux_amd64.s
github.com/apache/beam/sdks/v2/go/pkg/beam,https://github.com/apache/beam/blob/sdks/v2.46.0/sdks/go/README.md,Apache-2.0
github.com/apache/beam/sdks/v2/java/container,https://github.com/apache/beam/blob/sdks/v2.46.0/sdks/LICENSE,Apache-2.0
github.com/golang/protobuf,https://github.com/golang/protobuf/blob/v1.5.2/LICENSE,BSD-3-Clause
golang.org/x/net,https://cs.opensource.google/go/x/net/+/v0.5.0:LICENSE,BSD-3-Clause
golang.org/x/sys/unix,https://cs.opensource.google/go/x/sys/+/v0.5.0:LICENSE,BSD-3-Clause
golang.org/x/text,https://cs.opensource.google/go/x/text/+/v0.7.0:LICENSE,BSD-3-Clause
google.golang.org/genproto/googleapis/rpc/status,https://github.com/googleapis/go-genproto/blob/76db0878b65f/LICENSE,Apache-2.0
google.golang.org/grpc,https://github.com/grpc/grpc-go/blob/v1.52.3/LICENSE,Apache-2.0
google.golang.org/protobuf,https://github.com/protocolbuffers/protobuf-go/blob/v1.28.1/LICENSE,BSD-3-Clause
+ chmod -R a+w /output/licenses

> Task :release:go-licenses:java:createLicenses
> Task :sdks:java:container:java8:copyGolangLicenses

> Task :sdks:java:container:java8:copySdkHarnessLauncher
Execution optimizations have been disabled for task ':sdks:java:container:java8:copySdkHarnessLauncher' to ensure correctness due to the following reasons:
  - Gradle detected a problem with the following location: '<https://ci-beam.apache.org/job/beam_PostCommit_Java_DataflowV2/ws/src/sdks/java/container/build/target'.> Reason: Task ':sdks:java:container:java8:copySdkHarnessLauncher' uses this output of task ':sdks:java:container:downloadCloudProfilerAgent' without declaring an explicit or implicit dependency. This can lead to incorrect results being produced, depending on what order the tasks are executed. Please refer to https://docs.gradle.org/7.5.1/userguide/validation_problems.html#implicit_dependency for more details about this problem.
  - Gradle detected a problem with the following location: '<https://ci-beam.apache.org/job/beam_PostCommit_Java_DataflowV2/ws/src/sdks/java/container/build/target'.> Reason: Task ':sdks:java:container:java8:copySdkHarnessLauncher' uses this output of task ':sdks:java:container:pullLicenses' without declaring an explicit or implicit dependency. This can lead to incorrect results being produced, depending on what order the tasks are executed. Please refer to https://docs.gradle.org/7.5.1/userguide/validation_problems.html#implicit_dependency for more details about this problem.

> Task :sdks:java:container:java8:dockerPrepare

> Task :sdks:java:container:java8:docker
#1 [internal] load .dockerignore
#1 transferring context: 2B 0.0s done
#1 DONE 0.1s

#2 [internal] load build definition from Dockerfile
#2 transferring dockerfile: 2.58kB 0.1s done
#2 DONE 0.1s

#3 [internal] load metadata for docker.io/library/eclipse-temurin:8
#3 DONE 0.4s

#4 [ 1/16] FROM docker.io/library/eclipse-temurin:8@sha256:1f41c45c94ce6b02640030362ebd29eaec22ccc65c3e42f3c28f5edd5ca2aab8
#4 resolve docker.io/library/eclipse-temurin:8@sha256:1f41c45c94ce6b02640030362ebd29eaec22ccc65c3e42f3c28f5edd5ca2aab8 0.0s done
#4 CACHED

#5 [internal] load build context
#5 transferring context: 46.89MB 0.4s done
#5 DONE 0.4s

#6 [ 2/16] ADD target/slf4j-api.jar /opt/apache/beam/jars/
#6 DONE 5.3s

#7 [ 3/16] ADD target/slf4j-jdk14.jar /opt/apache/beam/jars/
#7 DONE 0.1s

#8 [ 4/16] ADD target/jcl-over-slf4j.jar /opt/apache/beam/jars/
#8 DONE 0.1s

#9 [ 5/16] ADD target/log4j-over-slf4j.jar /opt/apache/beam/jars/
#9 DONE 0.1s

#10 [ 6/16] ADD target/log4j-to-slf4j.jar /opt/apache/beam/jars/
#10 DONE 0.1s

#11 [ 7/16] ADD target/beam-sdks-java-harness.jar /opt/apache/beam/jars/
#11 DONE 0.1s

#12 [ 8/16] COPY target/jamm.jar target/open-module-agent*.jar /opt/apache/beam/jars/
#12 DONE 0.1s

#13 [ 9/16] COPY target/linux_amd64/boot /opt/apache/beam/
#13 DONE 0.2s

#14 [10/16] COPY target/LICENSE /opt/apache/beam/
#14 DONE 0.1s

#15 [11/16] COPY target/NOTICE /opt/apache/beam/
#15 DONE 0.1s

#16 [12/16] ADD target/third_party_licenses /opt/apache/beam/third_party_licenses/
#16 DONE 0.3s

#17 [13/16] COPY target/LICENSE target/options/* /opt/apache/beam/options/
#17 DONE 0.1s

#18 [14/16] COPY target/go-licenses/* /opt/apache/beam/third_party_licenses/golang/
#18 DONE 0.1s

#19 [15/16] RUN if [ "true" = "false" ] ; then     rm -rf /opt/apache/beam/third_party_licenses ;    fi
#19 DONE 0.7s

#20 [16/16] COPY target/profiler/* /opt/google_cloud_profiler/
#20 DONE 0.1s

#21 exporting to image
#21 exporting layers
#21 exporting layers 0.3s done
#21 writing image sha256:9cb500dd41a326b94ba514a7ca56ef0930169926c7f999037824922dfcf75a04 done
#21 naming to docker.io/apache/beam_java8_sdk:2.48.0.dev done
#21 DONE 0.3s

> Task :runners:google-cloud-dataflow-java:buildAndPushDockerJavaContainer
WARNING: `gcloud docker` will not be supported for Docker client versions above 18.03.

As an alternative, use `gcloud auth configure-docker` to configure `docker` to
use `gcloud` as a credential helper, then use `docker` as you would for non-GCR
registries, e.g. `docker pull gcr.io/project-id/my-image`. Add
`--verbosity=error` to silence this warning: `gcloud docker
--verbosity=error -- pull gcr.io/project-id/my-image`.

See: https://cloud.google.com/container-registry/docs/support/deprecation-notices#gcloud-docker

The push refers to repository [us.gcr.io/apache-beam-testing/java-postcommit-it/java]
d2c1cc11f0b7: Preparing
5f70bf18a086: Preparing
5cc4f3af4606: Preparing
3a9418a3c2f3: Preparing
c2b2569fdc08: Preparing
4f5616ac45b3: Preparing
477af8171244: Preparing
987e2866cf98: Preparing
62a2a5b04a43: Preparing
7f4c3dab7402: Preparing
35fcd9cb1f2c: Preparing
ce47b241ed46: Preparing
2eb2d2457563: Preparing
1636faf92831: Preparing
1f4fa56b7c98: Preparing
533af4d05d89: Preparing
d09fdd9ad3ef: Preparing
04d1dcab20cb: Preparing
b93c1bd012ab: Preparing
2eb2d2457563: Waiting
62a2a5b04a43: Waiting
7f4c3dab7402: Waiting
987e2866cf98: Waiting
d09fdd9ad3ef: Waiting
04d1dcab20cb: Waiting
477af8171244: Waiting
1636faf92831: Waiting
35fcd9cb1f2c: Waiting
b93c1bd012ab: Waiting
4f5616ac45b3: Waiting
5f70bf18a086: Layer already exists
5cc4f3af4606: Pushed
4f5616ac45b3: Pushed
3a9418a3c2f3: Pushed
d2c1cc11f0b7: Pushed
c2b2569fdc08: Pushed
477af8171244: Pushed
62a2a5b04a43: Pushed
35fcd9cb1f2c: Pushed
987e2866cf98: Pushed
7f4c3dab7402: Pushed
ce47b241ed46: Pushed
533af4d05d89: Layer already exists
d09fdd9ad3ef: Layer already exists
b93c1bd012ab: Layer already exists
2eb2d2457563: Pushed
04d1dcab20cb: Layer already exists
1636faf92831: Pushed
1f4fa56b7c98: Pushed
20230412155743: digest: sha256:4695159466e1b92094bf49b01573c960338d991606e937ba86f6d3a21cdd6776 size: 4296

> Task :runners:google-cloud-dataflow-java:coreSDKJavaRunnerV2IntegrationTest NO-SOURCE
> Task :runners:google-cloud-dataflow-java:examplesJavaRunnerV2IntegrationTest

***********************************************************
***********************************************************
**********************Set Up Pubsub************************
The Pub/Sub topic has been set up for this example: projects/apache-beam-testing/topics/testpipeline-jenkins-0412155901-a095a3fc
The Pub/Sub subscription has been set up for this example: projects/apache-beam-testing/subscriptions/testpipeline-jenkins-0412155901-a095a3fc
*************************Tear Down*************************
The Pub/Sub topic has been deleted: projects/apache-beam-testing/topics/testpipeline-jenkins-0412155901-a095a3fc
The Pub/Sub subscription has been deleted: projects/apache-beam-testing/subscriptions/testpipeline-jenkins-0412155901-a095a3fc
***********************************************************
***********************************************************

***********************************************************
***********************************************************
**********************Set Up Pubsub************************
The Pub/Sub topic has been set up for this example: projects/apache-beam-testing/topics/testpipeline-jenkins-0412155900-d2be1c5d
The Pub/Sub subscription has been set up for this example: projects/apache-beam-testing/subscriptions/testpipeline-jenkins-0412155900-d2be1c5d
*************************Tear Down*************************
The Pub/Sub topic has been deleted: projects/apache-beam-testing/topics/testpipeline-jenkins-0412155900-d2be1c5d
The Pub/Sub subscription has been deleted: projects/apache-beam-testing/subscriptions/testpipeline-jenkins-0412155900-d2be1c5d
***********************************************************
***********************************************************

> Task :runners:google-cloud-dataflow-java:googleCloudPlatformRunnerV2IntegrationTest

org.apache.beam.sdk.io.gcp.pubsub.PubsubReadIT > testReadPubsubMessageId FAILED
    java.lang.AssertionError at PubsubReadIT.java:85

org.apache.beam.sdk.io.gcp.spanner.SpannerReadIT > testReadWithDataBoost FAILED
    java.lang.RuntimeException at SpannerReadIT.java:214

87 tests completed, 2 failed, 2 skipped

> Task :runners:google-cloud-dataflow-java:googleCloudPlatformRunnerV2IntegrationTest FAILED

> Task :runners:google-cloud-dataflow-java:cleanUpDockerJavaImages
Untagged: us.gcr.io/apache-beam-testing/java-postcommit-it/java:20230412155743
Untagged: us.gcr.io/apache-beam-testing/java-postcommit-it/java@sha256:4695159466e1b92094bf49b01573c960338d991606e937ba86f6d3a21cdd6776
Deleted: sha256:9cb500dd41a326b94ba514a7ca56ef0930169926c7f999037824922dfcf75a04
WARNING: Successfully resolved tag to sha256, but it is recommended to use sha256 directly.
Tag: [us.gcr.io/apache-beam-testing/java-postcommit-it/java:20230412155743]
- referencing digest: [us.gcr.io/apache-beam-testing/java-postcommit-it/java@sha256:4695159466e1b92094bf49b01573c960338d991606e937ba86f6d3a21cdd6776]

Deleted [[us.gcr.io/apache-beam-testing/java-postcommit-it/java:20230412155743] (referencing [us.gcr.io/apache-beam-testing/java-postcommit-it/java@sha256:4695159466e1b92094bf49b01573c960338d991606e937ba86f6d3a21cdd6776])].
Removing untagged image us.gcr.io/apache-beam-testing/java-postcommit-it/java@sha256:4695159466e1b92094bf49b01573c960338d991606e937ba86f6d3a21cdd6776
Digests:
- us.gcr.io/apache-beam-testing/java-postcommit-it/java@sha256:4695159466e1b92094bf49b01573c960338d991606e937ba86f6d3a21cdd6776
Deleted [us.gcr.io/apache-beam-testing/java-postcommit-it/java@sha256:4695159466e1b92094bf49b01573c960338d991606e937ba86f6d3a21cdd6776].

FAILURE: Build failed with an exception.

* What went wrong:
Execution failed for task ':runners:google-cloud-dataflow-java:googleCloudPlatformRunnerV2IntegrationTest'.
> There were failing tests. See the report at: file://<https://ci-beam.apache.org/job/beam_PostCommit_Java_DataflowV2/ws/src/runners/google-cloud-dataflow-java/build/reports/tests/googleCloudPlatformRunnerV2IntegrationTest/index.html>

* Try:
> Run with --stacktrace option to get the stack trace.
> Run with --info or --debug option to get more log output.

* Get more help at https://help.gradle.org

Deprecated Gradle features were used in this build, making it incompatible with Gradle 8.0.

You can use '--warning-mode all' to show the individual deprecation warnings and determine if they come from your own scripts or plugins.

See https://docs.gradle.org/7.5.1/userguide/command_line_interface.html#sec:command_line_warnings

Execution optimizations have been disabled for 1 invalid unit(s) of work during this build to ensure correctness.
Please consult deprecation warnings for more details.

BUILD FAILED in 3h 23m 52s
152 actionable tasks: 98 executed, 50 from cache, 4 up-to-date

Publishing build scan...
https://gradle.com/s/h63blqjcp72tq

Build step 'Invoke Gradle script' changed build result to FAILURE
Build step 'Invoke Gradle script' marked build as failure

---------------------------------------------------------------------
To unsubscribe, e-mail: builds-unsubscribe@beam.apache.org
For additional commands, e-mail: builds-help@beam.apache.org


Build failed in Jenkins: beam_PostCommit_Java_DataflowV2 #2911

Posted by Apache Jenkins Server <je...@builds.apache.org>.
See <https://ci-beam.apache.org/job/beam_PostCommit_Java_DataflowV2/2911/display/redirect>

Changes:


------------------------------------------
[...truncated 61.47 KB...]
Finished license_scripts.sh

> Task :sdks:java:container:goPrepare UP-TO-DATE
> Task :sdks:java:container:java8:copyJavaThirdPartyLicenses

> Task :release:go-licenses:java:dockerRun
+ go-licenses csv github.com/apache/beam/sdks/v2/java/container
+ tee /output/licenses/list.csv

> Task :sdks:java:container:goBuild
/home/jenkins/go/bin/go1.20.2 build -o ./build/target/linux_amd64/boot boot.go boot_test.go pathingjar.go pathingjar_test.go

> Task :sdks:java:container:java8:copySdkHarnessLauncher
Execution optimizations have been disabled for task ':sdks:java:container:java8:copySdkHarnessLauncher' to ensure correctness due to the following reasons:
  - Gradle detected a problem with the following location: '<https://ci-beam.apache.org/job/beam_PostCommit_Java_DataflowV2/ws/src/sdks/java/container/build/target'.> Reason: Task ':sdks:java:container:java8:copySdkHarnessLauncher' uses this output of task ':sdks:java:container:downloadCloudProfilerAgent' without declaring an explicit or implicit dependency. This can lead to incorrect results being produced, depending on what order the tasks are executed. Please refer to https://docs.gradle.org/7.5.1/userguide/validation_problems.html#implicit_dependency for more details about this problem.
  - Gradle detected a problem with the following location: '<https://ci-beam.apache.org/job/beam_PostCommit_Java_DataflowV2/ws/src/sdks/java/container/build/target'.> Reason: Task ':sdks:java:container:java8:copySdkHarnessLauncher' uses this output of task ':sdks:java:container:pullLicenses' without declaring an explicit or implicit dependency. This can lead to incorrect results being produced, depending on what order the tasks are executed. Please refer to https://docs.gradle.org/7.5.1/userguide/validation_problems.html#implicit_dependency for more details about this problem.

> Task :release:go-licenses:java:dockerRun
W0412 09:58:02.440709      84 library.go:101] "golang.org/x/sys/unix" contains non-Go code that can't be inspected for further dependencies:
/go/pkg/mod/golang.org/x/sys@v0.5.0/unix/asm_linux_amd64.s
github.com/apache/beam/sdks/v2/go/pkg/beam,https://github.com/apache/beam/blob/sdks/v2.46.0/sdks/go/README.md,Apache-2.0
github.com/apache/beam/sdks/v2/java/container,https://github.com/apache/beam/blob/sdks/v2.46.0/sdks/LICENSE,Apache-2.0
github.com/golang/protobuf,https://github.com/golang/protobuf/blob/v1.5.2/LICENSE,BSD-3-Clause
golang.org/x/net,https://cs.opensource.google/go/x/net/+/v0.5.0:LICENSE,BSD-3-Clause
golang.org/x/sys/unix,https://cs.opensource.google/go/x/sys/+/v0.5.0:LICENSE,BSD-3-Clause
golang.org/x/text,https://cs.opensource.google/go/x/text/+/v0.7.0:LICENSE,BSD-3-Clause
google.golang.org/genproto/googleapis/rpc/status,https://github.com/googleapis/go-genproto/blob/76db0878b65f/LICENSE,Apache-2.0
google.golang.org/grpc,https://github.com/grpc/grpc-go/blob/v1.52.3/LICENSE,Apache-2.0
google.golang.org/protobuf,https://github.com/protocolbuffers/protobuf-go/blob/v1.28.1/LICENSE,BSD-3-Clause
+ chmod -R a+w /output/licenses

> Task :release:go-licenses:java:createLicenses
> Task :sdks:java:container:java8:copyGolangLicenses
> Task :sdks:java:container:java8:dockerPrepare

> Task :sdks:java:container:java8:docker
#1 [internal] load build definition from Dockerfile
#1 transferring dockerfile: 2.58kB done
#1 DONE 0.0s

#2 [internal] load .dockerignore
#2 transferring context: 2B done
#2 DONE 0.0s

#3 [internal] load metadata for docker.io/library/eclipse-temurin:8
#3 DONE 0.3s

#4 [ 1/16] FROM docker.io/library/eclipse-temurin:8@sha256:005d3189b2ec1612c3ade6eadabd1935c312f03aa7905cf0528e9d71980ad512
#4 resolve docker.io/library/eclipse-temurin:8@sha256:005d3189b2ec1612c3ade6eadabd1935c312f03aa7905cf0528e9d71980ad512 0.0s done
#4 CACHED

#5 [internal] load build context
#5 transferring context: 46.89MB 0.4s done
#5 DONE 0.4s

#6 [ 2/16] ADD target/slf4j-api.jar /opt/apache/beam/jars/
#6 DONE 2.3s

#7 [ 3/16] ADD target/slf4j-jdk14.jar /opt/apache/beam/jars/
#7 DONE 0.2s

#8 [ 4/16] ADD target/jcl-over-slf4j.jar /opt/apache/beam/jars/
#8 DONE 0.1s

#9 [ 5/16] ADD target/log4j-over-slf4j.jar /opt/apache/beam/jars/
#9 DONE 0.1s

#10 [ 6/16] ADD target/log4j-to-slf4j.jar /opt/apache/beam/jars/
#10 DONE 0.1s

#11 [ 7/16] ADD target/beam-sdks-java-harness.jar /opt/apache/beam/jars/
#11 DONE 0.1s

#12 [ 8/16] COPY target/jamm.jar target/open-module-agent*.jar /opt/apache/beam/jars/
#12 DONE 0.1s

#13 [ 9/16] COPY target/linux_amd64/boot /opt/apache/beam/
#13 DONE 0.2s

#14 [10/16] COPY target/LICENSE /opt/apache/beam/
#14 DONE 0.1s

#15 [11/16] COPY target/NOTICE /opt/apache/beam/
#15 DONE 0.1s

#16 [12/16] ADD target/third_party_licenses /opt/apache/beam/third_party_licenses/
#16 DONE 0.3s

#17 [13/16] COPY target/LICENSE target/options/* /opt/apache/beam/options/
#17 DONE 0.1s

#18 [14/16] COPY target/go-licenses/* /opt/apache/beam/third_party_licenses/golang/
#18 DONE 0.1s

#19 [15/16] RUN if [ "true" = "false" ] ; then     rm -rf /opt/apache/beam/third_party_licenses ;    fi
#19 DONE 0.3s

#20 [16/16] COPY target/profiler/* /opt/google_cloud_profiler/
#20 DONE 0.1s

#21 exporting to image
#21 exporting layers
#21 exporting layers 0.2s done
#21 writing image sha256:595d557ab45b6a518e846cd72c0a3ef0c788e21b00681a3a4d6213eb5e5934de done
#21 naming to docker.io/apache/beam_java8_sdk:2.48.0.dev done
#21 DONE 0.2s

> Task :runners:google-cloud-dataflow-java:buildAndPushDockerJavaContainer
WARNING: `gcloud docker` will not be supported for Docker client versions above 18.03.

As an alternative, use `gcloud auth configure-docker` to configure `docker` to
use `gcloud` as a credential helper, then use `docker` as you would for non-GCR
registries, e.g. `docker pull gcr.io/project-id/my-image`. Add
`--verbosity=error` to silence this warning: `gcloud docker
--verbosity=error -- pull gcr.io/project-id/my-image`.

See: https://cloud.google.com/container-registry/docs/support/deprecation-notices#gcloud-docker

The push refers to repository [us.gcr.io/apache-beam-testing/java-postcommit-it/java]
c961991bab35: Preparing
5f70bf18a086: Preparing
f44ffe526170: Preparing
38da482fdb88: Preparing
203958e6292f: Preparing
f597082ffe54: Preparing
769241135ec0: Preparing
46146030e1b4: Preparing
032081a932ac: Preparing
a40cc4b9d16b: Preparing
819637b1ee80: Preparing
99fc4dd62824: Preparing
6c58149890f2: Preparing
eaefecf8fa42: Preparing
68422e0d1d2d: Preparing
533af4d05d89: Preparing
d09fdd9ad3ef: Preparing
769241135ec0: Waiting
04d1dcab20cb: Preparing
46146030e1b4: Waiting
b93c1bd012ab: Preparing
819637b1ee80: Waiting
99fc4dd62824: Waiting
533af4d05d89: Waiting
032081a932ac: Waiting
d09fdd9ad3ef: Waiting
6c58149890f2: Waiting
a40cc4b9d16b: Waiting
04d1dcab20cb: Waiting
eaefecf8fa42: Waiting
68422e0d1d2d: Waiting
b93c1bd012ab: Waiting
5f70bf18a086: Layer already exists
38da482fdb88: Pushed
f597082ffe54: Pushed
f44ffe526170: Pushed
c961991bab35: Pushed
203958e6292f: Pushed
769241135ec0: Pushed
032081a932ac: Pushed
819637b1ee80: Pushed
46146030e1b4: Pushed
a40cc4b9d16b: Pushed
533af4d05d89: Layer already exists
d09fdd9ad3ef: Layer already exists
04d1dcab20cb: Layer already exists
b93c1bd012ab: Layer already exists
99fc4dd62824: Pushed
6c58149890f2: Pushed
eaefecf8fa42: Pushed
68422e0d1d2d: Pushed
20230412095740: digest: sha256:e68d7feac964a5172dff24a7135dc3f392cd4b79c252a8836ebd1b64f11e507d size: 4296

> Task :runners:google-cloud-dataflow-java:coreSDKJavaRunnerV2IntegrationTest NO-SOURCE
> Task :runners:google-cloud-dataflow-java:examplesJavaRunnerV2IntegrationTest

***********************************************************
***********************************************************
**********************Set Up Pubsub************************
The Pub/Sub topic has been set up for this example: projects/apache-beam-testing/topics/testpipeline-jenkins-0412095832-b5eaf291
The Pub/Sub subscription has been set up for this example: projects/apache-beam-testing/subscriptions/testpipeline-jenkins-0412095832-b5eaf291
*************************Tear Down*************************
The Pub/Sub topic has been deleted: projects/apache-beam-testing/topics/testpipeline-jenkins-0412095832-b5eaf291
The Pub/Sub subscription has been deleted: projects/apache-beam-testing/subscriptions/testpipeline-jenkins-0412095832-b5eaf291
***********************************************************
***********************************************************

***********************************************************
***********************************************************
**********************Set Up Pubsub************************
The Pub/Sub topic has been set up for this example: projects/apache-beam-testing/topics/testpipeline-jenkins-0412095832-ac3630eb
The Pub/Sub subscription has been set up for this example: projects/apache-beam-testing/subscriptions/testpipeline-jenkins-0412095832-ac3630eb
*************************Tear Down*************************
The Pub/Sub topic has been deleted: projects/apache-beam-testing/topics/testpipeline-jenkins-0412095832-ac3630eb
The Pub/Sub subscription has been deleted: projects/apache-beam-testing/subscriptions/testpipeline-jenkins-0412095832-ac3630eb
***********************************************************
***********************************************************

> Task :runners:google-cloud-dataflow-java:googleCloudPlatformRunnerV2IntegrationTest

org.apache.beam.sdk.io.gcp.spanner.SpannerReadIT > testReadWithDataBoost FAILED
    java.lang.RuntimeException at SpannerReadIT.java:214

87 tests completed, 1 failed, 2 skipped

> Task :runners:google-cloud-dataflow-java:googleCloudPlatformRunnerV2IntegrationTest FAILED

> Task :runners:google-cloud-dataflow-java:cleanUpDockerJavaImages
Untagged: us.gcr.io/apache-beam-testing/java-postcommit-it/java:20230412095740
Untagged: us.gcr.io/apache-beam-testing/java-postcommit-it/java@sha256:e68d7feac964a5172dff24a7135dc3f392cd4b79c252a8836ebd1b64f11e507d
Deleted: sha256:595d557ab45b6a518e846cd72c0a3ef0c788e21b00681a3a4d6213eb5e5934de
WARNING: Successfully resolved tag to sha256, but it is recommended to use sha256 directly.
Tag: [us.gcr.io/apache-beam-testing/java-postcommit-it/java:20230412095740]
- referencing digest: [us.gcr.io/apache-beam-testing/java-postcommit-it/java@sha256:e68d7feac964a5172dff24a7135dc3f392cd4b79c252a8836ebd1b64f11e507d]

Deleted [[us.gcr.io/apache-beam-testing/java-postcommit-it/java:20230412095740] (referencing [us.gcr.io/apache-beam-testing/java-postcommit-it/java@sha256:e68d7feac964a5172dff24a7135dc3f392cd4b79c252a8836ebd1b64f11e507d])].
Removing untagged image us.gcr.io/apache-beam-testing/java-postcommit-it/java@sha256:e68d7feac964a5172dff24a7135dc3f392cd4b79c252a8836ebd1b64f11e507d
Digests:
- us.gcr.io/apache-beam-testing/java-postcommit-it/java@sha256:e68d7feac964a5172dff24a7135dc3f392cd4b79c252a8836ebd1b64f11e507d
Deleted [us.gcr.io/apache-beam-testing/java-postcommit-it/java@sha256:e68d7feac964a5172dff24a7135dc3f392cd4b79c252a8836ebd1b64f11e507d].

FAILURE: Build failed with an exception.

* What went wrong:
Execution failed for task ':runners:google-cloud-dataflow-java:googleCloudPlatformRunnerV2IntegrationTest'.
> There were failing tests. See the report at: file://<https://ci-beam.apache.org/job/beam_PostCommit_Java_DataflowV2/ws/src/runners/google-cloud-dataflow-java/build/reports/tests/googleCloudPlatformRunnerV2IntegrationTest/index.html>

* Try:
> Run with --stacktrace option to get the stack trace.
> Run with --info or --debug option to get more log output.

* Get more help at https://help.gradle.org

Deprecated Gradle features were used in this build, making it incompatible with Gradle 8.0.

You can use '--warning-mode all' to show the individual deprecation warnings and determine if they come from your own scripts or plugins.

See https://docs.gradle.org/7.5.1/userguide/command_line_interface.html#sec:command_line_warnings

Execution optimizations have been disabled for 1 invalid unit(s) of work during this build to ensure correctness.
Please consult deprecation warnings for more details.

BUILD FAILED in 3h 14m 24s
152 actionable tasks: 98 executed, 50 from cache, 4 up-to-date

Publishing build scan...
https://gradle.com/s/e5mvrvyebipnq

Build step 'Invoke Gradle script' changed build result to FAILURE
Build step 'Invoke Gradle script' marked build as failure

---------------------------------------------------------------------
To unsubscribe, e-mail: builds-unsubscribe@beam.apache.org
For additional commands, e-mail: builds-help@beam.apache.org