You are viewing a plain text version of this content. The canonical link for it is here.
Posted to notifications@qpid.apache.org by Apache Jenkins Server <je...@builds.apache.org> on 2017/11/28 10:58:08 UTC
Build failed in Jenkins: Qpid-cpp-JMS-AMQP-0-x-Test #4294
See <https://builds.apache.org/job/Qpid-cpp-JMS-AMQP-0-x-Test/4294/display/redirect?page=changes>
Changes:
[orudyy] QPID-6933: [System Tests] Fix failing test
------------------------------------------
[...truncated 611.61 KB...]
Tests run: 2, Failures: 0, Errors: 0, Skipped: 0, Time elapsed: 5.893 sec - in org.apache.qpid.server.AbruptClientDisconnectTest
Running org.apache.qpid.server.persistent.NoLocalAfterRecoveryTest
Tests run: 2, Failures: 0, Errors: 0, Skipped: 0, Time elapsed: 0.001 sec - in org.apache.qpid.server.persistent.NoLocalAfterRecoveryTest
Running org.apache.qpid.server.store.PersistentStoreTest
Tests run: 5, Failures: 0, Errors: 0, Skipped: 0, Time elapsed: 0.004 sec - in org.apache.qpid.server.store.PersistentStoreTest
Running org.apache.qpid.server.store.SplitStoreTest
Tests run: 2, Failures: 0, Errors: 0, Skipped: 0, Time elapsed: 0.001 sec - in org.apache.qpid.server.store.SplitStoreTest
Running org.apache.qpid.server.queue.QueueDepthWithSelectorTest
Tests run: 1, Failures: 1, Errors: 0, Skipped: 0, Time elapsed: 0.171 sec <<< FAILURE! - in org.apache.qpid.server.queue.QueueDepthWithSelectorTest
test(org.apache.qpid.server.queue.QueueDepthWithSelectorTest) Time elapsed: 0.171 sec <<< FAILURE!
junit.framework.AssertionFailedError: Error creating producer
at org.apache.qpid.server.queue.QueueDepthWithSelectorTest.verifyBrokerState(QueueDepthWithSelectorTest.java:129)
at org.apache.qpid.server.queue.QueueDepthWithSelectorTest.test(QueueDepthWithSelectorTest.java:101)
Running org.apache.qpid.server.queue.ConsumerPriorityTest
Tests run: 0, Failures: 0, Errors: 0, Skipped: 0, Time elapsed: 0.003 sec - in org.apache.qpid.server.queue.ConsumerPriorityTest
Running org.apache.qpid.server.queue.MultipleTransactedBatchProducerTest
Tests run: 1, Failures: 0, Errors: 0, Skipped: 0, Time elapsed: 5.725 sec - in org.apache.qpid.server.queue.MultipleTransactedBatchProducerTest
Running org.apache.qpid.server.queue.LastValueQueueTest
Tests run: 7, Failures: 0, Errors: 1, Skipped: 0, Time elapsed: 13.612 sec <<< FAILURE! - in org.apache.qpid.server.queue.LastValueQueueTest
testConflatedQueueDepth(org.apache.qpid.server.queue.LastValueQueueTest) Time elapsed: 0.476 sec <<< ERROR!
javax.jms.JMSException: Error creating producer
at org.apache.qpid.server.queue.LastValueQueueTest.testConflatedQueueDepth(LastValueQueueTest.java:260)
Caused by: org.apache.qpid.QpidException: The name '$management' supplied in the address doesn't resolve to an exchange or a queue
at org.apache.qpid.server.queue.LastValueQueueTest.testConflatedQueueDepth(LastValueQueueTest.java:260)
Running org.apache.qpid.server.queue.PriorityQueueTest
Tests run: 3, Failures: 0, Errors: 0, Skipped: 0, Time elapsed: 1.321 sec - in org.apache.qpid.server.queue.PriorityQueueTest
Running org.apache.qpid.server.queue.ProducerFlowControlTest
Tests run: 7, Failures: 0, Errors: 0, Skipped: 0, Time elapsed: 0.005 sec - in org.apache.qpid.server.queue.ProducerFlowControlTest
Running org.apache.qpid.server.queue.LiveQueueOperationsTest
Tests run: 1, Failures: 0, Errors: 0, Skipped: 0, Time elapsed: 0.001 sec - in org.apache.qpid.server.queue.LiveQueueOperationsTest
Running org.apache.qpid.server.queue.SortedQueueTest
Tests run: 8, Failures: 0, Errors: 0, Skipped: 0, Time elapsed: 0.009 sec - in org.apache.qpid.server.queue.SortedQueueTest
Running org.apache.qpid.server.queue.MessageGroupQueueTest
Tests run: 11, Failures: 0, Errors: 0, Skipped: 0, Time elapsed: 6.319 sec - in org.apache.qpid.server.queue.MessageGroupQueueTest
Running org.apache.qpid.server.queue.EnsureNondestructiveConsumersTest
Tests run: 1, Failures: 0, Errors: 0, Skipped: 0, Time elapsed: 0.001 sec - in org.apache.qpid.server.queue.EnsureNondestructiveConsumersTest
Running org.apache.qpid.server.queue.QueueMessageDurabilityTest
Tests run: 4, Failures: 0, Errors: 0, Skipped: 0, Time elapsed: 0.002 sec - in org.apache.qpid.server.queue.QueueMessageDurabilityTest
Running org.apache.qpid.server.queue.ArrivalTimeFilterTest
Tests run: 2, Failures: 0, Errors: 0, Skipped: 0, Time elapsed: 0.001 sec - in org.apache.qpid.server.queue.ArrivalTimeFilterTest
Running org.apache.qpid.server.queue.ModelTest
Tests run: 4, Failures: 0, Errors: 0, Skipped: 0, Time elapsed: 0.002 sec - in org.apache.qpid.server.queue.ModelTest
Running org.apache.qpid.server.queue.FlowToDiskTest
Tests run: 1, Failures: 0, Errors: 0, Skipped: 0, Time elapsed: 0.001 sec - in org.apache.qpid.server.queue.FlowToDiskTest
Running org.apache.qpid.server.queue.TimeToLiveTest
Tests run: 5, Failures: 0, Errors: 0, Skipped: 0, Time elapsed: 2.201 sec - in org.apache.qpid.server.queue.TimeToLiveTest
Running org.apache.qpid.server.queue.NodeAutoCreationPolicyTest
Tests run: 9, Failures: 0, Errors: 0, Skipped: 0, Time elapsed: 0.011 sec - in org.apache.qpid.server.queue.NodeAutoCreationPolicyTest
Running org.apache.qpid.server.queue.QueueBindTest
Tests run: 2, Failures: 0, Errors: 0, Skipped: 0, Time elapsed: 0.108 sec - in org.apache.qpid.server.queue.QueueBindTest
Running org.apache.qpid.server.queue.DefaultFiltersTest
Tests run: 2, Failures: 0, Errors: 0, Skipped: 0, Time elapsed: 0.001 sec - in org.apache.qpid.server.queue.DefaultFiltersTest
Running org.apache.qpid.server.stats.StatisticsReportingTest
Tests run: 3, Failures: 0, Errors: 0, Skipped: 0, Time elapsed: 0.002 sec - in org.apache.qpid.server.stats.StatisticsReportingTest
Running org.apache.qpid.server.routing.AlternateBindingRoutingTest
Tests run: 1, Failures: 0, Errors: 0, Skipped: 0, Time elapsed: 0 sec - in org.apache.qpid.server.routing.AlternateBindingRoutingTest
Running org.apache.qpid.server.routing.ExchangeRoutingTest
Tests run: 3, Failures: 0, Errors: 0, Skipped: 0, Time elapsed: 0.001 sec - in org.apache.qpid.server.routing.ExchangeRoutingTest
Running org.apache.qpid.server.message.MessageProtocolConversionTest
Tests run: 2, Failures: 0, Errors: 0, Skipped: 0, Time elapsed: 0.001 sec - in org.apache.qpid.server.message.MessageProtocolConversionTest
Running org.apache.qpid.server.exchange.ReturnUnroutableMandatoryMessageTest
Tests run: 3, Failures: 0, Errors: 0, Skipped: 0, Time elapsed: 0.002 sec - in org.apache.qpid.server.exchange.ReturnUnroutableMandatoryMessageTest
Running org.apache.qpid.server.SupportedProtocolVersionsTest
Tests run: 4, Failures: 0, Errors: 0, Skipped: 0, Time elapsed: 0.003 sec - in org.apache.qpid.server.SupportedProtocolVersionsTest
Running org.apache.qpid.server.failover.FailoverMethodTest
Tests run: 3, Failures: 0, Errors: 0, Skipped: 0, Time elapsed: 0.001 sec - in org.apache.qpid.server.failover.FailoverMethodTest
Running org.apache.qpid.server.BrokerStartupTest
Tests run: 2, Failures: 0, Errors: 0, Skipped: 0, Time elapsed: 0.001 sec - in org.apache.qpid.server.BrokerStartupTest
Running org.apache.qpid.util.LogMonitorTest
Tests run: 8, Failures: 0, Errors: 0, Skipped: 0, Time elapsed: 2.021 sec - in org.apache.qpid.util.LogMonitorTest
Running org.apache.qpid.transport.ProtocolNegotiationTest
Tests run: 5, Failures: 0, Errors: 0, Skipped: 0, Time elapsed: 0.24 sec - in org.apache.qpid.transport.ProtocolNegotiationTest
Running org.apache.qpid.client.HeartbeatTest
Tests run: 8, Failures: 0, Errors: 0, Skipped: 0, Time elapsed: 14.405 sec - in org.apache.qpid.client.HeartbeatTest
Running org.apache.qpid.client.prefetch.PrefetchBehaviourTest
Tests run: 4, Failures: 0, Errors: 0, Skipped: 0, Time elapsed: 5.259 sec - in org.apache.qpid.client.prefetch.PrefetchBehaviourTest
Running org.apache.qpid.client.redelivered.RedeliveredMessageTest
Tests run: 1, Failures: 0, Errors: 0, Skipped: 0, Time elapsed: 0.116 sec - in org.apache.qpid.client.redelivered.RedeliveredMessageTest
Running org.apache.qpid.client.ssl.SSLTest
Tests run: 17, Failures: 0, Errors: 0, Skipped: 0, Time elapsed: 0.024 sec - in org.apache.qpid.client.ssl.SSLTest
Running org.apache.qpid.client.AsynchMessageListenerTest
Tests run: 9, Failures: 0, Errors: 0, Skipped: 0, Time elapsed: 1.252 sec - in org.apache.qpid.client.AsynchMessageListenerTest
Running org.apache.qpid.client.SynchReceiveTest
Tests run: 4, Failures: 0, Errors: 0, Skipped: 0, Time elapsed: 1.195 sec - in org.apache.qpid.client.SynchReceiveTest
Running org.apache.qpid.client.SyncPublishTest
Tests run: 1, Failures: 0, Errors: 0, Skipped: 0, Time elapsed: 0.001 sec - in org.apache.qpid.client.SyncPublishTest
Running org.apache.qpid.client.message.AMQPEncodedMapMessageTest
Tests run: 6, Failures: 0, Errors: 0, Skipped: 0, Time elapsed: 0.405 sec - in org.apache.qpid.client.message.AMQPEncodedMapMessageTest
Running org.apache.qpid.client.message.ObjectMessageClassWhitelistingTest
Tests run: 9, Failures: 0, Errors: 0, Skipped: 0, Time elapsed: 0.622 sec - in org.apache.qpid.client.message.ObjectMessageClassWhitelistingTest
Running org.apache.qpid.client.connection.ExistingSocketTest
Tests run: 2, Failures: 0, Errors: 0, Skipped: 0, Time elapsed: 0.214 sec - in org.apache.qpid.client.connection.ExistingSocketTest
Running org.apache.qpid.client.failover.FailoverBehaviourTest
Tests run: 37, Failures: 0, Errors: 0, Skipped: 0, Time elapsed: 46.118 sec - in org.apache.qpid.client.failover.FailoverBehaviourTest
Running org.apache.qpid.client.failover.AddressBasedFailoverBehaviourTest
Tests run: 37, Failures: 0, Errors: 0, Skipped: 0, Time elapsed: 45.751 sec - in org.apache.qpid.client.failover.AddressBasedFailoverBehaviourTest
Running org.apache.qpid.client.failover.MultipleBrokersFailoverTest
Tests run: 2, Failures: 0, Errors: 0, Skipped: 0, Time elapsed: 0.001 sec - in org.apache.qpid.client.failover.MultipleBrokersFailoverTest
Running org.apache.qpid.client.session.QueueDeclareTest
Tests run: 3, Failures: 0, Errors: 0, Skipped: 0, Time elapsed: 0.376 sec - in org.apache.qpid.client.session.QueueDeclareTest
Running org.apache.qpid.client.session.QueueDeleteTest
Tests run: 2, Failures: 0, Errors: 0, Skipped: 0, Time elapsed: 0.135 sec - in org.apache.qpid.client.session.QueueDeleteTest
Running org.apache.qpid.client.session.ExchangeDeleteTest
Tests run: 2, Failures: 0, Errors: 0, Skipped: 0, Time elapsed: 0.118 sec - in org.apache.qpid.client.session.ExchangeDeleteTest
Running org.apache.qpid.client.TemporaryQueuePrefixTest
Tests run: 4, Failures: 0, Errors: 0, Skipped: 0, Time elapsed: 0.001 sec - in org.apache.qpid.client.TemporaryQueuePrefixTest
Running org.apache.qpid.client.SessionCreateTest
Tests run: 1, Failures: 0, Errors: 0, Skipped: 0, Time elapsed: 65.285 sec - in org.apache.qpid.client.SessionCreateTest
Running org.apache.qpid.systest.keystore.FileKeyStoreTest
Tests run: 4, Failures: 0, Errors: 0, Skipped: 0, Time elapsed: 2.406 sec - in org.apache.qpid.systest.keystore.FileKeyStoreTest
Running org.apache.qpid.systest.MessageRoutingTest
Tests run: 7, Failures: 0, Errors: 0, Skipped: 0, Time elapsed: 0.004 sec - in org.apache.qpid.systest.MessageRoutingTest
Running org.apache.qpid.systest.MessageCompressionTest
Tests run: 10, Failures: 0, Errors: 0, Skipped: 0, Time elapsed: 0.007 sec - in org.apache.qpid.systest.MessageCompressionTest
Running org.apache.qpid.systest.prefetch.ZeroPrefetchTest
Tests run: 1, Failures: 0, Errors: 0, Skipped: 0, Time elapsed: 0.065 sec - in org.apache.qpid.systest.prefetch.ZeroPrefetchTest
Running org.apache.qpid.systest.management.amqp.AmqpManagementTest
Tests run: 18, Failures: 0, Errors: 0, Skipped: 0, Time elapsed: 0.01 sec - in org.apache.qpid.systest.management.amqp.AmqpManagementTest
Running org.apache.qpid.systest.AnonymousProducerTest
Tests run: 4, Failures: 0, Errors: 0, Skipped: 0, Time elapsed: 0.091 sec - in org.apache.qpid.systest.AnonymousProducerTest
Running org.apache.qpid.systest.rest.GroupProviderRestTest
Tests run: 10, Failures: 0, Errors: 0, Skipped: 0, Time elapsed: 0.005 sec - in org.apache.qpid.systest.rest.GroupProviderRestTest
Running org.apache.qpid.systest.rest.UserPreferencesRestTest
Tests run: 9, Failures: 0, Errors: 0, Skipped: 0, Time elapsed: 0.005 sec - in org.apache.qpid.systest.rest.UserPreferencesRestTest
Running org.apache.qpid.systest.rest.AnonymousAccessRestTest
Tests run: 4, Failures: 0, Errors: 0, Skipped: 0, Time elapsed: 0.001 sec - in org.apache.qpid.systest.rest.AnonymousAccessRestTest
Running org.apache.qpid.systest.rest.PublishMessageRestTest
Tests run: 6, Failures: 0, Errors: 0, Skipped: 0, Time elapsed: 0.003 sec - in org.apache.qpid.systest.rest.PublishMessageRestTest
Running org.apache.qpid.systest.rest.PreemtiveAuthRestTest
Tests run: 8, Failures: 0, Errors: 0, Skipped: 0, Time elapsed: 0.004 sec - in org.apache.qpid.systest.rest.PreemtiveAuthRestTest
Running org.apache.qpid.systest.rest.AccessControlProviderRestTest
Tests run: 4, Failures: 0, Errors: 0, Skipped: 0, Time elapsed: 0.002 sec - in org.apache.qpid.systest.rest.AccessControlProviderRestTest
Running org.apache.qpid.systest.rest.BrokerRestHttpsTest
Tests run: 1, Failures: 0, Errors: 0, Skipped: 0, Time elapsed: 0.001 sec - in org.apache.qpid.systest.rest.BrokerRestHttpsTest
Running org.apache.qpid.systest.rest.SaslRestTest
Tests run: 14, Failures: 0, Errors: 0, Skipped: 0, Time elapsed: 0.008 sec - in org.apache.qpid.systest.rest.SaslRestTest
Running org.apache.qpid.systest.rest.VirtualHostRestTest
Tests run: 28, Failures: 0, Errors: 0, Skipped: 0, Time elapsed: 0.014 sec - in org.apache.qpid.systest.rest.VirtualHostRestTest
Running org.apache.qpid.systest.rest.BrokerRestTest
Tests run: 6, Failures: 0, Errors: 0, Skipped: 0, Time elapsed: 0.002 sec - in org.apache.qpid.systest.rest.BrokerRestTest
Running org.apache.qpid.systest.rest.StructureRestTest
Tests run: 1, Failures: 0, Errors: 0, Skipped: 0, Time elapsed: 0 sec - in org.apache.qpid.systest.rest.StructureRestTest
Running org.apache.qpid.systest.rest.KeyStoreRestTest
Tests run: 5, Failures: 0, Errors: 0, Skipped: 0, Time elapsed: 0.002 sec - in org.apache.qpid.systest.rest.KeyStoreRestTest
Running org.apache.qpid.systest.rest.SessionRestTest
Tests run: 4, Failures: 0, Errors: 0, Skipped: 0, Time elapsed: 0.001 sec - in org.apache.qpid.systest.rest.SessionRestTest
Running org.apache.qpid.systest.rest.ConnectionRestTest
Tests run: 6, Failures: 0, Errors: 0, Skipped: 0, Time elapsed: 0.003 sec - in org.apache.qpid.systest.rest.ConnectionRestTest
Running org.apache.qpid.systest.rest.CompressedResponsesRestTest
Tests run: 4, Failures: 0, Errors: 0, Skipped: 0, Time elapsed: 0.002 sec - in org.apache.qpid.systest.rest.CompressedResponsesRestTest
Running org.apache.qpid.systest.rest.VirtualHostNodeRestTest
Tests run: 9, Failures: 0, Errors: 0, Skipped: 0, Time elapsed: 0.005 sec - in org.apache.qpid.systest.rest.VirtualHostNodeRestTest
Running org.apache.qpid.systest.rest.UserRestTest
Tests run: 7, Failures: 0, Errors: 0, Skipped: 0, Time elapsed: 0.003 sec - in org.apache.qpid.systest.rest.UserRestTest
Running org.apache.qpid.systest.rest.PortRestTest
Tests run: 12, Failures: 0, Errors: 0, Skipped: 0, Time elapsed: 0.052 sec - in org.apache.qpid.systest.rest.PortRestTest
Running org.apache.qpid.systest.rest.BrokerRestHttpsClientCertAuthTest
Tests run: 1, Failures: 0, Errors: 0, Skipped: 0, Time elapsed: 0.001 sec - in org.apache.qpid.systest.rest.BrokerRestHttpsClientCertAuthTest
Running org.apache.qpid.systest.rest.MessagesRestTest
Tests run: 14, Failures: 0, Errors: 0, Skipped: 0, Time elapsed: 0.009 sec - in org.apache.qpid.systest.rest.MessagesRestTest
Running org.apache.qpid.systest.rest.QueueRestTest
Tests run: 8, Failures: 0, Errors: 0, Skipped: 0, Time elapsed: 0.006 sec - in org.apache.qpid.systest.rest.QueueRestTest
Running org.apache.qpid.systest.rest.TrustStoreRestTest
Tests run: 5, Failures: 0, Errors: 0, Skipped: 0, Time elapsed: 0.004 sec - in org.apache.qpid.systest.rest.TrustStoreRestTest
Running org.apache.qpid.systest.rest.ExportImportMessagesRestTest
Tests run: 1, Failures: 0, Errors: 0, Skipped: 0, Time elapsed: 0 sec - in org.apache.qpid.systest.rest.ExportImportMessagesRestTest
Running org.apache.qpid.systest.rest.QueryRestTest
Tests run: 4, Failures: 0, Errors: 0, Skipped: 0, Time elapsed: 0.002 sec - in org.apache.qpid.systest.rest.QueryRestTest
Running org.apache.qpid.systest.rest.acl.BrokerACLTest
Tests run: 45, Failures: 0, Errors: 0, Skipped: 0, Time elapsed: 0.031 sec - in org.apache.qpid.systest.rest.acl.BrokerACLTest
Running org.apache.qpid.systest.rest.acl.ExchangeRestACLTest
Tests run: 9, Failures: 0, Errors: 0, Skipped: 0, Time elapsed: 0.004 sec - in org.apache.qpid.systest.rest.acl.ExchangeRestACLTest
Running org.apache.qpid.systest.rest.acl.VirtualHostNodeACLTest
Tests run: 3, Failures: 0, Errors: 0, Skipped: 0, Time elapsed: 0.001 sec - in org.apache.qpid.systest.rest.acl.VirtualHostNodeACLTest
Running org.apache.qpid.systest.rest.acl.UserRestACLTest
Tests run: 3, Failures: 0, Errors: 0, Skipped: 0, Time elapsed: 0.001 sec - in org.apache.qpid.systest.rest.acl.UserRestACLTest
Running org.apache.qpid.systest.rest.acl.VirtualHostACLTest
Tests run: 6, Failures: 0, Errors: 0, Skipped: 0, Time elapsed: 0.002 sec - in org.apache.qpid.systest.rest.acl.VirtualHostACLTest
Running org.apache.qpid.systest.rest.acl.GroupRestACLTest
Tests run: 4, Failures: 0, Errors: 0, Skipped: 0, Time elapsed: 0.001 sec - in org.apache.qpid.systest.rest.acl.GroupRestACLTest
Running org.apache.qpid.systest.rest.acl.VirtualHostAccessControlProviderRestTest
Tests run: 7, Failures: 0, Errors: 0, Skipped: 0, Time elapsed: 0.003 sec - in org.apache.qpid.systest.rest.acl.VirtualHostAccessControlProviderRestTest
Running org.apache.qpid.systest.rest.acl.QueueRestACLTest
Tests run: 7, Failures: 0, Errors: 0, Skipped: 0, Time elapsed: 0.003 sec - in org.apache.qpid.systest.rest.acl.QueueRestACLTest
Running org.apache.qpid.systest.rest.ExchangeRestTest
Tests run: 4, Failures: 0, Errors: 0, Skipped: 0, Time elapsed: 0.009 sec - in org.apache.qpid.systest.rest.ExchangeRestTest
Running org.apache.qpid.systest.rest.HttpManagementRestTest
Tests run: 3, Failures: 0, Errors: 0, Skipped: 0, Time elapsed: 0.001 sec - in org.apache.qpid.systest.rest.HttpManagementRestTest
Running org.apache.qpid.systest.rest.GroupRestTest
Tests run: 5, Failures: 0, Errors: 0, Skipped: 0, Time elapsed: 0.002 sec - in org.apache.qpid.systest.rest.GroupRestTest
Running org.apache.qpid.systest.rest.AuthenticationProviderRestTest
Tests run: 9, Failures: 0, Errors: 0, Skipped: 0, Time elapsed: 0.005 sec - in org.apache.qpid.systest.rest.AuthenticationProviderRestTest
Running org.apache.qpid.systest.rest.BrokerRestHttpAndHttpsTest
Tests run: 4, Failures: 0, Errors: 0, Skipped: 0, Time elapsed: 0.002 sec - in org.apache.qpid.systest.rest.BrokerRestHttpAndHttpsTest
Running org.apache.qpid.systest.rest.VirtualHostLoggerRestTest
Tests run: 2, Failures: 0, Errors: 0, Skipped: 0, Time elapsed: 0 sec - in org.apache.qpid.systest.rest.VirtualHostLoggerRestTest
Running org.apache.qpid.systest.messageencryption.MessageEncryptionTest
Tests run: 8, Failures: 0, Errors: 0, Skipped: 0, Time elapsed: 0.146 sec - in org.apache.qpid.systest.messageencryption.MessageEncryptionTest
Results :
Failed tests:
QueueDepthWithSelectorTest>QpidTestCase.run:165->QpidBrokerTestCase.runBare:95->QpidTestCase.runTest:181->test:101->verifyBrokerState:129 Error creating producer
Tests in error:
LastValueQueueTest>QpidTestCase.run:165->QpidBrokerTestCase.runBare:95->QpidTestCase.runTest:181->testConflatedQueueDepth:260->QpidBrokerTestCase.getQueueDepth:387 » JMS
Acknowledge2ConsumersTest>QpidTestCase.run:165->QpidBrokerTestCase.runBare:95->QpidTestCase.runTest:181->test2ConsumersAutoAck:130->test2ConsumersAcking:106->QpidBrokerTestCase.getQueueDepth:387 » JMS
Acknowledge2ConsumersTest>QpidTestCase.run:165->QpidBrokerTestCase.runBare:95->QpidTestCase.runTest:181->test2ConsumersClientAck:135->test2ConsumersAcking:106->QpidBrokerTestCase.getQueueDepth:387 » JMS
Acknowledge2ConsumersTest>QpidTestCase.run:165->QpidBrokerTestCase.runBare:95->QpidTestCase.runTest:181->test2ConsumersTx:140->test2ConsumersAcking:106->QpidBrokerTestCase.getQueueDepth:387 » JMS
AcknowledgeOnMessageTest>QpidTestCase.run:165->QpidBrokerTestCase.runBare:95->QpidTestCase.runTest:181->AcknowledgeTest.testAutoAck:159->testAcking:91->init:65->AcknowledgeTest.init:75->QpidBrokerTestCase.getQueueDepth:387 » JMS
AcknowledgeOnMessageTest>QpidTestCase.run:165->QpidBrokerTestCase.runBare:95->QpidTestCase.runTest:181->AcknowledgeTest.testClientAck:154->testAcking:91->init:65->AcknowledgeTest.init:75->QpidBrokerTestCase.getQueueDepth:387 » JMS
AcknowledgeOnMessageTest>QpidTestCase.run:165->QpidBrokerTestCase.runBare:95->QpidTestCase.runTest:181->AcknowledgeTest.testDupsOk:169->testAcking:91->init:65->AcknowledgeTest.init:75->QpidBrokerTestCase.getQueueDepth:387 » JMS
AcknowledgeOnMessageTest>QpidTestCase.run:165->QpidBrokerTestCase.runBare:95->QpidTestCase.runTest:181->AcknowledgeTest.testNoAck:174->testAcking:91->init:65->AcknowledgeTest.init:75->QpidBrokerTestCase.getQueueDepth:387 » JMS
AcknowledgeOnMessageTest>QpidTestCase.run:165->QpidBrokerTestCase.runBare:95->QpidTestCase.runTest:181->AcknowledgeTest.testPreAck:179->testAcking:91->init:65->AcknowledgeTest.init:75->QpidBrokerTestCase.getQueueDepth:387 » JMS
AcknowledgeOnMessageTest>QpidTestCase.run:165->QpidBrokerTestCase.runBare:95->QpidTestCase.runTest:181->AcknowledgeTest.testTransacted:164->testAcking:91->init:65->AcknowledgeTest.init:75->QpidBrokerTestCase.getQueueDepth:387 » JMS
AcknowledgeTest>QpidTestCase.run:165->QpidBrokerTestCase.runBare:95->QpidTestCase.runTest:181->testAutoAck:159->testAcking:97->init:75->QpidBrokerTestCase.getQueueDepth:387 » JMS
AcknowledgeTest>QpidTestCase.run:165->QpidBrokerTestCase.runBare:95->QpidTestCase.runTest:181->testClientAck:154->testAcking:97->init:75->QpidBrokerTestCase.getQueueDepth:387 » JMS
AcknowledgeTest>QpidTestCase.run:165->QpidBrokerTestCase.runBare:95->QpidTestCase.runTest:181->testDupsOk:169->testAcking:97->init:75->QpidBrokerTestCase.getQueueDepth:387 » JMS
AcknowledgeTest>QpidTestCase.run:165->QpidBrokerTestCase.runBare:95->QpidTestCase.runTest:181->testNoAck:174->testAcking:97->init:75->QpidBrokerTestCase.getQueueDepth:387 » JMS
AcknowledgeTest>QpidTestCase.run:165->QpidBrokerTestCase.runBare:95->QpidTestCase.runTest:181->testPreAck:179->testAcking:97->init:75->QpidBrokerTestCase.getQueueDepth:387 » JMS
AcknowledgeTest>QpidTestCase.run:165->QpidBrokerTestCase.runBare:95->QpidTestCase.runTest:181->testTransacted:164->testAcking:97->init:75->QpidBrokerTestCase.getQueueDepth:387 » JMS
UTF8Test>QpidTestCase.run:165->QpidBrokerTestCase.runBare:95->QpidTestCase.runTest:181->testPlainEn:50->invoke:64->runTest:73->getReceivingDestination:93->createEntitiesUsingAmqpManagement:124->QpidBrokerTestCase.createEntityUsingAmqpManagement:345 » JMS
UTF8Test>QpidTestCase.run:165->QpidBrokerTestCase.runBare:95->QpidTestCase.runTest:181->testUTF8Jp:56->invoke:64->runTest:73->getReceivingDestination:93->createEntitiesUsingAmqpManagement:124->QpidBrokerTestCase.createEntityUsingAmqpManagement:345 » JMS
Tests run: 1034, Failures: 1, Errors: 18, Skipped: 0
[INFO] ------------------------------------------------------------------------
[INFO] BUILD FAILURE
[INFO] ------------------------------------------------------------------------
[INFO] Total time: 05:55 min
[INFO] Finished at: 2017-11-28T10:53:51Z
[INFO] Final Memory: 43M/1285M
[INFO] ------------------------------------------------------------------------
[ERROR] Failed to execute goal org.apache.maven.plugins:maven-surefire-plugin:2.19.1:test (integration-test) on project qpid-systests: There are test failures.
[ERROR]
[ERROR] Please refer to <https://builds.apache.org/job/Qpid-cpp-JMS-AMQP-0-x-Test/4294/artifact/qpid-broker-j/systests/target/surefire-reports/cpp> for the individual test results.
[ERROR] -> [Help 1]
[ERROR]
[ERROR] To see the full stack trace of the errors, re-run Maven with the -e switch.
[ERROR] Re-run Maven using the -X switch to enable full debug logging.
[ERROR]
[ERROR] For more information about the errors and possible solutions, please read the following articles:
[ERROR] [Help 1] http://cwiki.apache.org/confluence/display/MAVEN/MojoFailureException
Build step 'Invoke top-level Maven targets' marked build as failure
[locks-and-latches] Releasing all the locks
[locks-and-latches] All the locks released
Archiving artifacts
Recording test results
Jenkins build is back to normal : Qpid-cpp-JMS-AMQP-0-x-Test #4298
Posted by Apache Jenkins Server <je...@builds.apache.org>.
See <https://builds.apache.org/job/Qpid-cpp-JMS-AMQP-0-x-Test/4298/display/redirect?page=changes>
Build failed in Jenkins: Qpid-cpp-JMS-AMQP-0-x-Test #4297
Posted by Apache Jenkins Server <je...@builds.apache.org>.
See <https://builds.apache.org/job/Qpid-cpp-JMS-AMQP-0-x-Test/4297/display/redirect?page=changes>
Changes:
[orudyy] QPID-6933: [System Tests] Add tests relaying on AMQP management into cpp
------------------------------------------
[...truncated 775.06 KB...]
QueueBrowserTransactedTest>QpidTestCase.run:165->QpidBrokerTestCase.runBare:113->QueueBrowserAutoAckTest.setUp:54->QpidBrokerTestCase.setUp:585->QpidBrokerTestCase.startDefaultBroker:151->QpidBrokerTestCase.startDefaultBroker:156 » IO
QueueBrowserTransactedTest>QpidTestCase.run:165->QpidBrokerTestCase.runBare:113->QueueBrowserAutoAckTest.setUp:54->QpidBrokerTestCase.setUp:585->QpidBrokerTestCase.startDefaultBroker:151->QpidBrokerTestCase.startDefaultBroker:156 » IO
RollbackOrderTest>QpidTestCase.run:165->QpidBrokerTestCase.runBare:113->setUp:100->QpidBrokerTestCase.setUp:585->QpidBrokerTestCase.startDefaultBroker:151->QpidBrokerTestCase.startDefaultBroker:156 » IO
RollbackOrderTest>QpidTestCase.run:165->QpidBrokerTestCase.runBare:113->setUp:100->QpidBrokerTestCase.setUp:585->QpidBrokerTestCase.startDefaultBroker:151->QpidBrokerTestCase.startDefaultBroker:156 » IO
AddressBasedDestinationTest>QpidTestCase.run:165->QpidBrokerTestCase.runBare:113->setUp:73->QpidBrokerTestCase.setUp:585->QpidBrokerTestCase.startDefaultBroker:151->QpidBrokerTestCase.startDefaultBroker:156 » IO
AddressBasedDestinationTest>QpidTestCase.run:165->QpidBrokerTestCase.runBare:113->setUp:73->QpidBrokerTestCase.setUp:585->QpidBrokerTestCase.startDefaultBroker:151->QpidBrokerTestCase.startDefaultBroker:156 » IO
AddressBasedDestinationTest>QpidTestCase.run:165->QpidBrokerTestCase.runBare:113->setUp:73->QpidBrokerTestCase.setUp:585->QpidBrokerTestCase.startDefaultBroker:151->QpidBrokerTestCase.startDefaultBroker:156 » IO
AddressBasedDestinationTest>QpidTestCase.run:165->QpidBrokerTestCase.runBare:113->setUp:73->QpidBrokerTestCase.setUp:585->QpidBrokerTestCase.startDefaultBroker:151->QpidBrokerTestCase.startDefaultBroker:156 » IO
AddressBasedDestinationTest>QpidTestCase.run:165->QpidBrokerTestCase.runBare:113->setUp:73->QpidBrokerTestCase.setUp:585->QpidBrokerTestCase.startDefaultBroker:151->QpidBrokerTestCase.startDefaultBroker:156 » IO
AddressBasedDestinationTest>QpidTestCase.run:165->QpidBrokerTestCase.runBare:113->setUp:73->QpidBrokerTestCase.setUp:585->QpidBrokerTestCase.startDefaultBroker:151->QpidBrokerTestCase.startDefaultBroker:156 » IO
AddressBasedDestinationTest>QpidTestCase.run:165->QpidBrokerTestCase.runBare:113->setUp:73->QpidBrokerTestCase.setUp:585->QpidBrokerTestCase.startDefaultBroker:151->QpidBrokerTestCase.startDefaultBroker:156 » IO
AddressBasedDestinationTest>QpidTestCase.run:165->QpidBrokerTestCase.runBare:113->setUp:73->QpidBrokerTestCase.setUp:585->QpidBrokerTestCase.startDefaultBroker:151->QpidBrokerTestCase.startDefaultBroker:156 » IO
AddressBasedDestinationTest>QpidTestCase.run:165->QpidBrokerTestCase.runBare:113->setUp:73->QpidBrokerTestCase.setUp:585->QpidBrokerTestCase.startDefaultBroker:151->QpidBrokerTestCase.startDefaultBroker:156 » IO
AddressBasedDestinationTest>QpidTestCase.run:165->QpidBrokerTestCase.runBare:113->setUp:73->QpidBrokerTestCase.setUp:585->QpidBrokerTestCase.startDefaultBroker:151->QpidBrokerTestCase.startDefaultBroker:156 » IO
AddressBasedDestinationTest>QpidTestCase.run:165->QpidBrokerTestCase.runBare:113->setUp:73->QpidBrokerTestCase.setUp:585->QpidBrokerTestCase.startDefaultBroker:151->QpidBrokerTestCase.startDefaultBroker:156 » IO
AddressBasedDestinationTest>QpidTestCase.run:165->QpidBrokerTestCase.runBare:113->setUp:73->QpidBrokerTestCase.setUp:585->QpidBrokerTestCase.startDefaultBroker:151->QpidBrokerTestCase.startDefaultBroker:156 » IO
AddressBasedDestinationTest>QpidTestCase.run:165->QpidBrokerTestCase.runBare:113->setUp:73->QpidBrokerTestCase.setUp:585->QpidBrokerTestCase.startDefaultBroker:151->QpidBrokerTestCase.startDefaultBroker:156 » IO
AddressBasedDestinationTest>QpidTestCase.run:165->QpidBrokerTestCase.runBare:113->setUp:73->QpidBrokerTestCase.setUp:585->QpidBrokerTestCase.startDefaultBroker:151->QpidBrokerTestCase.startDefaultBroker:156 » IO
AddressBasedDestinationTest>QpidTestCase.run:165->QpidBrokerTestCase.runBare:113->setUp:73->QpidBrokerTestCase.setUp:585->QpidBrokerTestCase.startDefaultBroker:151->QpidBrokerTestCase.startDefaultBroker:156 » IO
AddressBasedDestinationTest>QpidTestCase.run:165->QpidBrokerTestCase.runBare:113->setUp:73->QpidBrokerTestCase.setUp:585->QpidBrokerTestCase.startDefaultBroker:151->QpidBrokerTestCase.startDefaultBroker:156 » IO
AddressBasedDestinationTest>QpidTestCase.run:165->QpidBrokerTestCase.runBare:113->setUp:73->QpidBrokerTestCase.setUp:585->QpidBrokerTestCase.startDefaultBroker:151->QpidBrokerTestCase.startDefaultBroker:156 » IO
AddressBasedDestinationTest>QpidTestCase.run:165->QpidBrokerTestCase.runBare:113->setUp:73->QpidBrokerTestCase.setUp:585->QpidBrokerTestCase.startDefaultBroker:151->QpidBrokerTestCase.startDefaultBroker:156 » IO
AddressBasedDestinationTest>QpidTestCase.run:165->QpidBrokerTestCase.runBare:113->setUp:73->QpidBrokerTestCase.setUp:585->QpidBrokerTestCase.startDefaultBroker:151->QpidBrokerTestCase.startDefaultBroker:156 » IO
AddressBasedDestinationTest>QpidTestCase.run:165->QpidBrokerTestCase.runBare:113->setUp:73->QpidBrokerTestCase.setUp:585->QpidBrokerTestCase.startDefaultBroker:151->QpidBrokerTestCase.startDefaultBroker:156 » IO
AddressBasedDestinationTest>QpidTestCase.run:165->QpidBrokerTestCase.runBare:113->setUp:73->QpidBrokerTestCase.setUp:585->QpidBrokerTestCase.startDefaultBroker:151->QpidBrokerTestCase.startDefaultBroker:156 » IO
AddressBasedDestinationTest>QpidTestCase.run:165->QpidBrokerTestCase.runBare:113->setUp:73->QpidBrokerTestCase.setUp:585->QpidBrokerTestCase.startDefaultBroker:151->QpidBrokerTestCase.startDefaultBroker:156 » IO
AddressBasedDestinationTest>QpidTestCase.run:165->QpidBrokerTestCase.runBare:113->setUp:73->QpidBrokerTestCase.setUp:585->QpidBrokerTestCase.startDefaultBroker:151->QpidBrokerTestCase.startDefaultBroker:156 » IO
AddressBasedDestinationTest>QpidTestCase.run:165->QpidBrokerTestCase.runBare:113->setUp:73->QpidBrokerTestCase.setUp:585->QpidBrokerTestCase.startDefaultBroker:151->QpidBrokerTestCase.startDefaultBroker:156 » IO
AddressBasedDestinationTest>QpidTestCase.run:165->QpidBrokerTestCase.runBare:113->setUp:73->QpidBrokerTestCase.setUp:585->QpidBrokerTestCase.startDefaultBroker:151->QpidBrokerTestCase.startDefaultBroker:156 » IO
AddressBasedDestinationTest>QpidTestCase.run:165->QpidBrokerTestCase.runBare:113->setUp:73->QpidBrokerTestCase.setUp:585->QpidBrokerTestCase.startDefaultBroker:151->QpidBrokerTestCase.startDefaultBroker:156 » IO
AddressBasedDestinationTest>QpidTestCase.run:165->QpidBrokerTestCase.runBare:113->setUp:73->QpidBrokerTestCase.setUp:585->QpidBrokerTestCase.startDefaultBroker:151->QpidBrokerTestCase.startDefaultBroker:156 » IO
AddressBasedDestinationTest>QpidTestCase.run:165->QpidBrokerTestCase.runBare:113->setUp:73->QpidBrokerTestCase.setUp:585->QpidBrokerTestCase.startDefaultBroker:151->QpidBrokerTestCase.startDefaultBroker:156 » IO
AddressBasedDestinationTest>QpidTestCase.run:165->QpidBrokerTestCase.runBare:113->setUp:73->QpidBrokerTestCase.setUp:585->QpidBrokerTestCase.startDefaultBroker:151->QpidBrokerTestCase.startDefaultBroker:156 » IO
AddressBasedDestinationTest>QpidTestCase.run:165->QpidBrokerTestCase.runBare:113->setUp:73->QpidBrokerTestCase.setUp:585->QpidBrokerTestCase.startDefaultBroker:151->QpidBrokerTestCase.startDefaultBroker:156 » IO
AddressBasedDestinationTest>QpidTestCase.run:165->QpidBrokerTestCase.runBare:113->setUp:73->QpidBrokerTestCase.setUp:585->QpidBrokerTestCase.startDefaultBroker:151->QpidBrokerTestCase.startDefaultBroker:156 » IO
AddressBasedDestinationTest>QpidTestCase.run:165->QpidBrokerTestCase.runBare:113->setUp:73->QpidBrokerTestCase.setUp:585->QpidBrokerTestCase.startDefaultBroker:151->QpidBrokerTestCase.startDefaultBroker:156 » IO
AddressBasedDestinationTest>QpidTestCase.run:165->QpidBrokerTestCase.runBare:113->setUp:73->QpidBrokerTestCase.setUp:585->QpidBrokerTestCase.startDefaultBroker:151->QpidBrokerTestCase.startDefaultBroker:156 » IO
AddressBasedDestinationTest>QpidTestCase.run:165->QpidBrokerTestCase.runBare:113->setUp:73->QpidBrokerTestCase.setUp:585->QpidBrokerTestCase.startDefaultBroker:151->QpidBrokerTestCase.startDefaultBroker:156 » IO
AddressBasedDestinationTest>QpidTestCase.run:165->QpidBrokerTestCase.runBare:113->setUp:73->QpidBrokerTestCase.setUp:585->QpidBrokerTestCase.startDefaultBroker:151->QpidBrokerTestCase.startDefaultBroker:156 » IO
AddressBasedDestinationTest>QpidTestCase.run:165->QpidBrokerTestCase.runBare:113->setUp:73->QpidBrokerTestCase.setUp:585->QpidBrokerTestCase.startDefaultBroker:151->QpidBrokerTestCase.startDefaultBroker:156 » IO
AddressBasedDestinationTest>QpidTestCase.run:165->QpidBrokerTestCase.runBare:113->setUp:73->QpidBrokerTestCase.setUp:585->QpidBrokerTestCase.startDefaultBroker:151->QpidBrokerTestCase.startDefaultBroker:156 » IO
AddressBasedDestinationTest>QpidTestCase.run:165->QpidBrokerTestCase.runBare:113->setUp:73->QpidBrokerTestCase.setUp:585->QpidBrokerTestCase.startDefaultBroker:151->QpidBrokerTestCase.startDefaultBroker:156 » IO
AddressBasedDestinationTest>QpidTestCase.run:165->QpidBrokerTestCase.runBare:113->setUp:73->QpidBrokerTestCase.setUp:585->QpidBrokerTestCase.startDefaultBroker:151->QpidBrokerTestCase.startDefaultBroker:156 » IO
AddressBasedDestinationTest>QpidTestCase.run:165->QpidBrokerTestCase.runBare:113->setUp:73->QpidBrokerTestCase.setUp:585->QpidBrokerTestCase.startDefaultBroker:151->QpidBrokerTestCase.startDefaultBroker:156 » IO
AddressBasedDestinationTest>QpidTestCase.run:165->QpidBrokerTestCase.runBare:113->setUp:73->QpidBrokerTestCase.setUp:585->QpidBrokerTestCase.startDefaultBroker:151->QpidBrokerTestCase.startDefaultBroker:156 » IO
AddressBasedDestinationTest>QpidTestCase.run:165->QpidBrokerTestCase.runBare:113->setUp:73->QpidBrokerTestCase.setUp:585->QpidBrokerTestCase.startDefaultBroker:151->QpidBrokerTestCase.startDefaultBroker:156 » IO
AddressBasedDestinationTest>QpidTestCase.run:165->QpidBrokerTestCase.runBare:113->setUp:73->QpidBrokerTestCase.setUp:585->QpidBrokerTestCase.startDefaultBroker:151->QpidBrokerTestCase.startDefaultBroker:156 » IO
FailoverTest>QpidTestCase.run:165->QpidBrokerTestCase.runBare:113->setUp:65->FailoverBaseCase.setUp:54->QpidBrokerTestCase.setUp:585->QpidBrokerTestCase.startDefaultBroker:151->QpidBrokerTestCase.startDefaultBroker:156 » IO
FailoverTest>QpidTestCase.run:165->QpidBrokerTestCase.runBare:113->setUp:65->FailoverBaseCase.setUp:54->QpidBrokerTestCase.setUp:585->QpidBrokerTestCase.startDefaultBroker:151->QpidBrokerTestCase.startDefaultBroker:156 » IO
FailoverTest>QpidTestCase.run:165->QpidBrokerTestCase.runBare:113->setUp:65->FailoverBaseCase.setUp:54->QpidBrokerTestCase.setUp:585->QpidBrokerTestCase.startDefaultBroker:151->QpidBrokerTestCase.startDefaultBroker:156 » IO
FailoverTest>QpidTestCase.run:165->QpidBrokerTestCase.runBare:113->setUp:65->FailoverBaseCase.setUp:54->QpidBrokerTestCase.setUp:585->QpidBrokerTestCase.startDefaultBroker:151->QpidBrokerTestCase.startDefaultBroker:156 » IO
FailoverTest>QpidTestCase.run:165->QpidBrokerTestCase.runBare:113->setUp:65->FailoverBaseCase.setUp:54->QpidBrokerTestCase.setUp:585->QpidBrokerTestCase.startDefaultBroker:151->QpidBrokerTestCase.startDefaultBroker:156 » IO
FailoverTest>QpidTestCase.run:165->QpidBrokerTestCase.runBare:113->setUp:65->FailoverBaseCase.setUp:54->QpidBrokerTestCase.setUp:585->QpidBrokerTestCase.startDefaultBroker:151->QpidBrokerTestCase.startDefaultBroker:156 » IO
FailoverTest>QpidTestCase.run:165->QpidBrokerTestCase.runBare:113->setUp:65->FailoverBaseCase.setUp:54->QpidBrokerTestCase.setUp:585->QpidBrokerTestCase.startDefaultBroker:151->QpidBrokerTestCase.startDefaultBroker:156 » IO
JMSDestinationTest>QpidTestCase.run:165->QpidBrokerTestCase.runBare:113->setUp:60->QpidBrokerTestCase.setUp:585->QpidBrokerTestCase.startDefaultBroker:151->QpidBrokerTestCase.startDefaultBroker:156 » IO
JMSDestinationTest>QpidTestCase.run:165->QpidBrokerTestCase.runBare:113->setUp:60->QpidBrokerTestCase.setUp:585->QpidBrokerTestCase.startDefaultBroker:151->QpidBrokerTestCase.startDefaultBroker:156 » IO
JMSDestinationTest>QpidTestCase.run:165->QpidBrokerTestCase.runBare:113->setUp:60->QpidBrokerTestCase.setUp:585->QpidBrokerTestCase.startDefaultBroker:151->QpidBrokerTestCase.startDefaultBroker:156 » IO
JMSDestinationTest>QpidTestCase.run:165->QpidBrokerTestCase.runBare:113->setUp:60->QpidBrokerTestCase.setUp:585->QpidBrokerTestCase.startDefaultBroker:151->QpidBrokerTestCase.startDefaultBroker:156 » IO
JMSDestinationTest>QpidTestCase.run:165->QpidBrokerTestCase.runBare:113->setUp:60->QpidBrokerTestCase.setUp:585->QpidBrokerTestCase.startDefaultBroker:151->QpidBrokerTestCase.startDefaultBroker:156 » IO
JMSDestinationTest>QpidTestCase.run:165->QpidBrokerTestCase.runBare:113->setUp:60->QpidBrokerTestCase.setUp:585->QpidBrokerTestCase.startDefaultBroker:151->QpidBrokerTestCase.startDefaultBroker:156 » IO
JMSReplyToTest>QpidTestCase.run:165->QpidBrokerTestCase.runBare:113->setUp:53->QpidBrokerTestCase.setUp:585->QpidBrokerTestCase.startDefaultBroker:151->QpidBrokerTestCase.startDefaultBroker:156 » IO
JMSReplyToTest>QpidTestCase.run:165->QpidBrokerTestCase.runBare:113->setUp:53->QpidBrokerTestCase.setUp:585->QpidBrokerTestCase.startDefaultBroker:151->QpidBrokerTestCase.startDefaultBroker:156 » IO
JMSXUserIDTest>QpidTestCase.run:165->QpidBrokerTestCase.runBare:113->QpidBrokerTestCase.setUp:585->QpidBrokerTestCase.startDefaultBroker:151->QpidBrokerTestCase.startDefaultBroker:156 » IO
JMSXUserIDTest>QpidTestCase.run:165->QpidBrokerTestCase.runBare:113->QpidBrokerTestCase.setUp:585->QpidBrokerTestCase.startDefaultBroker:151->QpidBrokerTestCase.startDefaultBroker:156 » IO
MessageToStringTest>QpidTestCase.run:165->QpidBrokerTestCase.runBare:113->setUp:55->QpidBrokerTestCase.setUp:585->QpidBrokerTestCase.startDefaultBroker:151->QpidBrokerTestCase.startDefaultBroker:156 » IO
MessageToStringTest>QpidTestCase.run:165->QpidBrokerTestCase.runBare:113->setUp:55->QpidBrokerTestCase.setUp:585->QpidBrokerTestCase.startDefaultBroker:151->QpidBrokerTestCase.startDefaultBroker:156 » IO
MessageToStringTest>QpidTestCase.run:165->QpidBrokerTestCase.runBare:113->setUp:55->QpidBrokerTestCase.setUp:585->QpidBrokerTestCase.startDefaultBroker:151->QpidBrokerTestCase.startDefaultBroker:156 » IO
MessageToStringTest>QpidTestCase.run:165->QpidBrokerTestCase.runBare:113->setUp:55->QpidBrokerTestCase.setUp:585->QpidBrokerTestCase.startDefaultBroker:151->QpidBrokerTestCase.startDefaultBroker:156 » IO
MessageToStringTest>QpidTestCase.run:165->QpidBrokerTestCase.runBare:113->setUp:55->QpidBrokerTestCase.setUp:585->QpidBrokerTestCase.startDefaultBroker:151->QpidBrokerTestCase.startDefaultBroker:156 » IO
ObjectMessageTest>QpidTestCase.run:165->QpidBrokerTestCase.runBare:113->setUp:45->QpidBrokerTestCase.setUp:585->QpidBrokerTestCase.startDefaultBroker:151->QpidBrokerTestCase.startDefaultBroker:156 » IO
ObjectMessageTest>QpidTestCase.run:165->QpidBrokerTestCase.runBare:113->setUp:45->QpidBrokerTestCase.setUp:585->QpidBrokerTestCase.startDefaultBroker:151->QpidBrokerTestCase.startDefaultBroker:156 » IO
ObjectMessageTest>QpidTestCase.run:165->QpidBrokerTestCase.runBare:113->setUp:45->QpidBrokerTestCase.setUp:585->QpidBrokerTestCase.startDefaultBroker:151->QpidBrokerTestCase.startDefaultBroker:156 » IO
ObjectMessageTest>QpidTestCase.run:165->QpidBrokerTestCase.runBare:113->setUp:45->QpidBrokerTestCase.setUp:585->QpidBrokerTestCase.startDefaultBroker:151->QpidBrokerTestCase.startDefaultBroker:156 » IO
ObjectMessageTest>QpidTestCase.run:165->QpidBrokerTestCase.runBare:113->setUp:45->QpidBrokerTestCase.setUp:585->QpidBrokerTestCase.startDefaultBroker:151->QpidBrokerTestCase.startDefaultBroker:156 » IO
SelectorTest>QpidTestCase.run:165->QpidBrokerTestCase.runBare:113->setUp:60->QpidBrokerTestCase.setUp:585->QpidBrokerTestCase.startDefaultBroker:151->QpidBrokerTestCase.startDefaultBroker:156 » IO
SelectorTest>QpidTestCase.run:165->QpidBrokerTestCase.runBare:113->setUp:60->QpidBrokerTestCase.setUp:585->QpidBrokerTestCase.startDefaultBroker:151->QpidBrokerTestCase.startDefaultBroker:156 » IO
SelectorTest>QpidTestCase.run:165->QpidBrokerTestCase.runBare:113->setUp:60->QpidBrokerTestCase.setUp:585->QpidBrokerTestCase.startDefaultBroker:151->QpidBrokerTestCase.startDefaultBroker:156 » IO
SelectorTest>QpidTestCase.run:165->QpidBrokerTestCase.runBare:113->setUp:60->QpidBrokerTestCase.setUp:585->QpidBrokerTestCase.startDefaultBroker:151->QpidBrokerTestCase.startDefaultBroker:156 » IO
QueuePolicyTest>QpidTestCase.run:165->QpidBrokerTestCase.runBare:113->setUp:45->QpidBrokerTestCase.setUp:585->QpidBrokerTestCase.startDefaultBroker:151->QpidBrokerTestCase.startDefaultBroker:156 » IO
QueuePolicyTest>QpidTestCase.run:165->QpidBrokerTestCase.runBare:113->setUp:45->QpidBrokerTestCase.setUp:585->QpidBrokerTestCase.startDefaultBroker:151->QpidBrokerTestCase.startDefaultBroker:156 » IO
QueueReceiverTest>QpidTestCase.run:165->QpidBrokerTestCase.runBare:113->setUp:41->QpidBrokerTestCase.setUp:585->QpidBrokerTestCase.startDefaultBroker:151->QpidBrokerTestCase.startDefaultBroker:156 » IO
RecoverTest>QpidTestCase.run:165->QpidBrokerTestCase.runBare:113->setUp:58->QpidBrokerTestCase.setUp:585->QpidBrokerTestCase.startDefaultBroker:151->QpidBrokerTestCase.startDefaultBroker:156 » IO
RecoverTest>QpidTestCase.run:165->QpidBrokerTestCase.runBare:113->setUp:58->QpidBrokerTestCase.setUp:585->QpidBrokerTestCase.startDefaultBroker:151->QpidBrokerTestCase.startDefaultBroker:156 » IO
RecoverTest>QpidTestCase.run:165->QpidBrokerTestCase.runBare:113->setUp:58->QpidBrokerTestCase.setUp:585->QpidBrokerTestCase.startDefaultBroker:151->QpidBrokerTestCase.startDefaultBroker:156 » IO
RecoverTest>QpidTestCase.run:165->QpidBrokerTestCase.runBare:113->setUp:58->QpidBrokerTestCase.setUp:585->QpidBrokerTestCase.startDefaultBroker:151->QpidBrokerTestCase.startDefaultBroker:156 » IO
RecoverTest>QpidTestCase.run:165->QpidBrokerTestCase.runBare:113->setUp:58->QpidBrokerTestCase.setUp:585->QpidBrokerTestCase.startDefaultBroker:151->QpidBrokerTestCase.startDefaultBroker:156 » IO
RecoverTest>QpidTestCase.run:165->QpidBrokerTestCase.runBare:113->setUp:58->QpidBrokerTestCase.setUp:585->QpidBrokerTestCase.startDefaultBroker:151->QpidBrokerTestCase.startDefaultBroker:156 » IO
RecoverTest>QpidTestCase.run:165->QpidBrokerTestCase.runBare:113->setUp:58->QpidBrokerTestCase.setUp:585->QpidBrokerTestCase.startDefaultBroker:151->QpidBrokerTestCase.startDefaultBroker:156 » IO
BytesMessageTest>QpidTestCase.run:165->QpidBrokerTestCase.runBare:113->setUp:59->QpidBrokerTestCase.setUp:585->QpidBrokerTestCase.startDefaultBroker:151->QpidBrokerTestCase.startDefaultBroker:156 » IO
BytesMessageTest>QpidTestCase.run:165->QpidBrokerTestCase.runBare:113->setUp:59->QpidBrokerTestCase.setUp:585->QpidBrokerTestCase.startDefaultBroker:151->QpidBrokerTestCase.startDefaultBroker:156 » IO
FieldTableMessageTest>QpidTestCase.run:165->QpidBrokerTestCase.runBare:113->setUp:61->QpidBrokerTestCase.setUp:585->QpidBrokerTestCase.startDefaultBroker:151->QpidBrokerTestCase.startDefaultBroker:156 » IO
InvalidDestinationTest>QpidTestCase.run:165->QpidBrokerTestCase.runBare:113->setUp:50->QpidBrokerTestCase.setUp:585->QpidBrokerTestCase.startDefaultBroker:151->QpidBrokerTestCase.startDefaultBroker:156 » IO
InvalidDestinationTest>QpidTestCase.run:165->QpidBrokerTestCase.runBare:113->setUp:50->QpidBrokerTestCase.setUp:585->QpidBrokerTestCase.startDefaultBroker:151->QpidBrokerTestCase.startDefaultBroker:156 » IO
InvalidDestinationTest>QpidTestCase.run:165->QpidBrokerTestCase.runBare:113->setUp:50->QpidBrokerTestCase.setUp:585->QpidBrokerTestCase.startDefaultBroker:151->QpidBrokerTestCase.startDefaultBroker:156 » IO
LargeMessageTest>QpidTestCase.run:165->QpidBrokerTestCase.runBare:113->setUp:48->QpidBrokerTestCase.setUp:585->QpidBrokerTestCase.startDefaultBroker:151->QpidBrokerTestCase.startDefaultBroker:156 » IO
LargeMessageTest>QpidTestCase.run:165->QpidBrokerTestCase.runBare:113->setUp:48->QpidBrokerTestCase.setUp:585->QpidBrokerTestCase.startDefaultBroker:151->QpidBrokerTestCase.startDefaultBroker:156 » IO
LargeMessageTest>QpidTestCase.run:165->QpidBrokerTestCase.runBare:113->setUp:48->QpidBrokerTestCase.setUp:585->QpidBrokerTestCase.startDefaultBroker:151->QpidBrokerTestCase.startDefaultBroker:156 » IO
LargeMessageTest>QpidTestCase.run:165->QpidBrokerTestCase.runBare:113->setUp:48->QpidBrokerTestCase.setUp:585->QpidBrokerTestCase.startDefaultBroker:151->QpidBrokerTestCase.startDefaultBroker:156 » IO
LargeMessageTest>QpidTestCase.run:165->QpidBrokerTestCase.runBare:113->setUp:48->QpidBrokerTestCase.setUp:585->QpidBrokerTestCase.startDefaultBroker:151->QpidBrokerTestCase.startDefaultBroker:156 » IO
LargeMessageTest>QpidTestCase.run:165->QpidBrokerTestCase.runBare:113->setUp:48->QpidBrokerTestCase.setUp:585->QpidBrokerTestCase.startDefaultBroker:151->QpidBrokerTestCase.startDefaultBroker:156 » IO
LargeMessageTest>QpidTestCase.run:165->QpidBrokerTestCase.runBare:113->setUp:48->QpidBrokerTestCase.setUp:585->QpidBrokerTestCase.startDefaultBroker:151->QpidBrokerTestCase.startDefaultBroker:156 » IO
LargeMessageTest>QpidTestCase.run:165->QpidBrokerTestCase.runBare:113->setUp:48->QpidBrokerTestCase.setUp:585->QpidBrokerTestCase.startDefaultBroker:151->QpidBrokerTestCase.startDefaultBroker:156 » IO
LargeMessageTest>QpidTestCase.run:165->QpidBrokerTestCase.runBare:113->setUp:48->QpidBrokerTestCase.setUp:585->QpidBrokerTestCase.startDefaultBroker:151->QpidBrokerTestCase.startDefaultBroker:156 » IO
LargeMessageTest>QpidTestCase.run:165->QpidBrokerTestCase.runBare:113->setUp:48->QpidBrokerTestCase.setUp:585->QpidBrokerTestCase.startDefaultBroker:151->QpidBrokerTestCase.startDefaultBroker:156 » IO
MapMessageTest>QpidTestCase.run:165->QpidBrokerTestCase.runBare:113->setUp:61->QpidBrokerTestCase.setUp:585->QpidBrokerTestCase.startDefaultBroker:151->QpidBrokerTestCase.startDefaultBroker:156 » IO
MultipleConnectionTest>QpidTestCase.run:165->QpidBrokerTestCase.runBare:113->QpidBrokerTestCase.setUp:585->QpidBrokerTestCase.startDefaultBroker:151->QpidBrokerTestCase.startDefaultBroker:156 » IO
ObjectMessageTest>QpidTestCase.run:165->QpidBrokerTestCase.runBare:113->setUp:58->QpidBrokerTestCase.setUp:585->QpidBrokerTestCase.startDefaultBroker:151->QpidBrokerTestCase.startDefaultBroker:156 » IO
PropertyValueTest>QpidTestCase.run:165->QpidBrokerTestCase.runBare:113->setUp:68->QpidBrokerTestCase.setUp:585->QpidBrokerTestCase.startDefaultBroker:151->QpidBrokerTestCase.startDefaultBroker:156 » IO
PropertyValueTest>QpidTestCase.run:165->QpidBrokerTestCase.runBare:113->setUp:68->QpidBrokerTestCase.setUp:585->QpidBrokerTestCase.startDefaultBroker:151->QpidBrokerTestCase.startDefaultBroker:156 » IO
PropertyValueTest>QpidTestCase.run:165->QpidBrokerTestCase.runBare:113->setUp:68->QpidBrokerTestCase.setUp:585->QpidBrokerTestCase.startDefaultBroker:151->QpidBrokerTestCase.startDefaultBroker:156 » IO
PropertyValueTest>QpidTestCase.run:165->QpidBrokerTestCase.runBare:113->setUp:68->QpidBrokerTestCase.setUp:585->QpidBrokerTestCase.startDefaultBroker:151->QpidBrokerTestCase.startDefaultBroker:156 » IO
PropertyValueTest>QpidTestCase.run:165->QpidBrokerTestCase.runBare:113->setUp:68->QpidBrokerTestCase.setUp:585->QpidBrokerTestCase.startDefaultBroker:151->QpidBrokerTestCase.startDefaultBroker:156 » IO
PubSubTwoConnectionTest>QpidTestCase.run:165->QpidBrokerTestCase.runBare:113->QpidBrokerTestCase.setUp:585->QpidBrokerTestCase.startDefaultBroker:151->QpidBrokerTestCase.startDefaultBroker:156 » IO
SessionStartTest>QpidTestCase.run:165->QpidBrokerTestCase.runBare:113->setUp:50->QpidBrokerTestCase.setUp:585->QpidBrokerTestCase.startDefaultBroker:151->QpidBrokerTestCase.startDefaultBroker:156 » IO
TextMessageTest>QpidTestCase.run:165->QpidBrokerTestCase.runBare:113->setUp:62->QpidBrokerTestCase.setUp:585->QpidBrokerTestCase.startDefaultBroker:151->QpidBrokerTestCase.startDefaultBroker:156 » IO
CloseTest>QpidTestCase.run:165->QpidBrokerTestCase.runBare:113->QpidBrokerTestCase.setUp:585->QpidBrokerTestCase.startDefaultBroker:151->QpidBrokerTestCase.startDefaultBroker:156 » IO
AMQSessionTest>QpidTestCase.run:165->QpidBrokerTestCase.runBare:113->setUp:43->QpidBrokerTestCase.setUp:585->QpidBrokerTestCase.startDefaultBroker:151->QpidBrokerTestCase.startDefaultBroker:156 » IO
AMQSessionTest>QpidTestCase.run:165->QpidBrokerTestCase.runBare:113->setUp:43->QpidBrokerTestCase.setUp:585->QpidBrokerTestCase.startDefaultBroker:151->QpidBrokerTestCase.startDefaultBroker:156 » IO
QueueSessionFactoryTest>QpidTestCase.run:165->QpidBrokerTestCase.runBare:113->QpidBrokerTestCase.setUp:585->QpidBrokerTestCase.startDefaultBroker:151->QpidBrokerTestCase.startDefaultBroker:156 » IO
QueueSessionFactoryTest>QpidTestCase.run:165->QpidBrokerTestCase.runBare:113->QpidBrokerTestCase.setUp:585->QpidBrokerTestCase.startDefaultBroker:151->QpidBrokerTestCase.startDefaultBroker:156 » IO
QueueSessionFactoryTest>QpidTestCase.run:165->QpidBrokerTestCase.runBare:113->QpidBrokerTestCase.setUp:585->QpidBrokerTestCase.startDefaultBroker:151->QpidBrokerTestCase.startDefaultBroker:156 » IO
QueueSessionFactoryTest>QpidTestCase.run:165->QpidBrokerTestCase.runBare:113->QpidBrokerTestCase.setUp:585->QpidBrokerTestCase.startDefaultBroker:151->QpidBrokerTestCase.startDefaultBroker:156 » IO
QueueSessionFactoryTest>QpidTestCase.run:165->QpidBrokerTestCase.runBare:113->QpidBrokerTestCase.setUp:585->QpidBrokerTestCase.startDefaultBroker:151->QpidBrokerTestCase.startDefaultBroker:156 » IO
TopicSessionFactoryTest>QpidTestCase.run:165->QpidBrokerTestCase.runBare:113->QpidBrokerTestCase.setUp:585->QpidBrokerTestCase.startDefaultBroker:151->QpidBrokerTestCase.startDefaultBroker:156 » IO
TopicSessionFactoryTest>QpidTestCase.run:165->QpidBrokerTestCase.runBare:113->QpidBrokerTestCase.setUp:585->QpidBrokerTestCase.startDefaultBroker:151->QpidBrokerTestCase.startDefaultBroker:156 » IO
TopicSessionFactoryTest>QpidTestCase.run:165->QpidBrokerTestCase.runBare:113->QpidBrokerTestCase.setUp:585->QpidBrokerTestCase.startDefaultBroker:151->QpidBrokerTestCase.startDefaultBroker:156 » IO
TopicSessionFactoryTest>QpidTestCase.run:165->QpidBrokerTestCase.runBare:113->QpidBrokerTestCase.setUp:585->QpidBrokerTestCase.startDefaultBroker:151->QpidBrokerTestCase.startDefaultBroker:156 » IO
CloseWithBlockingReceiveTest>QpidTestCase.run:165->QpidBrokerTestCase.runBare:113->QpidBrokerTestCase.setUp:585->QpidBrokerTestCase.startDefaultBroker:151->QpidBrokerTestCase.startDefaultBroker:156 » IO
BrokerClosesClientConnectionTest>QpidTestCase.run:165->QpidBrokerTestCase.runBare:113->setUp:71->QpidBrokerTestCase.setUp:585->QpidBrokerTestCase.startDefaultBroker:151->QpidBrokerTestCase.startDefaultBroker:156 » IO
BrokerClosesClientConnectionTest>QpidTestCase.run:165->QpidBrokerTestCase.runBare:113->setUp:71->QpidBrokerTestCase.setUp:585->QpidBrokerTestCase.startDefaultBroker:151->QpidBrokerTestCase.startDefaultBroker:156 » IO
BrokerClosesClientConnectionTest>QpidTestCase.run:165->QpidBrokerTestCase.runBare:113->setUp:71->QpidBrokerTestCase.setUp:585->QpidBrokerTestCase.startDefaultBroker:151->QpidBrokerTestCase.startDefaultBroker:156 » IO
ConnectionFactoryTest>QpidTestCase.run:165->QpidBrokerTestCase.runBare:113->QpidBrokerTestCase.setUp:585->QpidBrokerTestCase.startDefaultBroker:151->QpidBrokerTestCase.startDefaultBroker:156 » IO
ConnectionFactoryTest>QpidTestCase.run:165->QpidBrokerTestCase.runBare:113->QpidBrokerTestCase.setUp:585->QpidBrokerTestCase.startDefaultBroker:151->QpidBrokerTestCase.startDefaultBroker:156 » IO
ConnectionStartTest>QpidTestCase.run:165->QpidBrokerTestCase.runBare:113->setUp:49->QpidBrokerTestCase.setUp:585->QpidBrokerTestCase.startDefaultBroker:151->QpidBrokerTestCase.startDefaultBroker:156 » IO
ConnectionStartTest>QpidTestCase.run:165->QpidBrokerTestCase.runBare:113->setUp:49->QpidBrokerTestCase.setUp:585->QpidBrokerTestCase.startDefaultBroker:151->QpidBrokerTestCase.startDefaultBroker:156 » IO
ConnectionTest>QpidTestCase.run:165->QpidBrokerTestCase.runBare:113->QpidBrokerTestCase.setUp:585->QpidBrokerTestCase.startDefaultBroker:151->QpidBrokerTestCase.startDefaultBroker:156 » IO
ConnectionTest>QpidTestCase.run:165->QpidBrokerTestCase.runBare:113->QpidBrokerTestCase.setUp:585->QpidBrokerTestCase.startDefaultBroker:151->QpidBrokerTestCase.startDefaultBroker:156 » IO
ConnectionTest>QpidTestCase.run:165->QpidBrokerTestCase.runBare:113->QpidBrokerTestCase.setUp:585->QpidBrokerTestCase.startDefaultBroker:151->QpidBrokerTestCase.startDefaultBroker:156 » IO
ConnectionTest>QpidTestCase.run:165->QpidBrokerTestCase.runBare:113->QpidBrokerTestCase.setUp:585->QpidBrokerTestCase.startDefaultBroker:151->QpidBrokerTestCase.startDefaultBroker:156 » IO
ConnectionTest>QpidTestCase.run:165->QpidBrokerTestCase.runBare:113->QpidBrokerTestCase.setUp:585->QpidBrokerTestCase.startDefaultBroker:151->QpidBrokerTestCase.startDefaultBroker:156 » IO
ConnectionTest>QpidTestCase.run:165->QpidBrokerTestCase.runBare:113->QpidBrokerTestCase.setUp:585->QpidBrokerTestCase.startDefaultBroker:151->QpidBrokerTestCase.startDefaultBroker:156 » IO
ConnectionTest>QpidTestCase.run:165->QpidBrokerTestCase.runBare:113->QpidBrokerTestCase.setUp:585->QpidBrokerTestCase.startDefaultBroker:151->QpidBrokerTestCase.startDefaultBroker:156 » IO
ConnectionTest>QpidTestCase.run:165->QpidBrokerTestCase.runBare:113->QpidBrokerTestCase.setUp:585->QpidBrokerTestCase.startDefaultBroker:151->QpidBrokerTestCase.startDefaultBroker:156 » IO
ConnectionTest>QpidTestCase.run:165->QpidBrokerTestCase.runBare:113->QpidBrokerTestCase.setUp:585->QpidBrokerTestCase.startDefaultBroker:151->QpidBrokerTestCase.startDefaultBroker:156 » IO
ConnectionTest>QpidTestCase.run:165->QpidBrokerTestCase.runBare:113->QpidBrokerTestCase.setUp:585->QpidBrokerTestCase.startDefaultBroker:151->QpidBrokerTestCase.startDefaultBroker:156 » IO
ExceptionListenerTest>QpidTestCase.run:165->QpidBrokerTestCase.runBare:113->QpidBrokerTestCase.setUp:585->QpidBrokerTestCase.startDefaultBroker:151->QpidBrokerTestCase.startDefaultBroker:156 » IO
ExceptionListenerTest>QpidTestCase.run:165->QpidBrokerTestCase.runBare:113->QpidBrokerTestCase.setUp:585->QpidBrokerTestCase.startDefaultBroker:151->QpidBrokerTestCase.startDefaultBroker:156 » IO
ExceptionListenerTest>QpidTestCase.run:165->QpidBrokerTestCase.runBare:113->QpidBrokerTestCase.setUp:585->QpidBrokerTestCase.startDefaultBroker:151->QpidBrokerTestCase.startDefaultBroker:156 » IO
ObjectMessageTest>QpidTestCase.run:165->QpidBrokerTestCase.runBare:113->setUp:57->QpidBrokerTestCase.setUp:585->QpidBrokerTestCase.startDefaultBroker:151->QpidBrokerTestCase.startDefaultBroker:156 » IO
ObjectMessageTest>QpidTestCase.run:165->QpidBrokerTestCase.runBare:113->setUp:57->QpidBrokerTestCase.setUp:585->QpidBrokerTestCase.startDefaultBroker:151->QpidBrokerTestCase.startDefaultBroker:156 » IO
ObjectMessageTest>QpidTestCase.run:165->QpidBrokerTestCase.runBare:113->setUp:57->QpidBrokerTestCase.setUp:585->QpidBrokerTestCase.startDefaultBroker:151->QpidBrokerTestCase.startDefaultBroker:156 » IO
ObjectMessageTest>QpidTestCase.run:165->QpidBrokerTestCase.runBare:113->setUp:57->QpidBrokerTestCase.setUp:585->QpidBrokerTestCase.startDefaultBroker:151->QpidBrokerTestCase.startDefaultBroker:156 » IO
ObjectMessageTest>QpidTestCase.run:165->QpidBrokerTestCase.runBare:113->setUp:57->QpidBrokerTestCase.setUp:585->QpidBrokerTestCase.startDefaultBroker:151->QpidBrokerTestCase.startDefaultBroker:156 » IO
ObjectMessageTest>QpidTestCase.run:165->QpidBrokerTestCase.runBare:113->setUp:57->QpidBrokerTestCase.setUp:585->QpidBrokerTestCase.startDefaultBroker:151->QpidBrokerTestCase.startDefaultBroker:156 » IO
ObjectMessageTest>QpidTestCase.run:165->QpidBrokerTestCase.runBare:113->setUp:57->QpidBrokerTestCase.setUp:585->QpidBrokerTestCase.startDefaultBroker:151->QpidBrokerTestCase.startDefaultBroker:156 » IO
ObjectMessageTest>QpidTestCase.run:165->QpidBrokerTestCase.runBare:113->setUp:57->QpidBrokerTestCase.setUp:585->QpidBrokerTestCase.startDefaultBroker:151->QpidBrokerTestCase.startDefaultBroker:156 » IO
ObjectMessageTest>QpidTestCase.run:165->QpidBrokerTestCase.runBare:113->setUp:57->QpidBrokerTestCase.setUp:585->QpidBrokerTestCase.startDefaultBroker:151->QpidBrokerTestCase.startDefaultBroker:156 » IO
TemporaryQueueTest>QpidTestCase.run:165->QpidBrokerTestCase.runBare:113->QpidBrokerTestCase.setUp:585->QpidBrokerTestCase.startDefaultBroker:151->QpidBrokerTestCase.startDefaultBroker:156 » IO
TemporaryQueueTest>QpidTestCase.run:165->QpidBrokerTestCase.runBare:113->QpidBrokerTestCase.setUp:585->QpidBrokerTestCase.startDefaultBroker:151->QpidBrokerTestCase.startDefaultBroker:156 » IO
TemporaryQueueTest>QpidTestCase.run:165->QpidBrokerTestCase.runBare:113->QpidBrokerTestCase.setUp:585->QpidBrokerTestCase.startDefaultBroker:151->QpidBrokerTestCase.startDefaultBroker:156 » IO
TemporaryQueueTest>QpidTestCase.run:165->QpidBrokerTestCase.runBare:113->QpidBrokerTestCase.setUp:585->QpidBrokerTestCase.startDefaultBroker:151->QpidBrokerTestCase.startDefaultBroker:156 » IO
TemporaryQueueTest>QpidTestCase.run:165->QpidBrokerTestCase.runBare:113->QpidBrokerTestCase.setUp:585->QpidBrokerTestCase.startDefaultBroker:151->QpidBrokerTestCase.startDefaultBroker:156 » IO
MessageConsumerCloseTest>QpidTestCase.run:165->QpidBrokerTestCase.runBare:113->QpidBrokerTestCase.setUp:585->QpidBrokerTestCase.startDefaultBroker:151->QpidBrokerTestCase.startDefaultBroker:156 » IO
MessageConsumerCloseTest>QpidTestCase.run:165->QpidBrokerTestCase.runBare:113->QpidBrokerTestCase.setUp:585->QpidBrokerTestCase.startDefaultBroker:151->QpidBrokerTestCase.startDefaultBroker:156 » IO
MessageConsumerCloseTest>QpidTestCase.run:165->QpidBrokerTestCase.runBare:113->QpidBrokerTestCase.setUp:585->QpidBrokerTestCase.startDefaultBroker:151->QpidBrokerTestCase.startDefaultBroker:156 » IO
MessageConsumerCloseTest>QpidTestCase.run:165->QpidBrokerTestCase.runBare:113->QpidBrokerTestCase.setUp:585->QpidBrokerTestCase.startDefaultBroker:151->QpidBrokerTestCase.startDefaultBroker:156 » IO
TopicPublisherCloseTest>QpidTestCase.run:165->QpidBrokerTestCase.runBare:113->setUp:40->QpidBrokerTestCase.setUp:585->QpidBrokerTestCase.startDefaultBroker:151->QpidBrokerTestCase.startDefaultBroker:156 » IO
ForeignMessageTest>QpidTestCase.run:165->QpidBrokerTestCase.runBare:113->QpidBrokerTestCase.setUp:585->QpidBrokerTestCase.startDefaultBroker:151->QpidBrokerTestCase.startDefaultBroker:156 » IO
JMSHeaderTest>QpidTestCase.run:165->QpidBrokerTestCase.runBare:113->QpidBrokerTestCase.setUp:585->QpidBrokerTestCase.startDefaultBroker:151->QpidBrokerTestCase.startDefaultBroker:156 » IO
JMSPropertiesTest>QpidTestCase.run:165->QpidBrokerTestCase.runBare:113->QpidBrokerTestCase.setUp:585->QpidBrokerTestCase.startDefaultBroker:151->QpidBrokerTestCase.startDefaultBroker:156 » IO
JMSPropertiesTest>QpidTestCase.run:165->QpidBrokerTestCase.runBare:113->QpidBrokerTestCase.setUp:585->QpidBrokerTestCase.startDefaultBroker:151->QpidBrokerTestCase.startDefaultBroker:156 » IO
StreamMessageTest>QpidTestCase.run:165->QpidBrokerTestCase.runBare:113->QpidBrokerTestCase.setUp:585->QpidBrokerTestCase.startDefaultBroker:151->QpidBrokerTestCase.startDefaultBroker:156 » IO
StreamMessageTest>QpidTestCase.run:165->QpidBrokerTestCase.runBare:113->QpidBrokerTestCase.setUp:585->QpidBrokerTestCase.startDefaultBroker:151->QpidBrokerTestCase.startDefaultBroker:156 » IO
DurableSubscriptionTest>QpidTestCase.run:165->QpidBrokerTestCase.runBare:113->QpidBrokerTestCase.setUp:585->QpidBrokerTestCase.startDefaultBroker:151->QpidBrokerTestCase.startDefaultBroker:156 » IO
DurableSubscriptionTest>QpidTestCase.run:165->QpidBrokerTestCase.runBare:113->QpidBrokerTestCase.setUp:585->QpidBrokerTestCase.startDefaultBroker:151->QpidBrokerTestCase.startDefaultBroker:156 » IO
DurableSubscriptionTest>QpidTestCase.run:165->QpidBrokerTestCase.runBare:113->QpidBrokerTestCase.setUp:585->QpidBrokerTestCase.startDefaultBroker:151->QpidBrokerTestCase.startDefaultBroker:156 » IO
DurableSubscriptionTest>QpidTestCase.run:165->QpidBrokerTestCase.runBare:113->QpidBrokerTestCase.setUp:585->QpidBrokerTestCase.startDefaultBroker:151->QpidBrokerTestCase.startDefaultBroker:156 » IO
DurableSubscriptionTest>QpidTestCase.run:165->QpidBrokerTestCase.runBare:113->QpidBrokerTestCase.setUp:585->QpidBrokerTestCase.startDefaultBroker:151->QpidBrokerTestCase.startDefaultBroker:156 » IO
DurableSubscriptionTest>QpidTestCase.run:165->QpidBrokerTestCase.runBare:113->QpidBrokerTestCase.setUp:585->QpidBrokerTestCase.startDefaultBroker:151->QpidBrokerTestCase.startDefaultBroker:156 » IO
DurableSubscriptionTest>QpidTestCase.run:165->QpidBrokerTestCase.runBare:113->QpidBrokerTestCase.setUp:585->QpidBrokerTestCase.startDefaultBroker:151->QpidBrokerTestCase.startDefaultBroker:156 » IO
DurableSubscriptionTest>QpidTestCase.run:165->QpidBrokerTestCase.runBare:113->QpidBrokerTestCase.setUp:585->QpidBrokerTestCase.startDefaultBroker:151->QpidBrokerTestCase.startDefaultBroker:156 » IO
DurableSubscriptionTest>QpidTestCase.run:165->QpidBrokerTestCase.runBare:113->QpidBrokerTestCase.setUp:585->QpidBrokerTestCase.startDefaultBroker:151->QpidBrokerTestCase.startDefaultBroker:156 » IO
TemporaryTopicTest>QpidTestCase.run:165->QpidBrokerTestCase.runBare:113->QpidBrokerTestCase.setUp:585->QpidBrokerTestCase.startDefaultBroker:151->QpidBrokerTestCase.startDefaultBroker:156 » IO
TemporaryTopicTest>QpidTestCase.run:165->QpidBrokerTestCase.runBare:113->QpidBrokerTestCase.setUp:585->QpidBrokerTestCase.startDefaultBroker:151->QpidBrokerTestCase.startDefaultBroker:156 » IO
TemporaryTopicTest>QpidTestCase.run:165->QpidBrokerTestCase.runBare:113->QpidBrokerTestCase.setUp:585->QpidBrokerTestCase.startDefaultBroker:151->QpidBrokerTestCase.startDefaultBroker:156 » IO
TemporaryTopicTest>QpidTestCase.run:165->QpidBrokerTestCase.runBare:113->QpidBrokerTestCase.setUp:585->QpidBrokerTestCase.startDefaultBroker:151->QpidBrokerTestCase.startDefaultBroker:156 » IO
TemporaryTopicTest>QpidTestCase.run:165->QpidBrokerTestCase.runBare:113->QpidBrokerTestCase.setUp:585->QpidBrokerTestCase.startDefaultBroker:151->QpidBrokerTestCase.startDefaultBroker:156 » IO
TopicPublisherTest>QpidTestCase.run:165->QpidBrokerTestCase.runBare:113->QpidBrokerTestCase.setUp:585->QpidBrokerTestCase.startDefaultBroker:151->QpidBrokerTestCase.startDefaultBroker:156 » IO
TopicSessionTest>QpidTestCase.run:165->QpidBrokerTestCase.runBare:113->QpidBrokerTestCase.setUp:585->QpidBrokerTestCase.startDefaultBroker:151->QpidBrokerTestCase.startDefaultBroker:156 » IO
TopicSessionTest>QpidTestCase.run:165->QpidBrokerTestCase.runBare:113->QpidBrokerTestCase.setUp:585->QpidBrokerTestCase.startDefaultBroker:151->QpidBrokerTestCase.startDefaultBroker:156 » IO
TopicSessionTest>QpidTestCase.run:165->QpidBrokerTestCase.runBare:113->QpidBrokerTestCase.setUp:585->QpidBrokerTestCase.startDefaultBroker:151->QpidBrokerTestCase.startDefaultBroker:156 » IO
TopicSessionTest>QpidTestCase.run:165->QpidBrokerTestCase.runBare:113->QpidBrokerTestCase.setUp:585->QpidBrokerTestCase.startDefaultBroker:151->QpidBrokerTestCase.startDefaultBroker:156 » IO
TopicSessionTest>QpidTestCase.run:165->QpidBrokerTestCase.runBare:113->QpidBrokerTestCase.setUp:585->QpidBrokerTestCase.startDefaultBroker:151->QpidBrokerTestCase.startDefaultBroker:156 » IO
TopicSessionTest>QpidTestCase.run:165->QpidBrokerTestCase.runBare:113->QpidBrokerTestCase.setUp:585->QpidBrokerTestCase.startDefaultBroker:151->QpidBrokerTestCase.startDefaultBroker:156 » IO
TopicSessionTest>QpidTestCase.run:165->QpidBrokerTestCase.runBare:113->QpidBrokerTestCase.setUp:585->QpidBrokerTestCase.startDefaultBroker:151->QpidBrokerTestCase.startDefaultBroker:156 » IO
TopicSessionTest>QpidTestCase.run:165->QpidBrokerTestCase.runBare:113->QpidBrokerTestCase.setUp:585->QpidBrokerTestCase.startDefaultBroker:151->QpidBrokerTestCase.startDefaultBroker:156 » IO
TopicSessionTest>QpidTestCase.run:165->QpidBrokerTestCase.runBare:113->QpidBrokerTestCase.setUp:585->QpidBrokerTestCase.startDefaultBroker:151->QpidBrokerTestCase.startDefaultBroker:156 » IO
TopicSubscriberTest>QpidTestCase.run:165->QpidBrokerTestCase.runBare:113->setUp:42->QpidBrokerTestCase.setUp:585->QpidBrokerTestCase.startDefaultBroker:151->QpidBrokerTestCase.startDefaultBroker:156 » IO
TopicSubscriberTest>QpidTestCase.run:165->QpidBrokerTestCase.runBare:113->setUp:42->QpidBrokerTestCase.setUp:585->QpidBrokerTestCase.startDefaultBroker:151->QpidBrokerTestCase.startDefaultBroker:156 » IO
TopicSubscriberTest>QpidTestCase.run:165->QpidBrokerTestCase.runBare:113->setUp:42->QpidBrokerTestCase.setUp:585->QpidBrokerTestCase.startDefaultBroker:151->QpidBrokerTestCase.startDefaultBroker:156 » IO
CommitRollbackTest>QpidTestCase.run:165->QpidBrokerTestCase.runBare:113->setUp:78->QpidBrokerTestCase.setUp:585->QpidBrokerTestCase.startDefaultBroker:151->QpidBrokerTestCase.startDefaultBroker:156 » IO
CommitRollbackTest>QpidTestCase.run:165->QpidBrokerTestCase.runBare:113->setUp:78->QpidBrokerTestCase.setUp:585->QpidBrokerTestCase.startDefaultBroker:151->QpidBrokerTestCase.startDefaultBroker:156 » IO
CommitRollbackTest>QpidTestCase.run:165->QpidBrokerTestCase.runBare:113->setUp:78->QpidBrokerTestCase.setUp:585->QpidBrokerTestCase.startDefaultBroker:151->QpidBrokerTestCase.startDefaultBroker:156 » IO
CommitRollbackTest>QpidTestCase.run:165->QpidBrokerTestCase.runBare:113->setUp:78->QpidBrokerTestCase.setUp:585->QpidBrokerTestCase.startDefaultBroker:151->QpidBrokerTestCase.startDefaultBroker:156 » IO
CommitRollbackTest>QpidTestCase.run:165->QpidBrokerTestCase.runBare:113->setUp:78->QpidBrokerTestCase.setUp:585->QpidBrokerTestCase.startDefaultBroker:151->QpidBrokerTestCase.startDefaultBroker:156 » IO
CommitRollbackTest>QpidTestCase.run:165->QpidBrokerTestCase.runBare:113->setUp:78->QpidBrokerTestCase.setUp:585->QpidBrokerTestCase.startDefaultBroker:151->QpidBrokerTestCase.startDefaultBroker:156 » IO
CommitRollbackTest>QpidTestCase.run:165->QpidBrokerTestCase.runBare:113->setUp:78->QpidBrokerTestCase.setUp:585->QpidBrokerTestCase.startDefaultBroker:151->QpidBrokerTestCase.startDefaultBroker:156 » IO
CommitRollbackTest>QpidTestCase.run:165->QpidBrokerTestCase.runBare:113->setUp:78->QpidBrokerTestCase.setUp:585->QpidBrokerTestCase.startDefaultBroker:151->QpidBrokerTestCase.startDefaultBroker:156 » IO
CommitRollbackTest>QpidTestCase.run:165->QpidBrokerTestCase.runBare:113->setUp:78->QpidBrokerTestCase.setUp:585->QpidBrokerTestCase.startDefaultBroker:151->QpidBrokerTestCase.startDefaultBroker:156 » IO
CommitRollbackTest>QpidTestCase.run:165->QpidBrokerTestCase.runBare:113->setUp:78->QpidBrokerTestCase.setUp:585->QpidBrokerTestCase.startDefaultBroker:151->QpidBrokerTestCase.startDefaultBroker:156 » IO
CommitRollbackTest>QpidTestCase.run:165->QpidBrokerTestCase.runBare:113->setUp:78->QpidBrokerTestCase.setUp:585->QpidBrokerTestCase.startDefaultBroker:151->QpidBrokerTestCase.startDefaultBroker:156 » IO
CommitRollbackTest>QpidTestCase.run:165->QpidBrokerTestCase.runBare:113->setUp:78->QpidBrokerTestCase.setUp:585->QpidBrokerTestCase.startDefaultBroker:151->QpidBrokerTestCase.startDefaultBroker:156 » IO
CommitRollbackTest>QpidTestCase.run:165->QpidBrokerTestCase.runBare:113->setUp:78->QpidBrokerTestCase.setUp:585->QpidBrokerTestCase.startDefaultBroker:151->QpidBrokerTestCase.startDefaultBroker:156 » IO
TransactedTest>QpidTestCase.run:165->QpidBrokerTestCase.runBare:113->setUp:110->QpidBrokerTestCase.startDefaultBroker:151->QpidBrokerTestCase.startDefaultBroker:156 » IO
TransactedTest>QpidTestCase.run:165->QpidBrokerTestCase.runBare:113->setUp:110->QpidBrokerTestCase.startDefaultBroker:151->QpidBrokerTestCase.startDefaultBroker:156 » IO
TransactedTest>QpidTestCase.run:165->QpidBrokerTestCase.runBare:113->setUp:110->QpidBrokerTestCase.startDefaultBroker:151->QpidBrokerTestCase.startDefaultBroker:156 » IO
TransactedTest>QpidTestCase.run:165->QpidBrokerTestCase.runBare:113->setUp:110->QpidBrokerTestCase.startDefaultBroker:151->QpidBrokerTestCase.startDefaultBroker:156 » IO
TransactedTest>QpidTestCase.run:165->QpidBrokerTestCase.runBare:113->setUp:110->QpidBrokerTestCase.startDefaultBroker:151->QpidBrokerTestCase.startDefaultBroker:156 » IO
TransactedTest>QpidTestCase.run:165->QpidBrokerTestCase.runBare:113->setUp:110->QpidBrokerTestCase.startDefaultBroker:151->QpidBrokerTestCase.startDefaultBroker:156 » IO
TransactedTest>QpidTestCase.run:165->QpidBrokerTestCase.runBare:113->setUp:110->QpidBrokerTestCase.startDefaultBroker:151->QpidBrokerTestCase.startDefaultBroker:156 » IO
SpawnedBrokerHolderTest>QpidTestCase.run:165->QpidBrokerTestCase.runBare:113->QpidTestCase.runTest:181->testRestartOnSamePort:33 » IO
ProtocolNegotiationTest>QpidTestCase.run:165->QpidBrokerTestCase.runBare:113->setUp:98->QpidBrokerTestCase.setUp:585->QpidBrokerTestCase.startDefaultBroker:151->QpidBrokerTestCase.startDefaultBroker:156 » IO
ProtocolNegotiationTest>QpidTestCase.run:165->QpidBrokerTestCase.runBare:113->setUp:98->QpidBrokerTestCase.setUp:585->QpidBrokerTestCase.startDefaultBroker:151->QpidBrokerTestCase.startDefaultBroker:156 » IO
ProtocolNegotiationTest>QpidTestCase.run:165->QpidBrokerTestCase.runBare:113->setUp:98->QpidBrokerTestCase.setUp:585->QpidBrokerTestCase.startDefaultBroker:151->QpidBrokerTestCase.startDefaultBroker:156 » IO
Tests run: 459, Failures: 0, Errors: 404, Skipped: 0
[INFO] ------------------------------------------------------------------------
[INFO] BUILD FAILURE
[INFO] ------------------------------------------------------------------------
[INFO] Total time: 25.164 s
[INFO] Finished at: 2017-11-29T13:58:40Z
[INFO] Final Memory: 45M/1410M
[INFO] ------------------------------------------------------------------------
[ERROR] Failed to execute goal org.apache.maven.plugins:maven-surefire-plugin:2.19.1:test (integration-test) on project qpid-systests: There are test failures.
[ERROR]
[ERROR] Please refer to <https://builds.apache.org/job/Qpid-cpp-JMS-AMQP-0-x-Test/4297/artifact/qpid-broker-j/systests/target/surefire-reports/cpp> for the individual test results.
[ERROR] -> [Help 1]
[ERROR]
[ERROR] To see the full stack trace of the errors, re-run Maven with the -e switch.
[ERROR] Re-run Maven using the -X switch to enable full debug logging.
[ERROR]
[ERROR] For more information about the errors and possible solutions, please read the following articles:
[ERROR] [Help 1] http://cwiki.apache.org/confluence/display/MAVEN/MojoFailureException
Build step 'Invoke top-level Maven targets' marked build as failure
[locks-and-latches] Releasing all the locks
[locks-and-latches] All the locks released
Archiving artifacts
Recording test results
Build failed in Jenkins: Qpid-cpp-JMS-AMQP-0-x-Test #4296
Posted by Apache Jenkins Server <je...@builds.apache.org>.
See <https://builds.apache.org/job/Qpid-cpp-JMS-AMQP-0-x-Test/4296/display/redirect?page=changes>
Changes:
[orudyy] QPID-6933: [System Tests] Prevent rat scanning of modules inside of
------------------------------------------
[...truncated 621.67 KB...]
Tests run: 2, Failures: 0, Errors: 0, Skipped: 0, Time elapsed: 5.541 sec - in org.apache.qpid.server.AbruptClientDisconnectTest
Running org.apache.qpid.server.persistent.NoLocalAfterRecoveryTest
Tests run: 2, Failures: 0, Errors: 0, Skipped: 0, Time elapsed: 0.001 sec - in org.apache.qpid.server.persistent.NoLocalAfterRecoveryTest
Running org.apache.qpid.server.store.PersistentStoreTest
Tests run: 5, Failures: 0, Errors: 0, Skipped: 0, Time elapsed: 0.134 sec - in org.apache.qpid.server.store.PersistentStoreTest
Running org.apache.qpid.server.store.SplitStoreTest
Tests run: 2, Failures: 0, Errors: 0, Skipped: 0, Time elapsed: 0.001 sec - in org.apache.qpid.server.store.SplitStoreTest
Running org.apache.qpid.server.queue.QueueDepthWithSelectorTest
Tests run: 1, Failures: 1, Errors: 0, Skipped: 0, Time elapsed: 0.167 sec <<< FAILURE! - in org.apache.qpid.server.queue.QueueDepthWithSelectorTest
test(org.apache.qpid.server.queue.QueueDepthWithSelectorTest) Time elapsed: 0.167 sec <<< FAILURE!
junit.framework.AssertionFailedError: Error creating producer
at org.apache.qpid.server.queue.QueueDepthWithSelectorTest.verifyBrokerState(QueueDepthWithSelectorTest.java:129)
at org.apache.qpid.server.queue.QueueDepthWithSelectorTest.test(QueueDepthWithSelectorTest.java:101)
Running org.apache.qpid.server.queue.ConsumerPriorityTest
Tests run: 0, Failures: 0, Errors: 0, Skipped: 0, Time elapsed: 0.001 sec - in org.apache.qpid.server.queue.ConsumerPriorityTest
Running org.apache.qpid.server.queue.MultipleTransactedBatchProducerTest
Tests run: 1, Failures: 0, Errors: 0, Skipped: 0, Time elapsed: 4.912 sec - in org.apache.qpid.server.queue.MultipleTransactedBatchProducerTest
Running org.apache.qpid.server.queue.LastValueQueueTest
Tests run: 7, Failures: 0, Errors: 1, Skipped: 0, Time elapsed: 12.028 sec <<< FAILURE! - in org.apache.qpid.server.queue.LastValueQueueTest
testConflatedQueueDepth(org.apache.qpid.server.queue.LastValueQueueTest) Time elapsed: 0.438 sec <<< ERROR!
javax.jms.JMSException: Error creating producer
at org.apache.qpid.server.queue.LastValueQueueTest.testConflatedQueueDepth(LastValueQueueTest.java:260)
Caused by: org.apache.qpid.QpidException: The name '$management' supplied in the address doesn't resolve to an exchange or a queue
at org.apache.qpid.server.queue.LastValueQueueTest.testConflatedQueueDepth(LastValueQueueTest.java:260)
Running org.apache.qpid.server.queue.PriorityQueueTest
Tests run: 3, Failures: 0, Errors: 0, Skipped: 0, Time elapsed: 1.327 sec - in org.apache.qpid.server.queue.PriorityQueueTest
Running org.apache.qpid.server.queue.ProducerFlowControlTest
Tests run: 7, Failures: 0, Errors: 0, Skipped: 0, Time elapsed: 0.006 sec - in org.apache.qpid.server.queue.ProducerFlowControlTest
Running org.apache.qpid.server.queue.LiveQueueOperationsTest
Tests run: 1, Failures: 0, Errors: 0, Skipped: 0, Time elapsed: 0.001 sec - in org.apache.qpid.server.queue.LiveQueueOperationsTest
Running org.apache.qpid.server.queue.SortedQueueTest
Tests run: 8, Failures: 0, Errors: 0, Skipped: 0, Time elapsed: 0.009 sec - in org.apache.qpid.server.queue.SortedQueueTest
Running org.apache.qpid.server.queue.MessageGroupQueueTest
Tests run: 11, Failures: 0, Errors: 0, Skipped: 0, Time elapsed: 6.158 sec - in org.apache.qpid.server.queue.MessageGroupQueueTest
Running org.apache.qpid.server.queue.EnsureNondestructiveConsumersTest
Tests run: 1, Failures: 0, Errors: 0, Skipped: 0, Time elapsed: 0.001 sec - in org.apache.qpid.server.queue.EnsureNondestructiveConsumersTest
Running org.apache.qpid.server.queue.QueueMessageDurabilityTest
Tests run: 4, Failures: 0, Errors: 0, Skipped: 0, Time elapsed: 0.04 sec - in org.apache.qpid.server.queue.QueueMessageDurabilityTest
Running org.apache.qpid.server.queue.ArrivalTimeFilterTest
Tests run: 2, Failures: 0, Errors: 0, Skipped: 0, Time elapsed: 0.001 sec - in org.apache.qpid.server.queue.ArrivalTimeFilterTest
Running org.apache.qpid.server.queue.ModelTest
Tests run: 4, Failures: 0, Errors: 0, Skipped: 0, Time elapsed: 0.002 sec - in org.apache.qpid.server.queue.ModelTest
Running org.apache.qpid.server.queue.FlowToDiskTest
Tests run: 1, Failures: 0, Errors: 0, Skipped: 0, Time elapsed: 0 sec - in org.apache.qpid.server.queue.FlowToDiskTest
Running org.apache.qpid.server.queue.TimeToLiveTest
Tests run: 5, Failures: 0, Errors: 0, Skipped: 0, Time elapsed: 2.103 sec - in org.apache.qpid.server.queue.TimeToLiveTest
Running org.apache.qpid.server.queue.NodeAutoCreationPolicyTest
Tests run: 9, Failures: 0, Errors: 0, Skipped: 0, Time elapsed: 0.006 sec - in org.apache.qpid.server.queue.NodeAutoCreationPolicyTest
Running org.apache.qpid.server.queue.QueueBindTest
Tests run: 2, Failures: 0, Errors: 0, Skipped: 0, Time elapsed: 0.075 sec - in org.apache.qpid.server.queue.QueueBindTest
Running org.apache.qpid.server.queue.DefaultFiltersTest
Tests run: 2, Failures: 0, Errors: 0, Skipped: 0, Time elapsed: 0.014 sec - in org.apache.qpid.server.queue.DefaultFiltersTest
Running org.apache.qpid.server.stats.StatisticsReportingTest
Tests run: 3, Failures: 0, Errors: 0, Skipped: 0, Time elapsed: 0.002 sec - in org.apache.qpid.server.stats.StatisticsReportingTest
Running org.apache.qpid.server.routing.AlternateBindingRoutingTest
Tests run: 1, Failures: 0, Errors: 0, Skipped: 0, Time elapsed: 0.001 sec - in org.apache.qpid.server.routing.AlternateBindingRoutingTest
Running org.apache.qpid.server.routing.ExchangeRoutingTest
Tests run: 3, Failures: 0, Errors: 0, Skipped: 0, Time elapsed: 0.002 sec - in org.apache.qpid.server.routing.ExchangeRoutingTest
Running org.apache.qpid.server.message.MessageProtocolConversionTest
Tests run: 2, Failures: 0, Errors: 0, Skipped: 0, Time elapsed: 0.001 sec - in org.apache.qpid.server.message.MessageProtocolConversionTest
Running org.apache.qpid.server.exchange.ReturnUnroutableMandatoryMessageTest
Tests run: 3, Failures: 0, Errors: 0, Skipped: 0, Time elapsed: 0.002 sec - in org.apache.qpid.server.exchange.ReturnUnroutableMandatoryMessageTest
Running org.apache.qpid.server.SupportedProtocolVersionsTest
Tests run: 4, Failures: 0, Errors: 0, Skipped: 0, Time elapsed: 0.003 sec - in org.apache.qpid.server.SupportedProtocolVersionsTest
Running org.apache.qpid.server.failover.FailoverMethodTest
Tests run: 3, Failures: 0, Errors: 0, Skipped: 0, Time elapsed: 0.002 sec - in org.apache.qpid.server.failover.FailoverMethodTest
Running org.apache.qpid.server.BrokerStartupTest
Tests run: 2, Failures: 0, Errors: 0, Skipped: 0, Time elapsed: 0.001 sec - in org.apache.qpid.server.BrokerStartupTest
Running org.apache.qpid.util.LogMonitorTest
Tests run: 8, Failures: 0, Errors: 0, Skipped: 0, Time elapsed: 2.017 sec - in org.apache.qpid.util.LogMonitorTest
Running org.apache.qpid.transport.ProtocolNegotiationTest
Tests run: 5, Failures: 0, Errors: 0, Skipped: 0, Time elapsed: 0.156 sec - in org.apache.qpid.transport.ProtocolNegotiationTest
Running org.apache.qpid.client.HeartbeatTest
Tests run: 8, Failures: 0, Errors: 0, Skipped: 0, Time elapsed: 14.747 sec - in org.apache.qpid.client.HeartbeatTest
Running org.apache.qpid.client.prefetch.PrefetchBehaviourTest
Tests run: 4, Failures: 0, Errors: 0, Skipped: 0, Time elapsed: 5.224 sec - in org.apache.qpid.client.prefetch.PrefetchBehaviourTest
Running org.apache.qpid.client.redelivered.RedeliveredMessageTest
Tests run: 1, Failures: 0, Errors: 0, Skipped: 0, Time elapsed: 0.095 sec - in org.apache.qpid.client.redelivered.RedeliveredMessageTest
Running org.apache.qpid.client.ssl.SSLTest
Tests run: 17, Failures: 0, Errors: 0, Skipped: 0, Time elapsed: 0.022 sec - in org.apache.qpid.client.ssl.SSLTest
Running org.apache.qpid.client.AsynchMessageListenerTest
Tests run: 9, Failures: 0, Errors: 0, Skipped: 0, Time elapsed: 1.123 sec - in org.apache.qpid.client.AsynchMessageListenerTest
Running org.apache.qpid.client.SynchReceiveTest
Tests run: 4, Failures: 0, Errors: 0, Skipped: 0, Time elapsed: 1.141 sec - in org.apache.qpid.client.SynchReceiveTest
Running org.apache.qpid.client.SyncPublishTest
Tests run: 1, Failures: 0, Errors: 0, Skipped: 0, Time elapsed: 0.001 sec - in org.apache.qpid.client.SyncPublishTest
Running org.apache.qpid.client.message.AMQPEncodedMapMessageTest
Tests run: 6, Failures: 0, Errors: 0, Skipped: 0, Time elapsed: 0.366 sec - in org.apache.qpid.client.message.AMQPEncodedMapMessageTest
Running org.apache.qpid.client.message.ObjectMessageClassWhitelistingTest
Tests run: 9, Failures: 0, Errors: 0, Skipped: 0, Time elapsed: 0.527 sec - in org.apache.qpid.client.message.ObjectMessageClassWhitelistingTest
Running org.apache.qpid.client.connection.ExistingSocketTest
Tests run: 2, Failures: 0, Errors: 0, Skipped: 0, Time elapsed: 0.159 sec - in org.apache.qpid.client.connection.ExistingSocketTest
Running org.apache.qpid.client.failover.FailoverBehaviourTest
Tests run: 37, Failures: 0, Errors: 0, Skipped: 0, Time elapsed: 45.892 sec - in org.apache.qpid.client.failover.FailoverBehaviourTest
Running org.apache.qpid.client.failover.AddressBasedFailoverBehaviourTest
Tests run: 37, Failures: 0, Errors: 0, Skipped: 0, Time elapsed: 45.376 sec - in org.apache.qpid.client.failover.AddressBasedFailoverBehaviourTest
Running org.apache.qpid.client.failover.MultipleBrokersFailoverTest
Tests run: 2, Failures: 0, Errors: 0, Skipped: 0, Time elapsed: 0.001 sec - in org.apache.qpid.client.failover.MultipleBrokersFailoverTest
Running org.apache.qpid.client.session.QueueDeclareTest
Tests run: 3, Failures: 0, Errors: 0, Skipped: 0, Time elapsed: 0.148 sec - in org.apache.qpid.client.session.QueueDeclareTest
Running org.apache.qpid.client.session.QueueDeleteTest
Tests run: 2, Failures: 0, Errors: 0, Skipped: 0, Time elapsed: 0.087 sec - in org.apache.qpid.client.session.QueueDeleteTest
Running org.apache.qpid.client.session.ExchangeDeleteTest
Tests run: 2, Failures: 0, Errors: 0, Skipped: 0, Time elapsed: 0.076 sec - in org.apache.qpid.client.session.ExchangeDeleteTest
Running org.apache.qpid.client.TemporaryQueuePrefixTest
Tests run: 4, Failures: 0, Errors: 0, Skipped: 0, Time elapsed: 0.002 sec - in org.apache.qpid.client.TemporaryQueuePrefixTest
Running org.apache.qpid.client.SessionCreateTest
Tests run: 1, Failures: 0, Errors: 0, Skipped: 0, Time elapsed: 55.741 sec - in org.apache.qpid.client.SessionCreateTest
Running org.apache.qpid.systest.keystore.FileKeyStoreTest
Tests run: 4, Failures: 0, Errors: 0, Skipped: 0, Time elapsed: 1.865 sec - in org.apache.qpid.systest.keystore.FileKeyStoreTest
Running org.apache.qpid.systest.MessageRoutingTest
Tests run: 7, Failures: 0, Errors: 0, Skipped: 0, Time elapsed: 0.003 sec - in org.apache.qpid.systest.MessageRoutingTest
Running org.apache.qpid.systest.MessageCompressionTest
Tests run: 10, Failures: 0, Errors: 0, Skipped: 0, Time elapsed: 0.006 sec - in org.apache.qpid.systest.MessageCompressionTest
Running org.apache.qpid.systest.prefetch.ZeroPrefetchTest
Tests run: 1, Failures: 0, Errors: 0, Skipped: 0, Time elapsed: 0.098 sec - in org.apache.qpid.systest.prefetch.ZeroPrefetchTest
Running org.apache.qpid.systest.management.amqp.AmqpManagementTest
Tests run: 18, Failures: 0, Errors: 0, Skipped: 0, Time elapsed: 0.011 sec - in org.apache.qpid.systest.management.amqp.AmqpManagementTest
Running org.apache.qpid.systest.AnonymousProducerTest
Tests run: 4, Failures: 0, Errors: 0, Skipped: 0, Time elapsed: 0.096 sec - in org.apache.qpid.systest.AnonymousProducerTest
Running org.apache.qpid.systest.rest.GroupProviderRestTest
Tests run: 10, Failures: 0, Errors: 0, Skipped: 0, Time elapsed: 0.006 sec - in org.apache.qpid.systest.rest.GroupProviderRestTest
Running org.apache.qpid.systest.rest.UserPreferencesRestTest
Tests run: 9, Failures: 0, Errors: 0, Skipped: 0, Time elapsed: 0.005 sec - in org.apache.qpid.systest.rest.UserPreferencesRestTest
Running org.apache.qpid.systest.rest.AnonymousAccessRestTest
Tests run: 4, Failures: 0, Errors: 0, Skipped: 0, Time elapsed: 0.002 sec - in org.apache.qpid.systest.rest.AnonymousAccessRestTest
Running org.apache.qpid.systest.rest.PublishMessageRestTest
Tests run: 6, Failures: 0, Errors: 0, Skipped: 0, Time elapsed: 0.003 sec - in org.apache.qpid.systest.rest.PublishMessageRestTest
Running org.apache.qpid.systest.rest.PreemtiveAuthRestTest
Tests run: 8, Failures: 0, Errors: 0, Skipped: 0, Time elapsed: 0.004 sec - in org.apache.qpid.systest.rest.PreemtiveAuthRestTest
Running org.apache.qpid.systest.rest.AccessControlProviderRestTest
Tests run: 4, Failures: 0, Errors: 0, Skipped: 0, Time elapsed: 0.002 sec - in org.apache.qpid.systest.rest.AccessControlProviderRestTest
Running org.apache.qpid.systest.rest.BrokerRestHttpsTest
Tests run: 1, Failures: 0, Errors: 0, Skipped: 0, Time elapsed: 0.001 sec - in org.apache.qpid.systest.rest.BrokerRestHttpsTest
Running org.apache.qpid.systest.rest.SaslRestTest
Tests run: 14, Failures: 0, Errors: 0, Skipped: 0, Time elapsed: 0.008 sec - in org.apache.qpid.systest.rest.SaslRestTest
Running org.apache.qpid.systest.rest.VirtualHostRestTest
Tests run: 28, Failures: 0, Errors: 0, Skipped: 0, Time elapsed: 0.018 sec - in org.apache.qpid.systest.rest.VirtualHostRestTest
Running org.apache.qpid.systest.rest.BrokerRestTest
Tests run: 6, Failures: 0, Errors: 0, Skipped: 0, Time elapsed: 0.002 sec - in org.apache.qpid.systest.rest.BrokerRestTest
Running org.apache.qpid.systest.rest.StructureRestTest
Tests run: 1, Failures: 0, Errors: 0, Skipped: 0, Time elapsed: 0.001 sec - in org.apache.qpid.systest.rest.StructureRestTest
Running org.apache.qpid.systest.rest.KeyStoreRestTest
Tests run: 5, Failures: 0, Errors: 0, Skipped: 0, Time elapsed: 0.002 sec - in org.apache.qpid.systest.rest.KeyStoreRestTest
Running org.apache.qpid.systest.rest.SessionRestTest
Tests run: 4, Failures: 0, Errors: 0, Skipped: 0, Time elapsed: 0.002 sec - in org.apache.qpid.systest.rest.SessionRestTest
Running org.apache.qpid.systest.rest.ConnectionRestTest
Tests run: 6, Failures: 0, Errors: 0, Skipped: 0, Time elapsed: 0.003 sec - in org.apache.qpid.systest.rest.ConnectionRestTest
Running org.apache.qpid.systest.rest.CompressedResponsesRestTest
Tests run: 4, Failures: 0, Errors: 0, Skipped: 0, Time elapsed: 0.002 sec - in org.apache.qpid.systest.rest.CompressedResponsesRestTest
Running org.apache.qpid.systest.rest.VirtualHostNodeRestTest
Tests run: 9, Failures: 0, Errors: 0, Skipped: 0, Time elapsed: 0.006 sec - in org.apache.qpid.systest.rest.VirtualHostNodeRestTest
Running org.apache.qpid.systest.rest.UserRestTest
Tests run: 7, Failures: 0, Errors: 0, Skipped: 0, Time elapsed: 0.002 sec - in org.apache.qpid.systest.rest.UserRestTest
Running org.apache.qpid.systest.rest.PortRestTest
Tests run: 12, Failures: 0, Errors: 0, Skipped: 0, Time elapsed: 0.049 sec - in org.apache.qpid.systest.rest.PortRestTest
Running org.apache.qpid.systest.rest.BrokerRestHttpsClientCertAuthTest
Tests run: 1, Failures: 0, Errors: 0, Skipped: 0, Time elapsed: 0.001 sec - in org.apache.qpid.systest.rest.BrokerRestHttpsClientCertAuthTest
Running org.apache.qpid.systest.rest.MessagesRestTest
Tests run: 14, Failures: 0, Errors: 0, Skipped: 0, Time elapsed: 0.007 sec - in org.apache.qpid.systest.rest.MessagesRestTest
Running org.apache.qpid.systest.rest.QueueRestTest
Tests run: 8, Failures: 0, Errors: 0, Skipped: 0, Time elapsed: 0.003 sec - in org.apache.qpid.systest.rest.QueueRestTest
Running org.apache.qpid.systest.rest.TrustStoreRestTest
Tests run: 5, Failures: 0, Errors: 0, Skipped: 0, Time elapsed: 0.002 sec - in org.apache.qpid.systest.rest.TrustStoreRestTest
Running org.apache.qpid.systest.rest.ExportImportMessagesRestTest
Tests run: 1, Failures: 0, Errors: 0, Skipped: 0, Time elapsed: 0 sec - in org.apache.qpid.systest.rest.ExportImportMessagesRestTest
Running org.apache.qpid.systest.rest.QueryRestTest
Tests run: 4, Failures: 0, Errors: 0, Skipped: 0, Time elapsed: 0.001 sec - in org.apache.qpid.systest.rest.QueryRestTest
Running org.apache.qpid.systest.rest.acl.BrokerACLTest
Tests run: 45, Failures: 0, Errors: 0, Skipped: 0, Time elapsed: 0.02 sec - in org.apache.qpid.systest.rest.acl.BrokerACLTest
Running org.apache.qpid.systest.rest.acl.ExchangeRestACLTest
Tests run: 9, Failures: 0, Errors: 0, Skipped: 0, Time elapsed: 0.003 sec - in org.apache.qpid.systest.rest.acl.ExchangeRestACLTest
Running org.apache.qpid.systest.rest.acl.VirtualHostNodeACLTest
Tests run: 3, Failures: 0, Errors: 0, Skipped: 0, Time elapsed: 0.001 sec - in org.apache.qpid.systest.rest.acl.VirtualHostNodeACLTest
Running org.apache.qpid.systest.rest.acl.UserRestACLTest
Tests run: 3, Failures: 0, Errors: 0, Skipped: 0, Time elapsed: 0.002 sec - in org.apache.qpid.systest.rest.acl.UserRestACLTest
Running org.apache.qpid.systest.rest.acl.VirtualHostACLTest
Tests run: 6, Failures: 0, Errors: 0, Skipped: 0, Time elapsed: 0.003 sec - in org.apache.qpid.systest.rest.acl.VirtualHostACLTest
Running org.apache.qpid.systest.rest.acl.GroupRestACLTest
Tests run: 4, Failures: 0, Errors: 0, Skipped: 0, Time elapsed: 0.002 sec - in org.apache.qpid.systest.rest.acl.GroupRestACLTest
Running org.apache.qpid.systest.rest.acl.VirtualHostAccessControlProviderRestTest
Tests run: 7, Failures: 0, Errors: 0, Skipped: 0, Time elapsed: 0.003 sec - in org.apache.qpid.systest.rest.acl.VirtualHostAccessControlProviderRestTest
Running org.apache.qpid.systest.rest.acl.QueueRestACLTest
Tests run: 7, Failures: 0, Errors: 0, Skipped: 0, Time elapsed: 0.003 sec - in org.apache.qpid.systest.rest.acl.QueueRestACLTest
Running org.apache.qpid.systest.rest.ExchangeRestTest
Tests run: 4, Failures: 0, Errors: 0, Skipped: 0, Time elapsed: 0.001 sec - in org.apache.qpid.systest.rest.ExchangeRestTest
Running org.apache.qpid.systest.rest.HttpManagementRestTest
Tests run: 3, Failures: 0, Errors: 0, Skipped: 0, Time elapsed: 0.001 sec - in org.apache.qpid.systest.rest.HttpManagementRestTest
Running org.apache.qpid.systest.rest.GroupRestTest
Tests run: 5, Failures: 0, Errors: 0, Skipped: 0, Time elapsed: 0.002 sec - in org.apache.qpid.systest.rest.GroupRestTest
Running org.apache.qpid.systest.rest.AuthenticationProviderRestTest
Tests run: 9, Failures: 0, Errors: 0, Skipped: 0, Time elapsed: 0.004 sec - in org.apache.qpid.systest.rest.AuthenticationProviderRestTest
Running org.apache.qpid.systest.rest.BrokerRestHttpAndHttpsTest
Tests run: 4, Failures: 0, Errors: 0, Skipped: 0, Time elapsed: 0.001 sec - in org.apache.qpid.systest.rest.BrokerRestHttpAndHttpsTest
Running org.apache.qpid.systest.rest.VirtualHostLoggerRestTest
Tests run: 2, Failures: 0, Errors: 0, Skipped: 0, Time elapsed: 0.001 sec - in org.apache.qpid.systest.rest.VirtualHostLoggerRestTest
Running org.apache.qpid.systest.messageencryption.MessageEncryptionTest
Tests run: 8, Failures: 0, Errors: 0, Skipped: 0, Time elapsed: 0.11 sec - in org.apache.qpid.systest.messageencryption.MessageEncryptionTest
Results :
Failed tests:
QueueDepthWithSelectorTest>QpidTestCase.run:165->QpidBrokerTestCase.runBare:113->QpidTestCase.runTest:181->test:101->verifyBrokerState:129 Error creating producer
Tests in error:
LastValueQueueTest>QpidTestCase.run:165->QpidBrokerTestCase.runBare:113->QpidTestCase.runTest:181->testConflatedQueueDepth:260->QpidBrokerTestCase.getQueueDepth:388 » JMS
Acknowledge2ConsumersTest>QpidTestCase.run:165->QpidBrokerTestCase.runBare:113->QpidTestCase.runTest:181->test2ConsumersAutoAck:130->test2ConsumersAcking:106->QpidBrokerTestCase.getQueueDepth:388 » JMS
Acknowledge2ConsumersTest>QpidTestCase.run:165->QpidBrokerTestCase.runBare:113->QpidTestCase.runTest:181->test2ConsumersClientAck:135->test2ConsumersAcking:106->QpidBrokerTestCase.getQueueDepth:388 » JMS
Acknowledge2ConsumersTest>QpidTestCase.run:165->QpidBrokerTestCase.runBare:113->QpidTestCase.runTest:181->test2ConsumersTx:140->test2ConsumersAcking:106->QpidBrokerTestCase.getQueueDepth:388 » JMS
AcknowledgeOnMessageTest>QpidTestCase.run:165->QpidBrokerTestCase.runBare:113->QpidTestCase.runTest:181->AcknowledgeTest.testAutoAck:159->testAcking:91->init:65->AcknowledgeTest.init:75->QpidBrokerTestCase.getQueueDepth:388 » JMS
AcknowledgeOnMessageTest>QpidTestCase.run:165->QpidBrokerTestCase.runBare:113->QpidTestCase.runTest:181->AcknowledgeTest.testClientAck:154->testAcking:91->init:65->AcknowledgeTest.init:75->QpidBrokerTestCase.getQueueDepth:388 » JMS
AcknowledgeOnMessageTest>QpidTestCase.run:165->QpidBrokerTestCase.runBare:113->QpidTestCase.runTest:181->AcknowledgeTest.testDupsOk:169->testAcking:91->init:65->AcknowledgeTest.init:75->QpidBrokerTestCase.getQueueDepth:388 » JMS
AcknowledgeOnMessageTest>QpidTestCase.run:165->QpidBrokerTestCase.runBare:113->QpidTestCase.runTest:181->AcknowledgeTest.testNoAck:174->testAcking:91->init:65->AcknowledgeTest.init:75->QpidBrokerTestCase.getQueueDepth:388 » JMS
AcknowledgeOnMessageTest>QpidTestCase.run:165->QpidBrokerTestCase.runBare:113->QpidTestCase.runTest:181->AcknowledgeTest.testPreAck:179->testAcking:91->init:65->AcknowledgeTest.init:75->QpidBrokerTestCase.getQueueDepth:388 » JMS
AcknowledgeOnMessageTest>QpidTestCase.run:165->QpidBrokerTestCase.runBare:113->QpidTestCase.runTest:181->AcknowledgeTest.testTransacted:164->testAcking:91->init:65->AcknowledgeTest.init:75->QpidBrokerTestCase.getQueueDepth:388 » JMS
AcknowledgeTest>QpidTestCase.run:165->QpidBrokerTestCase.runBare:113->QpidTestCase.runTest:181->testAutoAck:159->testAcking:97->init:75->QpidBrokerTestCase.getQueueDepth:388 » JMS
AcknowledgeTest>QpidTestCase.run:165->QpidBrokerTestCase.runBare:113->QpidTestCase.runTest:181->testClientAck:154->testAcking:97->init:75->QpidBrokerTestCase.getQueueDepth:388 » JMS
AcknowledgeTest>QpidTestCase.run:165->QpidBrokerTestCase.runBare:113->QpidTestCase.runTest:181->testDupsOk:169->testAcking:97->init:75->QpidBrokerTestCase.getQueueDepth:388 » JMS
AcknowledgeTest>QpidTestCase.run:165->QpidBrokerTestCase.runBare:113->QpidTestCase.runTest:181->testNoAck:174->testAcking:97->init:75->QpidBrokerTestCase.getQueueDepth:388 » JMS
AcknowledgeTest>QpidTestCase.run:165->QpidBrokerTestCase.runBare:113->QpidTestCase.runTest:181->testPreAck:179->testAcking:97->init:75->QpidBrokerTestCase.getQueueDepth:388 » JMS
AcknowledgeTest>QpidTestCase.run:165->QpidBrokerTestCase.runBare:113->QpidTestCase.runTest:181->testTransacted:164->testAcking:97->init:75->QpidBrokerTestCase.getQueueDepth:388 » JMS
UTF8Test>QpidTestCase.run:165->QpidBrokerTestCase.runBare:113->QpidTestCase.runTest:181->testPlainEn:50->invoke:64->runTest:73->getReceivingDestination:93->createEntitiesUsingAmqpManagement:124->QpidBrokerTestCase.createEntityUsingAmqpManagement:339 » JMS
UTF8Test>QpidTestCase.run:165->QpidBrokerTestCase.runBare:113->QpidTestCase.runTest:181->testUTF8Jp:56->invoke:64->runTest:73->getReceivingDestination:93->createEntitiesUsingAmqpManagement:124->QpidBrokerTestCase.createEntityUsingAmqpManagement:339 » JMS
Tests run: 1034, Failures: 1, Errors: 18, Skipped: 0
[INFO] ------------------------------------------------------------------------
[INFO] BUILD FAILURE
[INFO] ------------------------------------------------------------------------
[INFO] Total time: 05:36 min
[INFO] Finished at: 2017-11-29T11:13:43Z
[INFO] Final Memory: 51M/2404M
[INFO] ------------------------------------------------------------------------
[ERROR] Failed to execute goal org.apache.maven.plugins:maven-surefire-plugin:2.19.1:test (integration-test) on project qpid-systests: There are test failures.
[ERROR]
[ERROR] Please refer to <https://builds.apache.org/job/Qpid-cpp-JMS-AMQP-0-x-Test/4296/artifact/qpid-broker-j/systests/target/surefire-reports/cpp> for the individual test results.
[ERROR] -> [Help 1]
[ERROR]
[ERROR] To see the full stack trace of the errors, re-run Maven with the -e switch.
[ERROR] Re-run Maven using the -X switch to enable full debug logging.
[ERROR]
[ERROR] For more information about the errors and possible solutions, please read the following articles:
[ERROR] [Help 1] http://cwiki.apache.org/confluence/display/MAVEN/MojoFailureException
Build step 'Invoke top-level Maven targets' marked build as failure
[locks-and-latches] Releasing all the locks
[locks-and-latches] All the locks released
Archiving artifacts
Recording test results
Build failed in Jenkins: Qpid-cpp-JMS-AMQP-0-x-Test #4295
Posted by Apache Jenkins Server <je...@builds.apache.org>.
See <https://builds.apache.org/job/Qpid-cpp-JMS-AMQP-0-x-Test/4295/display/redirect?page=changes>
Changes:
[keith.wall] QPID-8038: [Broker-J][AMQP 1.0] Add 0-8/9/91 queue protocol tests
[orudyy] QPID-6933: [System Tests] Move JMS common test functionality into a
------------------------------------------
[...truncated 621.62 KB...]
Tests run: 2, Failures: 0, Errors: 0, Skipped: 0, Time elapsed: 5.565 sec - in org.apache.qpid.server.AbruptClientDisconnectTest
Running org.apache.qpid.server.persistent.NoLocalAfterRecoveryTest
Tests run: 2, Failures: 0, Errors: 0, Skipped: 0, Time elapsed: 0.001 sec - in org.apache.qpid.server.persistent.NoLocalAfterRecoveryTest
Running org.apache.qpid.server.store.PersistentStoreTest
Tests run: 5, Failures: 0, Errors: 0, Skipped: 0, Time elapsed: 0.003 sec - in org.apache.qpid.server.store.PersistentStoreTest
Running org.apache.qpid.server.store.SplitStoreTest
Tests run: 2, Failures: 0, Errors: 0, Skipped: 0, Time elapsed: 0.001 sec - in org.apache.qpid.server.store.SplitStoreTest
Running org.apache.qpid.server.queue.QueueDepthWithSelectorTest
Tests run: 1, Failures: 1, Errors: 0, Skipped: 0, Time elapsed: 0.166 sec <<< FAILURE! - in org.apache.qpid.server.queue.QueueDepthWithSelectorTest
test(org.apache.qpid.server.queue.QueueDepthWithSelectorTest) Time elapsed: 0.166 sec <<< FAILURE!
junit.framework.AssertionFailedError: Error creating producer
at org.apache.qpid.server.queue.QueueDepthWithSelectorTest.verifyBrokerState(QueueDepthWithSelectorTest.java:129)
at org.apache.qpid.server.queue.QueueDepthWithSelectorTest.test(QueueDepthWithSelectorTest.java:101)
Running org.apache.qpid.server.queue.ConsumerPriorityTest
Tests run: 0, Failures: 0, Errors: 0, Skipped: 0, Time elapsed: 0.004 sec - in org.apache.qpid.server.queue.ConsumerPriorityTest
Running org.apache.qpid.server.queue.MultipleTransactedBatchProducerTest
Tests run: 1, Failures: 0, Errors: 0, Skipped: 0, Time elapsed: 5.567 sec - in org.apache.qpid.server.queue.MultipleTransactedBatchProducerTest
Running org.apache.qpid.server.queue.LastValueQueueTest
Tests run: 7, Failures: 0, Errors: 1, Skipped: 0, Time elapsed: 13.555 sec <<< FAILURE! - in org.apache.qpid.server.queue.LastValueQueueTest
testConflatedQueueDepth(org.apache.qpid.server.queue.LastValueQueueTest) Time elapsed: 0.573 sec <<< ERROR!
javax.jms.JMSException: Error creating producer
at org.apache.qpid.server.queue.LastValueQueueTest.testConflatedQueueDepth(LastValueQueueTest.java:260)
Caused by: org.apache.qpid.QpidException: The name '$management' supplied in the address doesn't resolve to an exchange or a queue
at org.apache.qpid.server.queue.LastValueQueueTest.testConflatedQueueDepth(LastValueQueueTest.java:260)
Running org.apache.qpid.server.queue.PriorityQueueTest
Tests run: 3, Failures: 0, Errors: 0, Skipped: 0, Time elapsed: 1.304 sec - in org.apache.qpid.server.queue.PriorityQueueTest
Running org.apache.qpid.server.queue.ProducerFlowControlTest
Tests run: 7, Failures: 0, Errors: 0, Skipped: 0, Time elapsed: 0.006 sec - in org.apache.qpid.server.queue.ProducerFlowControlTest
Running org.apache.qpid.server.queue.LiveQueueOperationsTest
Tests run: 1, Failures: 0, Errors: 0, Skipped: 0, Time elapsed: 0.002 sec - in org.apache.qpid.server.queue.LiveQueueOperationsTest
Running org.apache.qpid.server.queue.SortedQueueTest
Tests run: 8, Failures: 0, Errors: 0, Skipped: 0, Time elapsed: 0.01 sec - in org.apache.qpid.server.queue.SortedQueueTest
Running org.apache.qpid.server.queue.MessageGroupQueueTest
Tests run: 11, Failures: 0, Errors: 0, Skipped: 0, Time elapsed: 6.282 sec - in org.apache.qpid.server.queue.MessageGroupQueueTest
Running org.apache.qpid.server.queue.EnsureNondestructiveConsumersTest
Tests run: 1, Failures: 0, Errors: 0, Skipped: 0, Time elapsed: 0.001 sec - in org.apache.qpid.server.queue.EnsureNondestructiveConsumersTest
Running org.apache.qpid.server.queue.QueueMessageDurabilityTest
Tests run: 4, Failures: 0, Errors: 0, Skipped: 0, Time elapsed: 0.005 sec - in org.apache.qpid.server.queue.QueueMessageDurabilityTest
Running org.apache.qpid.server.queue.ArrivalTimeFilterTest
Tests run: 2, Failures: 0, Errors: 0, Skipped: 0, Time elapsed: 0.002 sec - in org.apache.qpid.server.queue.ArrivalTimeFilterTest
Running org.apache.qpid.server.queue.ModelTest
Tests run: 4, Failures: 0, Errors: 0, Skipped: 0, Time elapsed: 0.003 sec - in org.apache.qpid.server.queue.ModelTest
Running org.apache.qpid.server.queue.FlowToDiskTest
Tests run: 1, Failures: 0, Errors: 0, Skipped: 0, Time elapsed: 0 sec - in org.apache.qpid.server.queue.FlowToDiskTest
Running org.apache.qpid.server.queue.TimeToLiveTest
Tests run: 5, Failures: 0, Errors: 0, Skipped: 0, Time elapsed: 2.196 sec - in org.apache.qpid.server.queue.TimeToLiveTest
Running org.apache.qpid.server.queue.NodeAutoCreationPolicyTest
Tests run: 9, Failures: 0, Errors: 0, Skipped: 0, Time elapsed: 0.007 sec - in org.apache.qpid.server.queue.NodeAutoCreationPolicyTest
Running org.apache.qpid.server.queue.QueueBindTest
Tests run: 2, Failures: 0, Errors: 0, Skipped: 0, Time elapsed: 0.093 sec - in org.apache.qpid.server.queue.QueueBindTest
Running org.apache.qpid.server.queue.DefaultFiltersTest
Tests run: 2, Failures: 0, Errors: 0, Skipped: 0, Time elapsed: 0.001 sec - in org.apache.qpid.server.queue.DefaultFiltersTest
Running org.apache.qpid.server.stats.StatisticsReportingTest
Tests run: 3, Failures: 0, Errors: 0, Skipped: 0, Time elapsed: 0.001 sec - in org.apache.qpid.server.stats.StatisticsReportingTest
Running org.apache.qpid.server.routing.AlternateBindingRoutingTest
Tests run: 1, Failures: 0, Errors: 0, Skipped: 0, Time elapsed: 0 sec - in org.apache.qpid.server.routing.AlternateBindingRoutingTest
Running org.apache.qpid.server.routing.ExchangeRoutingTest
Tests run: 3, Failures: 0, Errors: 0, Skipped: 0, Time elapsed: 0.002 sec - in org.apache.qpid.server.routing.ExchangeRoutingTest
Running org.apache.qpid.server.message.MessageProtocolConversionTest
Tests run: 2, Failures: 0, Errors: 0, Skipped: 0, Time elapsed: 0.002 sec - in org.apache.qpid.server.message.MessageProtocolConversionTest
Running org.apache.qpid.server.exchange.ReturnUnroutableMandatoryMessageTest
Tests run: 3, Failures: 0, Errors: 0, Skipped: 0, Time elapsed: 0.002 sec - in org.apache.qpid.server.exchange.ReturnUnroutableMandatoryMessageTest
Running org.apache.qpid.server.SupportedProtocolVersionsTest
Tests run: 4, Failures: 0, Errors: 0, Skipped: 0, Time elapsed: 0.003 sec - in org.apache.qpid.server.SupportedProtocolVersionsTest
Running org.apache.qpid.server.failover.FailoverMethodTest
Tests run: 3, Failures: 0, Errors: 0, Skipped: 0, Time elapsed: 0.002 sec - in org.apache.qpid.server.failover.FailoverMethodTest
Running org.apache.qpid.server.BrokerStartupTest
Tests run: 2, Failures: 0, Errors: 0, Skipped: 0, Time elapsed: 0.001 sec - in org.apache.qpid.server.BrokerStartupTest
Running org.apache.qpid.util.LogMonitorTest
Tests run: 8, Failures: 0, Errors: 0, Skipped: 0, Time elapsed: 2.019 sec - in org.apache.qpid.util.LogMonitorTest
Running org.apache.qpid.transport.ProtocolNegotiationTest
Tests run: 5, Failures: 0, Errors: 0, Skipped: 0, Time elapsed: 0.19 sec - in org.apache.qpid.transport.ProtocolNegotiationTest
Running org.apache.qpid.client.HeartbeatTest
Tests run: 8, Failures: 0, Errors: 0, Skipped: 0, Time elapsed: 14.467 sec - in org.apache.qpid.client.HeartbeatTest
Running org.apache.qpid.client.prefetch.PrefetchBehaviourTest
Tests run: 4, Failures: 0, Errors: 0, Skipped: 0, Time elapsed: 5.3 sec - in org.apache.qpid.client.prefetch.PrefetchBehaviourTest
Running org.apache.qpid.client.redelivered.RedeliveredMessageTest
Tests run: 1, Failures: 0, Errors: 0, Skipped: 0, Time elapsed: 0.086 sec - in org.apache.qpid.client.redelivered.RedeliveredMessageTest
Running org.apache.qpid.client.ssl.SSLTest
Tests run: 17, Failures: 0, Errors: 0, Skipped: 0, Time elapsed: 0.025 sec - in org.apache.qpid.client.ssl.SSLTest
Running org.apache.qpid.client.AsynchMessageListenerTest
Tests run: 9, Failures: 0, Errors: 0, Skipped: 0, Time elapsed: 1.263 sec - in org.apache.qpid.client.AsynchMessageListenerTest
Running org.apache.qpid.client.SynchReceiveTest
Tests run: 4, Failures: 0, Errors: 0, Skipped: 0, Time elapsed: 1.271 sec - in org.apache.qpid.client.SynchReceiveTest
Running org.apache.qpid.client.SyncPublishTest
Tests run: 1, Failures: 0, Errors: 0, Skipped: 0, Time elapsed: 0.001 sec - in org.apache.qpid.client.SyncPublishTest
Running org.apache.qpid.client.message.AMQPEncodedMapMessageTest
Tests run: 6, Failures: 0, Errors: 0, Skipped: 0, Time elapsed: 0.503 sec - in org.apache.qpid.client.message.AMQPEncodedMapMessageTest
Running org.apache.qpid.client.message.ObjectMessageClassWhitelistingTest
Tests run: 9, Failures: 0, Errors: 0, Skipped: 0, Time elapsed: 0.792 sec - in org.apache.qpid.client.message.ObjectMessageClassWhitelistingTest
Running org.apache.qpid.client.connection.ExistingSocketTest
Tests run: 2, Failures: 0, Errors: 0, Skipped: 0, Time elapsed: 0.262 sec - in org.apache.qpid.client.connection.ExistingSocketTest
Running org.apache.qpid.client.failover.FailoverBehaviourTest
Tests run: 37, Failures: 0, Errors: 0, Skipped: 0, Time elapsed: 46.199 sec - in org.apache.qpid.client.failover.FailoverBehaviourTest
Running org.apache.qpid.client.failover.AddressBasedFailoverBehaviourTest
Tests run: 37, Failures: 0, Errors: 0, Skipped: 0, Time elapsed: 45.193 sec - in org.apache.qpid.client.failover.AddressBasedFailoverBehaviourTest
Running org.apache.qpid.client.failover.MultipleBrokersFailoverTest
Tests run: 2, Failures: 0, Errors: 0, Skipped: 0, Time elapsed: 0.001 sec - in org.apache.qpid.client.failover.MultipleBrokersFailoverTest
Running org.apache.qpid.client.session.QueueDeclareTest
Tests run: 3, Failures: 0, Errors: 0, Skipped: 0, Time elapsed: 0.252 sec - in org.apache.qpid.client.session.QueueDeclareTest
Running org.apache.qpid.client.session.QueueDeleteTest
Tests run: 2, Failures: 0, Errors: 0, Skipped: 0, Time elapsed: 0.127 sec - in org.apache.qpid.client.session.QueueDeleteTest
Running org.apache.qpid.client.session.ExchangeDeleteTest
Tests run: 2, Failures: 0, Errors: 0, Skipped: 0, Time elapsed: 0.098 sec - in org.apache.qpid.client.session.ExchangeDeleteTest
Running org.apache.qpid.client.TemporaryQueuePrefixTest
Tests run: 4, Failures: 0, Errors: 0, Skipped: 0, Time elapsed: 0.002 sec - in org.apache.qpid.client.TemporaryQueuePrefixTest
Running org.apache.qpid.client.SessionCreateTest
Tests run: 1, Failures: 0, Errors: 0, Skipped: 0, Time elapsed: 64.576 sec - in org.apache.qpid.client.SessionCreateTest
Running org.apache.qpid.systest.keystore.FileKeyStoreTest
Tests run: 4, Failures: 0, Errors: 0, Skipped: 0, Time elapsed: 2.26 sec - in org.apache.qpid.systest.keystore.FileKeyStoreTest
Running org.apache.qpid.systest.MessageRoutingTest
Tests run: 7, Failures: 0, Errors: 0, Skipped: 0, Time elapsed: 0.004 sec - in org.apache.qpid.systest.MessageRoutingTest
Running org.apache.qpid.systest.MessageCompressionTest
Tests run: 10, Failures: 0, Errors: 0, Skipped: 0, Time elapsed: 0.006 sec - in org.apache.qpid.systest.MessageCompressionTest
Running org.apache.qpid.systest.prefetch.ZeroPrefetchTest
Tests run: 1, Failures: 0, Errors: 0, Skipped: 0, Time elapsed: 0.101 sec - in org.apache.qpid.systest.prefetch.ZeroPrefetchTest
Running org.apache.qpid.systest.management.amqp.AmqpManagementTest
Tests run: 18, Failures: 0, Errors: 0, Skipped: 0, Time elapsed: 0.017 sec - in org.apache.qpid.systest.management.amqp.AmqpManagementTest
Running org.apache.qpid.systest.AnonymousProducerTest
Tests run: 4, Failures: 0, Errors: 0, Skipped: 0, Time elapsed: 0.133 sec - in org.apache.qpid.systest.AnonymousProducerTest
Running org.apache.qpid.systest.rest.GroupProviderRestTest
Tests run: 10, Failures: 0, Errors: 0, Skipped: 0, Time elapsed: 0.01 sec - in org.apache.qpid.systest.rest.GroupProviderRestTest
Running org.apache.qpid.systest.rest.UserPreferencesRestTest
Tests run: 9, Failures: 0, Errors: 0, Skipped: 0, Time elapsed: 0.009 sec - in org.apache.qpid.systest.rest.UserPreferencesRestTest
Running org.apache.qpid.systest.rest.AnonymousAccessRestTest
Tests run: 4, Failures: 0, Errors: 0, Skipped: 0, Time elapsed: 0.002 sec - in org.apache.qpid.systest.rest.AnonymousAccessRestTest
Running org.apache.qpid.systest.rest.PublishMessageRestTest
Tests run: 6, Failures: 0, Errors: 0, Skipped: 0, Time elapsed: 0.005 sec - in org.apache.qpid.systest.rest.PublishMessageRestTest
Running org.apache.qpid.systest.rest.PreemtiveAuthRestTest
Tests run: 8, Failures: 0, Errors: 0, Skipped: 0, Time elapsed: 0.005 sec - in org.apache.qpid.systest.rest.PreemtiveAuthRestTest
Running org.apache.qpid.systest.rest.AccessControlProviderRestTest
Tests run: 4, Failures: 0, Errors: 0, Skipped: 0, Time elapsed: 0.002 sec - in org.apache.qpid.systest.rest.AccessControlProviderRestTest
Running org.apache.qpid.systest.rest.BrokerRestHttpsTest
Tests run: 1, Failures: 0, Errors: 0, Skipped: 0, Time elapsed: 0 sec - in org.apache.qpid.systest.rest.BrokerRestHttpsTest
Running org.apache.qpid.systest.rest.SaslRestTest
Tests run: 14, Failures: 0, Errors: 0, Skipped: 0, Time elapsed: 0.009 sec - in org.apache.qpid.systest.rest.SaslRestTest
Running org.apache.qpid.systest.rest.VirtualHostRestTest
Tests run: 28, Failures: 0, Errors: 0, Skipped: 0, Time elapsed: 0.03 sec - in org.apache.qpid.systest.rest.VirtualHostRestTest
Running org.apache.qpid.systest.rest.BrokerRestTest
Tests run: 6, Failures: 0, Errors: 0, Skipped: 0, Time elapsed: 0.004 sec - in org.apache.qpid.systest.rest.BrokerRestTest
Running org.apache.qpid.systest.rest.StructureRestTest
Tests run: 1, Failures: 0, Errors: 0, Skipped: 0, Time elapsed: 0.001 sec - in org.apache.qpid.systest.rest.StructureRestTest
Running org.apache.qpid.systest.rest.KeyStoreRestTest
Tests run: 5, Failures: 0, Errors: 0, Skipped: 0, Time elapsed: 0.005 sec - in org.apache.qpid.systest.rest.KeyStoreRestTest
Running org.apache.qpid.systest.rest.SessionRestTest
Tests run: 4, Failures: 0, Errors: 0, Skipped: 0, Time elapsed: 0.003 sec - in org.apache.qpid.systest.rest.SessionRestTest
Running org.apache.qpid.systest.rest.ConnectionRestTest
Tests run: 6, Failures: 0, Errors: 0, Skipped: 0, Time elapsed: 0.005 sec - in org.apache.qpid.systest.rest.ConnectionRestTest
Running org.apache.qpid.systest.rest.CompressedResponsesRestTest
Tests run: 4, Failures: 0, Errors: 0, Skipped: 0, Time elapsed: 0.002 sec - in org.apache.qpid.systest.rest.CompressedResponsesRestTest
Running org.apache.qpid.systest.rest.VirtualHostNodeRestTest
Tests run: 9, Failures: 0, Errors: 0, Skipped: 0, Time elapsed: 0.006 sec - in org.apache.qpid.systest.rest.VirtualHostNodeRestTest
Running org.apache.qpid.systest.rest.UserRestTest
Tests run: 7, Failures: 0, Errors: 0, Skipped: 0, Time elapsed: 0.003 sec - in org.apache.qpid.systest.rest.UserRestTest
Running org.apache.qpid.systest.rest.PortRestTest
Tests run: 12, Failures: 0, Errors: 0, Skipped: 0, Time elapsed: 0.042 sec - in org.apache.qpid.systest.rest.PortRestTest
Running org.apache.qpid.systest.rest.BrokerRestHttpsClientCertAuthTest
Tests run: 1, Failures: 0, Errors: 0, Skipped: 0, Time elapsed: 0.001 sec - in org.apache.qpid.systest.rest.BrokerRestHttpsClientCertAuthTest
Running org.apache.qpid.systest.rest.MessagesRestTest
Tests run: 14, Failures: 0, Errors: 0, Skipped: 0, Time elapsed: 0.009 sec - in org.apache.qpid.systest.rest.MessagesRestTest
Running org.apache.qpid.systest.rest.QueueRestTest
Tests run: 8, Failures: 0, Errors: 0, Skipped: 0, Time elapsed: 0.004 sec - in org.apache.qpid.systest.rest.QueueRestTest
Running org.apache.qpid.systest.rest.TrustStoreRestTest
Tests run: 5, Failures: 0, Errors: 0, Skipped: 0, Time elapsed: 0.002 sec - in org.apache.qpid.systest.rest.TrustStoreRestTest
Running org.apache.qpid.systest.rest.ExportImportMessagesRestTest
Tests run: 1, Failures: 0, Errors: 0, Skipped: 0, Time elapsed: 0 sec - in org.apache.qpid.systest.rest.ExportImportMessagesRestTest
Running org.apache.qpid.systest.rest.QueryRestTest
Tests run: 4, Failures: 0, Errors: 0, Skipped: 0, Time elapsed: 0.002 sec - in org.apache.qpid.systest.rest.QueryRestTest
Running org.apache.qpid.systest.rest.acl.BrokerACLTest
Tests run: 45, Failures: 0, Errors: 0, Skipped: 0, Time elapsed: 0.03 sec - in org.apache.qpid.systest.rest.acl.BrokerACLTest
Running org.apache.qpid.systest.rest.acl.ExchangeRestACLTest
Tests run: 9, Failures: 0, Errors: 0, Skipped: 0, Time elapsed: 0.009 sec - in org.apache.qpid.systest.rest.acl.ExchangeRestACLTest
Running org.apache.qpid.systest.rest.acl.VirtualHostNodeACLTest
Tests run: 3, Failures: 0, Errors: 0, Skipped: 0, Time elapsed: 0.002 sec - in org.apache.qpid.systest.rest.acl.VirtualHostNodeACLTest
Running org.apache.qpid.systest.rest.acl.UserRestACLTest
Tests run: 3, Failures: 0, Errors: 0, Skipped: 0, Time elapsed: 0.003 sec - in org.apache.qpid.systest.rest.acl.UserRestACLTest
Running org.apache.qpid.systest.rest.acl.VirtualHostACLTest
Tests run: 6, Failures: 0, Errors: 0, Skipped: 0, Time elapsed: 0.005 sec - in org.apache.qpid.systest.rest.acl.VirtualHostACLTest
Running org.apache.qpid.systest.rest.acl.GroupRestACLTest
Tests run: 4, Failures: 0, Errors: 0, Skipped: 0, Time elapsed: 0.004 sec - in org.apache.qpid.systest.rest.acl.GroupRestACLTest
Running org.apache.qpid.systest.rest.acl.VirtualHostAccessControlProviderRestTest
Tests run: 7, Failures: 0, Errors: 0, Skipped: 0, Time elapsed: 0.005 sec - in org.apache.qpid.systest.rest.acl.VirtualHostAccessControlProviderRestTest
Running org.apache.qpid.systest.rest.acl.QueueRestACLTest
Tests run: 7, Failures: 0, Errors: 0, Skipped: 0, Time elapsed: 0.005 sec - in org.apache.qpid.systest.rest.acl.QueueRestACLTest
Running org.apache.qpid.systest.rest.ExchangeRestTest
Tests run: 4, Failures: 0, Errors: 0, Skipped: 0, Time elapsed: 0.003 sec - in org.apache.qpid.systest.rest.ExchangeRestTest
Running org.apache.qpid.systest.rest.HttpManagementRestTest
Tests run: 3, Failures: 0, Errors: 0, Skipped: 0, Time elapsed: 0.002 sec - in org.apache.qpid.systest.rest.HttpManagementRestTest
Running org.apache.qpid.systest.rest.GroupRestTest
Tests run: 5, Failures: 0, Errors: 0, Skipped: 0, Time elapsed: 0.003 sec - in org.apache.qpid.systest.rest.GroupRestTest
Running org.apache.qpid.systest.rest.AuthenticationProviderRestTest
Tests run: 9, Failures: 0, Errors: 0, Skipped: 0, Time elapsed: 0.005 sec - in org.apache.qpid.systest.rest.AuthenticationProviderRestTest
Running org.apache.qpid.systest.rest.BrokerRestHttpAndHttpsTest
Tests run: 4, Failures: 0, Errors: 0, Skipped: 0, Time elapsed: 0.002 sec - in org.apache.qpid.systest.rest.BrokerRestHttpAndHttpsTest
Running org.apache.qpid.systest.rest.VirtualHostLoggerRestTest
Tests run: 2, Failures: 0, Errors: 0, Skipped: 0, Time elapsed: 0.001 sec - in org.apache.qpid.systest.rest.VirtualHostLoggerRestTest
Running org.apache.qpid.systest.messageencryption.MessageEncryptionTest
Tests run: 8, Failures: 0, Errors: 0, Skipped: 0, Time elapsed: 0.148 sec - in org.apache.qpid.systest.messageencryption.MessageEncryptionTest
Results :
Failed tests:
QueueDepthWithSelectorTest>QpidTestCase.run:165->QpidBrokerTestCase.runBare:113->QpidTestCase.runTest:181->test:101->verifyBrokerState:129 Error creating producer
Tests in error:
LastValueQueueTest>QpidTestCase.run:165->QpidBrokerTestCase.runBare:113->QpidTestCase.runTest:181->testConflatedQueueDepth:260->QpidBrokerTestCase.getQueueDepth:388 » JMS
Acknowledge2ConsumersTest>QpidTestCase.run:165->QpidBrokerTestCase.runBare:113->QpidTestCase.runTest:181->test2ConsumersAutoAck:130->test2ConsumersAcking:106->QpidBrokerTestCase.getQueueDepth:388 » JMS
Acknowledge2ConsumersTest>QpidTestCase.run:165->QpidBrokerTestCase.runBare:113->QpidTestCase.runTest:181->test2ConsumersClientAck:135->test2ConsumersAcking:106->QpidBrokerTestCase.getQueueDepth:388 » JMS
Acknowledge2ConsumersTest>QpidTestCase.run:165->QpidBrokerTestCase.runBare:113->QpidTestCase.runTest:181->test2ConsumersTx:140->test2ConsumersAcking:106->QpidBrokerTestCase.getQueueDepth:388 » JMS
AcknowledgeOnMessageTest>QpidTestCase.run:165->QpidBrokerTestCase.runBare:113->QpidTestCase.runTest:181->AcknowledgeTest.testAutoAck:159->testAcking:91->init:65->AcknowledgeTest.init:75->QpidBrokerTestCase.getQueueDepth:388 » JMS
AcknowledgeOnMessageTest>QpidTestCase.run:165->QpidBrokerTestCase.runBare:113->QpidTestCase.runTest:181->AcknowledgeTest.testClientAck:154->testAcking:91->init:65->AcknowledgeTest.init:75->QpidBrokerTestCase.getQueueDepth:388 » JMS
AcknowledgeOnMessageTest>QpidTestCase.run:165->QpidBrokerTestCase.runBare:113->QpidTestCase.runTest:181->AcknowledgeTest.testDupsOk:169->testAcking:91->init:65->AcknowledgeTest.init:75->QpidBrokerTestCase.getQueueDepth:388 » JMS
AcknowledgeOnMessageTest>QpidTestCase.run:165->QpidBrokerTestCase.runBare:113->QpidTestCase.runTest:181->AcknowledgeTest.testNoAck:174->testAcking:91->init:65->AcknowledgeTest.init:75->QpidBrokerTestCase.getQueueDepth:388 » JMS
AcknowledgeOnMessageTest>QpidTestCase.run:165->QpidBrokerTestCase.runBare:113->QpidTestCase.runTest:181->AcknowledgeTest.testPreAck:179->testAcking:91->init:65->AcknowledgeTest.init:75->QpidBrokerTestCase.getQueueDepth:388 » JMS
AcknowledgeOnMessageTest>QpidTestCase.run:165->QpidBrokerTestCase.runBare:113->QpidTestCase.runTest:181->AcknowledgeTest.testTransacted:164->testAcking:91->init:65->AcknowledgeTest.init:75->QpidBrokerTestCase.getQueueDepth:388 » JMS
AcknowledgeTest>QpidTestCase.run:165->QpidBrokerTestCase.runBare:113->QpidTestCase.runTest:181->testAutoAck:159->testAcking:97->init:75->QpidBrokerTestCase.getQueueDepth:388 » JMS
AcknowledgeTest>QpidTestCase.run:165->QpidBrokerTestCase.runBare:113->QpidTestCase.runTest:181->testClientAck:154->testAcking:97->init:75->QpidBrokerTestCase.getQueueDepth:388 » JMS
AcknowledgeTest>QpidTestCase.run:165->QpidBrokerTestCase.runBare:113->QpidTestCase.runTest:181->testDupsOk:169->testAcking:97->init:75->QpidBrokerTestCase.getQueueDepth:388 » JMS
AcknowledgeTest>QpidTestCase.run:165->QpidBrokerTestCase.runBare:113->QpidTestCase.runTest:181->testNoAck:174->testAcking:97->init:75->QpidBrokerTestCase.getQueueDepth:388 » JMS
AcknowledgeTest>QpidTestCase.run:165->QpidBrokerTestCase.runBare:113->QpidTestCase.runTest:181->testPreAck:179->testAcking:97->init:75->QpidBrokerTestCase.getQueueDepth:388 » JMS
AcknowledgeTest>QpidTestCase.run:165->QpidBrokerTestCase.runBare:113->QpidTestCase.runTest:181->testTransacted:164->testAcking:97->init:75->QpidBrokerTestCase.getQueueDepth:388 » JMS
UTF8Test>QpidTestCase.run:165->QpidBrokerTestCase.runBare:113->QpidTestCase.runTest:181->testPlainEn:50->invoke:64->runTest:73->getReceivingDestination:93->createEntitiesUsingAmqpManagement:124->QpidBrokerTestCase.createEntityUsingAmqpManagement:339 » JMS
UTF8Test>QpidTestCase.run:165->QpidBrokerTestCase.runBare:113->QpidTestCase.runTest:181->testUTF8Jp:56->invoke:64->runTest:73->getReceivingDestination:93->createEntitiesUsingAmqpManagement:124->QpidBrokerTestCase.createEntityUsingAmqpManagement:339 » JMS
Tests run: 1034, Failures: 1, Errors: 18, Skipped: 0
[INFO] ------------------------------------------------------------------------
[INFO] BUILD FAILURE
[INFO] ------------------------------------------------------------------------
[INFO] Total time: 05:53 min
[INFO] Finished at: 2017-11-28T23:57:56Z
[INFO] Final Memory: 50M/1472M
[INFO] ------------------------------------------------------------------------
[ERROR] Failed to execute goal org.apache.maven.plugins:maven-surefire-plugin:2.19.1:test (integration-test) on project qpid-systests: There are test failures.
[ERROR]
[ERROR] Please refer to <https://builds.apache.org/job/Qpid-cpp-JMS-AMQP-0-x-Test/4295/artifact/qpid-broker-j/systests/target/surefire-reports/cpp> for the individual test results.
[ERROR] -> [Help 1]
[ERROR]
[ERROR] To see the full stack trace of the errors, re-run Maven with the -e switch.
[ERROR] Re-run Maven using the -X switch to enable full debug logging.
[ERROR]
[ERROR] For more information about the errors and possible solutions, please read the following articles:
[ERROR] [Help 1] http://cwiki.apache.org/confluence/display/MAVEN/MojoFailureException
Build step 'Invoke top-level Maven targets' marked build as failure
[locks-and-latches] Releasing all the locks
[locks-and-latches] All the locks released
Archiving artifacts
Recording test results