You are viewing a plain text version of this content. The canonical link for it is here.
Posted to builds@beam.apache.org by Apache Jenkins Server <je...@builds.apache.org> on 2022/08/18 04:47:16 UTC
Build failed in Jenkins: beam_PostCommit_Python37 #5608
See <https://ci-beam.apache.org/job/beam_PostCommit_Python37/5608/display/redirect?page=changes>
Changes:
[noreply] [Website] add intuit case-study, add intuit quote-card (#22757)
[noreply] Avoid panic on type assert. (#22767)
[noreply] [#21935] Reject ill formed GroupByKey coders during pipeline.run
[noreply] Don't use batch interface for single object operations (#22432)
------------------------------------------
[...truncated 65.18 MB...]
p.options.view_as(GoogleCloudOptions).job_name or 'AUTOMATIC_JOB_NAME')
apache_beam/examples/cookbook/bigquery_tornadoes_it_test.py: 1 warning
apache_beam/io/gcp/bigquery_io_read_it_test.py: 2 warnings
apache_beam/examples/dataframe/flight_delays_it_test.py: 1 warning
apache_beam/io/gcp/bigquery_read_it_test.py: 7 warnings
apache_beam/io/gcp/bigquery_json_it_test.py: 3 warnings
apache_beam/io/gcp/big_query_query_to_table_it_test.py: 6 warnings
<https://ci-beam.apache.org/job/beam_PostCommit_Python37/ws/src/sdks/python/apache_beam/io/gcp/bigquery.py>:2774: BeamDeprecationWarning: options is deprecated since First stable release. References to <pipeline>.options will not be supported
temp_location = pcoll.pipeline.options.view_as(
apache_beam/examples/cookbook/bigquery_tornadoes_it_test.py: 1 warning
apache_beam/io/gcp/bigquery_io_read_it_test.py: 2 warnings
apache_beam/examples/dataframe/flight_delays_it_test.py: 1 warning
apache_beam/io/gcp/bigquery_read_it_test.py: 7 warnings
apache_beam/io/gcp/bigquery_json_it_test.py: 3 warnings
apache_beam/io/gcp/big_query_query_to_table_it_test.py: 6 warnings
<https://ci-beam.apache.org/job/beam_PostCommit_Python37/ws/src/sdks/python/apache_beam/io/gcp/bigquery.py>:2776: BeamDeprecationWarning: options is deprecated since First stable release. References to <pipeline>.options will not be supported
job_name = pcoll.pipeline.options.view_as(GoogleCloudOptions).job_name
apache_beam/examples/cookbook/bigquery_tornadoes_it_test.py: 1 warning
apache_beam/io/gcp/bigquery_io_read_it_test.py: 2 warnings
apache_beam/examples/dataframe/flight_delays_it_test.py: 1 warning
apache_beam/io/gcp/bigquery_read_it_test.py: 7 warnings
apache_beam/io/gcp/bigquery_json_it_test.py: 3 warnings
apache_beam/io/gcp/big_query_query_to_table_it_test.py: 6 warnings
<https://ci-beam.apache.org/job/beam_PostCommit_Python37/ws/src/sdks/python/apache_beam/io/gcp/bigquery.py>:2807: BeamDeprecationWarning: options is deprecated since First stable release. References to <pipeline>.options will not be supported
| _PassThroughThenCleanup(files_to_remove_pcoll))
apache_beam/examples/cookbook/bigquery_tornadoes_it_test.py: 1 warning
apache_beam/io/gcp/bigquery_write_it_test.py: 4 warnings
apache_beam/io/gcp/bigquery_test.py: 2 warnings
apache_beam/io/gcp/big_query_query_to_table_it_test.py: 6 warnings
<https://ci-beam.apache.org/job/beam_PostCommit_Python37/ws/src/sdks/python/apache_beam/io/gcp/bigquery.py>:2281: BeamDeprecationWarning: options is deprecated since First stable release. References to <pipeline>.options will not be supported
self.table_reference.projectId = pcoll.pipeline.options.view_as(
apache_beam/examples/cookbook/bigquery_tornadoes_it_test.py::BigqueryTornadoesIT::test_bigquery_tornadoes_it
<https://ci-beam.apache.org/job/beam_PostCommit_Python37/ws/src/sdks/python/apache_beam/io/gcp/tests/utils.py>:100: PendingDeprecationWarning: Client.dataset is deprecated and will be removed in a future version. Use a string like 'my_project.my_dataset' or a cloud.google.bigquery.DatasetReference object, instead.
table_ref = client.dataset(dataset_id).table(table_id)
apache_beam/examples/dataframe/taxiride_it_test.py::TaxirideIT::test_aggregation
apache_beam/examples/dataframe/flight_delays_it_test.py::FlightDelaysTest::test_flight_delays
apache_beam/examples/dataframe/taxiride_it_test.py::TaxirideIT::test_enrich
<https://ci-beam.apache.org/job/beam_PostCommit_Python37/ws/src/sdks/python/apache_beam/dataframe/io.py>:632: FutureWarning: WriteToFiles is experimental.
sink=lambda _: _WriteToPandasFileSink(
apache_beam/examples/dataframe/taxiride_it_test.py::TaxirideIT::test_aggregation
apache_beam/examples/dataframe/flight_delays_it_test.py::FlightDelaysTest::test_flight_delays
apache_beam/examples/dataframe/taxiride_it_test.py::TaxirideIT::test_enrich
<https://ci-beam.apache.org/job/beam_PostCommit_Python37/ws/src/sdks/python/apache_beam/io/fileio.py>:581: BeamDeprecationWarning: options is deprecated since First stable release. References to <pipeline>.options will not be supported
p.options.view_as(GoogleCloudOptions).temp_location or
apache_beam/examples/dataframe/flight_delays_it_test.py::FlightDelaysTest::test_flight_delays
<https://ci-beam.apache.org/job/beam_PostCommit_Python37/ws/src/sdks/python/apache_beam/examples/dataframe/flight_delays.py>:47: FutureWarning: Dropping of nuisance columns in DataFrame reductions (with 'numeric_only=None') is deprecated; in a future version this will raise TypeError. Select only valid columns before calling the reduction.
return airline_df[at_top_airports].mean()
apache_beam/io/gcp/bigquery_json_it_test.py: 1 warning
apache_beam/io/gcp/bigquery_read_it_test.py: 9 warnings
<https://ci-beam.apache.org/job/beam_PostCommit_Python37/ws/src/sdks/python/apache_beam/io/gcp/bigquery.py>:2818: BeamDeprecationWarning: options is deprecated since First stable release. References to <pipeline>.options will not be supported
project_id = pcoll.pipeline.options.view_as(GoogleCloudOptions).project
apache_beam/io/gcp/bigquery_json_it_test.py: 1 warning
apache_beam/io/gcp/bigquery_read_it_test.py: 9 warnings
<https://ci-beam.apache.org/job/beam_PostCommit_Python37/ws/src/sdks/python/apache_beam/io/gcp/bigquery.py>:2846: BeamDeprecationWarning: options is deprecated since First stable release. References to <pipeline>.options will not be supported
| _PassThroughThenCleanupTempDatasets(project_to_cleanup_pcoll))
apache_beam/io/gcp/bigquery_test.py::BigQueryStreamingInsertTransformIntegrationTests::test_multiple_destinations_transform
<https://ci-beam.apache.org/job/beam_PostCommit_Python37/ws/src/sdks/python/apache_beam/io/gcp/bigquery_test.py>:1846: BeamDeprecationWarning: options is deprecated since First stable release. References to <pipeline>.options will not be supported
streaming = self.test_pipeline.options.view_as(StandardOptions).streaming
apache_beam/io/gcp/bigquery_read_it_test.py::ReadTests::test_native_source
<https://ci-beam.apache.org/job/beam_PostCommit_Python37/ws/src/sdks/python/apache_beam/io/gcp/bigquery_read_it_test.py>:171: BeamDeprecationWarning: BigQuerySource is deprecated since 2.25.0. Use ReadFromBigQuery instead.
beam.io.BigQuerySource(query=self.query, use_standard_sql=True)))
apache_beam/ml/gcp/cloud_dlp_it_test.py::CloudDLPIT::test_deidentification
<https://ci-beam.apache.org/job/beam_PostCommit_Python37/ws/src/sdks/python/apache_beam/ml/gcp/cloud_dlp_it_test.py>:77: FutureWarning: MaskDetectedDetails is experimental.
inspection_config=INSPECT_CONFIG))
apache_beam/ml/gcp/cloud_dlp_it_test.py::CloudDLPIT::test_inspection
<https://ci-beam.apache.org/job/beam_PostCommit_Python37/ws/src/sdks/python/apache_beam/ml/gcp/cloud_dlp_it_test.py>:87: FutureWarning: InspectForDetails is experimental.
| beam.ParDo(extract_inspection_results).with_outputs(
apache_beam/ml/inference/sklearn_inference_it_test.py::SklearnInference::test_sklearn_regression
<https://ci-beam.apache.org/job/beam_PostCommit_Python37/ws/src/sdks/python/apache_beam/examples/inference/sklearn_japanese_housing_regression.py>:128: FutureWarning: SklearnModelHandlerPandas is experimental. No backwards-compatibility guarantees.
model_file_type=ModelFileType.PICKLE, model_uri=model_filename)
apache_beam/ml/inference/sklearn_inference_it_test.py::SklearnInference::test_sklearn_regression
<https://ci-beam.apache.org/job/beam_PostCommit_Python37/ws/src/build/gradleenv/-1734967052/lib/python3.7/site-packages/dill/_dill.py>:472: FutureWarning: SklearnModelHandlerPandas is experimental. No backwards-compatibility guarantees.
obj = StockUnpickler.load(self)
apache_beam/io/gcp/big_query_query_to_table_it_test.py::BigQueryQueryToTableIT::test_big_query_new_types_native
apache_beam/io/gcp/big_query_query_to_table_it_test.py::BigQueryQueryToTableIT::test_big_query_standard_sql_kms_key_native
<https://ci-beam.apache.org/job/beam_PostCommit_Python37/ws/src/sdks/python/apache_beam/io/gcp/big_query_query_to_table_pipeline.py>:84: BeamDeprecationWarning: BigQuerySource is deprecated since 2.25.0. Use ReadFromBigQuery instead.
kms_key=kms_key))
apache_beam/io/gcp/big_query_query_to_table_it_test.py::BigQueryQueryToTableIT::test_big_query_new_types_native
apache_beam/io/gcp/big_query_query_to_table_it_test.py::BigQueryQueryToTableIT::test_big_query_standard_sql_kms_key_native
<https://ci-beam.apache.org/job/beam_PostCommit_Python37/ws/src/sdks/python/apache_beam/runners/dataflow/ptransform_overrides.py>:323: BeamDeprecationWarning: BigQuerySink is deprecated since 2.11.0. Use WriteToBigQuery instead.
kms_key=self.kms_key))
apache_beam/io/gcp/bigquery_read_it_test.py::ReadNewTypesTests::test_native_source
<https://ci-beam.apache.org/job/beam_PostCommit_Python37/ws/src/sdks/python/apache_beam/io/gcp/bigquery_read_it_test.py>:646: BeamDeprecationWarning: BigQuerySource is deprecated since 2.25.0. Use ReadFromBigQuery instead.
beam.io.BigQuerySource(query=self.query, use_standard_sql=True)))
apache_beam/io/gcp/bigquery_read_it_test.py::ReadAllBQTests::test_read_queries
<https://ci-beam.apache.org/job/beam_PostCommit_Python37/ws/src/sdks/python/apache_beam/io/gcp/bigquery_read_it_test.py>:761: FutureWarning: ReadAllFromBigQuery is experimental.
| beam.io.ReadAllFromBigQuery())
apache_beam/io/gcp/bigquery_read_it_test.py::ReadAllBQTests::test_read_queries
<https://ci-beam.apache.org/job/beam_PostCommit_Python37/ws/src/sdks/python/apache_beam/io/gcp/bigquery.py>:2947: BeamDeprecationWarning: options is deprecated since First stable release. References to <pipeline>.options will not be supported
job_name = pcoll.pipeline.options.view_as(GoogleCloudOptions).job_name
apache_beam/io/gcp/bigquery_read_it_test.py::ReadAllBQTests::test_read_queries
<https://ci-beam.apache.org/job/beam_PostCommit_Python37/ws/src/sdks/python/apache_beam/io/gcp/bigquery.py>:2948: BeamDeprecationWarning: options is deprecated since First stable release. References to <pipeline>.options will not be supported
project = pcoll.pipeline.options.view_as(GoogleCloudOptions).project
apache_beam/io/gcp/bigquery_read_it_test.py::ReadAllBQTests::test_read_queries
<https://ci-beam.apache.org/job/beam_PostCommit_Python37/ws/src/sdks/python/apache_beam/io/gcp/bigquery.py>:2961: BeamDeprecationWarning: options is deprecated since First stable release. References to <pipeline>.options will not be supported
options=pcoll.pipeline.options,
-- Docs: https://docs.pytest.org/en/stable/how-to/capture-warnings.html
- generated xml file: <https://ci-beam.apache.org/job/beam_PostCommit_Python37/ws/src/sdks/python/pytest_postCommitIT-df-py37.xml> -
[33m========== [32m82 passed[0m, [33m[1m13 skipped[0m, [33m[1m218 warnings[0m[33m in 10381.66s (2:53:01)[0m[33m ==========[0m
> Task :sdks:python:test-suites:dataflow:py37:spannerioIT
>>> RUNNING integration tests with pipeline options: --runner=TestDataflowRunner --project=apache-beam-testing --region=us-central1 --staging_location=gs://temp-storage-for-end-to-end-tests/staging-it --temp_location=gs://temp-storage-for-end-to-end-tests/temp-it --output=gs://temp-storage-for-end-to-end-tests/py-it-cloud/output --sdk_location=<https://ci-beam.apache.org/job/beam_PostCommit_Python37/ws/src/sdks/python/build/apache-beam.tar.gz> --requirements_file=postcommit_requirements.txt --num_workers=1 --sleep_secs=20 --dataflow_worker_jar=<https://ci-beam.apache.org/job/beam_PostCommit_Python37/ws/src/runners/google-cloud-dataflow-java/worker/build/libs/beam-runners-google-cloud-dataflow-java-fn-api-worker-2.42.0-SNAPSHOT.jar> --kms_key_name=projects/apache-beam-testing/locations/global/keyRings/beam-it/cryptoKeys/test --dataflow_kms_key=projects/apache-beam-testing/locations/global/keyRings/beam-it/cryptoKeys/test
>>> pytest options: --capture=no --timeout=4500 --color=yes --log-cli-level=INFO --numprocesses=8 --dist=loadfile
>>> collect markers: -m=spannerio_it
[1m============================= test session starts ==============================[0m
platform linux -- Python 3.7.12, pytest-7.1.2, pluggy-1.0.0
rootdir: <https://ci-beam.apache.org/job/beam_PostCommit_Python37/ws/src/sdks/python,> configfile: pytest.ini
plugins: xdist-2.5.0, timeout-2.1.0, forked-1.4.0, requests-mock-1.9.3
timeout: 4500.0s
timeout method: signal
timeout func_only: False
gw0 I / gw1 I / gw2 I / gw3 I / gw4 I / gw5 I / gw6 I / gw7 I
[1m[gw0] Python 3.7.12 (default, Jan 15 2022, 18:42:10) -- [GCC 9.3.0]
[0m[1m[gw1] Python 3.7.12 (default, Jan 15 2022, 18:42:10) -- [GCC 9.3.0]
[0m[1m[gw3] Python 3.7.12 (default, Jan 15 2022, 18:42:10) -- [GCC 9.3.0]
[0m[1m[gw4] Python 3.7.12 (default, Jan 15 2022, 18:42:10) -- [GCC 9.3.0]
[0m[1m[gw5] Python 3.7.12 (default, Jan 15 2022, 18:42:10) -- [GCC 9.3.0]
[0m[1m[gw2] Python 3.7.12 (default, Jan 15 2022, 18:42:10) -- [GCC 9.3.0]
[0m[1m[gw7] Python 3.7.12 (default, Jan 15 2022, 18:42:10) -- [GCC 9.3.0]
[0m[1m[gw6] Python 3.7.12 (default, Jan 15 2022, 18:42:10) -- [GCC 9.3.0]
[0mgw0 [15] / gw1 [15] / gw2 [15] / gw3 [15] / gw4 [15] / gw5 [15] / gw6 [15] / gw7 [15]
scheduling tests via LoadFileScheduling
apache_beam/io/gcp/experimental/spannerio_read_it_test.py::SpannerReadIntegrationTest::test_read_via_sql
apache_beam/io/gcp/experimental/spannerio_write_it_test.py::SpannerWriteIntegrationTest::test_metrics_error_call
[gw1] [33mSKIPPED[0m apache_beam/io/gcp/experimental/spannerio_write_it_test.py::SpannerWriteIntegrationTest::test_metrics_error_call
apache_beam/io/gcp/experimental/spannerio_write_it_test.py::SpannerWriteIntegrationTest::test_metrics_ok_call
[gw1] [33mSKIPPED[0m apache_beam/io/gcp/experimental/spannerio_write_it_test.py::SpannerWriteIntegrationTest::test_metrics_ok_call
apache_beam/io/gcp/experimental/spannerio_write_it_test.py::SpannerWriteIntegrationTest::test_spanner_error
[gw0] [32mPASSED[0m apache_beam/io/gcp/experimental/spannerio_read_it_test.py::SpannerReadIntegrationTest::test_read_via_sql
apache_beam/io/gcp/experimental/spannerio_read_it_test.py::SpannerReadIntegrationTest::test_read_via_table
[gw1] [32mPASSED[0m apache_beam/io/gcp/experimental/spannerio_write_it_test.py::SpannerWriteIntegrationTest::test_spanner_error
apache_beam/io/gcp/experimental/spannerio_write_it_test.py::SpannerWriteIntegrationTest::test_spanner_update
[gw0] [32mPASSED[0m apache_beam/io/gcp/experimental/spannerio_read_it_test.py::SpannerReadIntegrationTest::test_read_via_table
apache_beam/io/gcp/experimental/spannerio_read_it_test.py::SpannerReadIntegrationTest::test_sql_metrics_error_call
[gw0] [33mSKIPPED[0m apache_beam/io/gcp/experimental/spannerio_read_it_test.py::SpannerReadIntegrationTest::test_sql_metrics_error_call
apache_beam/io/gcp/experimental/spannerio_read_it_test.py::SpannerReadIntegrationTest::test_sql_metrics_ok_call
[gw0] [33mSKIPPED[0m apache_beam/io/gcp/experimental/spannerio_read_it_test.py::SpannerReadIntegrationTest::test_sql_metrics_ok_call
apache_beam/io/gcp/experimental/spannerio_read_it_test.py::SpannerReadIntegrationTest::test_table_metrics_error_call
[gw0] [33mSKIPPED[0m apache_beam/io/gcp/experimental/spannerio_read_it_test.py::SpannerReadIntegrationTest::test_table_metrics_error_call
apache_beam/io/gcp/experimental/spannerio_read_it_test.py::SpannerReadIntegrationTest::test_table_metrics_ok_call
[gw0] [33mSKIPPED[0m apache_beam/io/gcp/experimental/spannerio_read_it_test.py::SpannerReadIntegrationTest::test_table_metrics_ok_call
apache_beam/io/gcp/experimental/spannerio_read_it_test.py::SpannerReadIntegrationTest::test_transaction_sql_metrics_error_call
[gw0] [33mSKIPPED[0m apache_beam/io/gcp/experimental/spannerio_read_it_test.py::SpannerReadIntegrationTest::test_transaction_sql_metrics_error_call
apache_beam/io/gcp/experimental/spannerio_read_it_test.py::SpannerReadIntegrationTest::test_transaction_sql_metrics_ok_call
[gw0] [33mSKIPPED[0m apache_beam/io/gcp/experimental/spannerio_read_it_test.py::SpannerReadIntegrationTest::test_transaction_sql_metrics_ok_call
apache_beam/io/gcp/experimental/spannerio_read_it_test.py::SpannerReadIntegrationTest::test_transaction_table_metrics_error_call
[gw0] [33mSKIPPED[0m apache_beam/io/gcp/experimental/spannerio_read_it_test.py::SpannerReadIntegrationTest::test_transaction_table_metrics_error_call
apache_beam/io/gcp/experimental/spannerio_read_it_test.py::SpannerReadIntegrationTest::test_transaction_table_metrics_ok_call
[gw0] [33mSKIPPED[0m apache_beam/io/gcp/experimental/spannerio_read_it_test.py::SpannerReadIntegrationTest::test_transaction_table_metrics_ok_call
[gw1] [32mPASSED[0m apache_beam/io/gcp/experimental/spannerio_write_it_test.py::SpannerWriteIntegrationTest::test_spanner_update
apache_beam/io/gcp/experimental/spannerio_write_it_test.py::SpannerWriteIntegrationTest::test_write_batches
[gw1] [32mPASSED[0m apache_beam/io/gcp/experimental/spannerio_write_it_test.py::SpannerWriteIntegrationTest::test_write_batches
[33m=============================== warnings summary ===============================[0m
../../build/gradleenv/-1734967052/lib/python3.7/site-packages/hdfs/config.py:15
../../build/gradleenv/-1734967052/lib/python3.7/site-packages/hdfs/config.py:15
../../build/gradleenv/-1734967052/lib/python3.7/site-packages/hdfs/config.py:15
../../build/gradleenv/-1734967052/lib/python3.7/site-packages/hdfs/config.py:15
../../build/gradleenv/-1734967052/lib/python3.7/site-packages/hdfs/config.py:15
../../build/gradleenv/-1734967052/lib/python3.7/site-packages/hdfs/config.py:15
../../build/gradleenv/-1734967052/lib/python3.7/site-packages/hdfs/config.py:15
../../build/gradleenv/-1734967052/lib/python3.7/site-packages/hdfs/config.py:15
../../build/gradleenv/-1734967052/lib/python3.7/site-packages/hdfs/config.py:15
<https://ci-beam.apache.org/job/beam_PostCommit_Python37/ws/src/build/gradleenv/-1734967052/lib/python3.7/site-packages/hdfs/config.py>:15: DeprecationWarning: the imp module is deprecated in favour of importlib; see the module's documentation for alternative uses
from imp import load_source
apache_beam/io/gcp/experimental/spannerio_read_it_test.py::SpannerReadIntegrationTest::test_read_via_sql
<https://ci-beam.apache.org/job/beam_PostCommit_Python37/ws/src/sdks/python/apache_beam/io/gcp/experimental/spannerio_read_it_test.py>:128: FutureWarning: ReadFromSpanner is experimental. No backwards-compatibility guarantees.
sql="select * from Users")
apache_beam/io/gcp/experimental/spannerio_write_it_test.py::SpannerWriteIntegrationTest::test_spanner_error
<https://ci-beam.apache.org/job/beam_PostCommit_Python37/ws/src/sdks/python/apache_beam/io/gcp/experimental/spannerio_write_it_test.py>:190: FutureWarning: WriteToSpanner is experimental. No backwards-compatibility guarantees.
database_id=self.TEST_DATABASE))
apache_beam/io/gcp/experimental/spannerio_read_it_test.py::SpannerReadIntegrationTest::test_read_via_table
<https://ci-beam.apache.org/job/beam_PostCommit_Python37/ws/src/sdks/python/apache_beam/io/gcp/experimental/spannerio_read_it_test.py>:117: FutureWarning: ReadFromSpanner is experimental. No backwards-compatibility guarantees.
columns=["UserId", "Key"])
apache_beam/io/gcp/experimental/spannerio_write_it_test.py::SpannerWriteIntegrationTest::test_spanner_update
<https://ci-beam.apache.org/job/beam_PostCommit_Python37/ws/src/sdks/python/apache_beam/io/gcp/experimental/spannerio_write_it_test.py>:171: FutureWarning: WriteToSpanner is experimental. No backwards-compatibility guarantees.
database_id=self.TEST_DATABASE))
apache_beam/io/gcp/experimental/spannerio_write_it_test.py::SpannerWriteIntegrationTest::test_write_batches
<https://ci-beam.apache.org/job/beam_PostCommit_Python37/ws/src/sdks/python/apache_beam/io/gcp/experimental/spannerio_write_it_test.py>:135: FutureWarning: WriteToSpanner is experimental. No backwards-compatibility guarantees.
max_batch_size_bytes=250))
-- Docs: https://docs.pytest.org/en/stable/how-to/capture-warnings.html
- generated xml file: <https://ci-beam.apache.org/job/beam_PostCommit_Python37/ws/src/sdks/python/pytest_postCommitIT-df-py37.xml> -
[33m=========== [32m5 passed[0m, [33m[1m12 skipped[0m, [33m[1m14 warnings[0m[33m in 1739.43s (0:28:59)[0m[33m ============[0m
FAILURE: Build failed with an exception.
* Where:
Script '<https://ci-beam.apache.org/job/beam_PostCommit_Python37/ws/src/sdks/python/test-suites/direct/common.gradle'> line: 182
* What went wrong:
Execution failed for task ':sdks:python:test-suites:direct:py37:hdfsIntegrationTest'.
> Process 'command 'sh'' finished with non-zero exit value 1
* Try:
> Run with --stacktrace option to get the stack trace.
> Run with --info or --debug option to get more log output.
> Run with --scan to get full insights.
* Get more help at https://help.gradle.org
Deprecated Gradle features were used in this build, making it incompatible with Gradle 8.0.
You can use '--warning-mode all' to show the individual deprecation warnings and determine if they come from your own scripts or plugins.
See https://docs.gradle.org/7.4/userguide/command_line_interface.html#sec:command_line_warnings
Execution optimizations have been disabled for 1 invalid unit(s) of work during this build to ensure correctness.
Please consult deprecation warnings for more details.
BUILD FAILED in 3h 26m 46s
227 actionable tasks: 181 executed, 40 from cache, 6 up-to-date
Publishing build scan...
https://gradle.com/s/3bsui75grk5b6
Build step 'Invoke Gradle script' changed build result to FAILURE
Build step 'Invoke Gradle script' marked build as failure
---------------------------------------------------------------------
To unsubscribe, e-mail: builds-unsubscribe@beam.apache.org
For additional commands, e-mail: builds-help@beam.apache.org
Jenkins build is back to normal : beam_PostCommit_Python37 #5610
Posted by Apache Jenkins Server <je...@builds.apache.org>.
See <https://ci-beam.apache.org/job/beam_PostCommit_Python37/5610/display/redirect?page=changes>
---------------------------------------------------------------------
To unsubscribe, e-mail: builds-unsubscribe@beam.apache.org
For additional commands, e-mail: builds-help@beam.apache.org
Build failed in Jenkins: beam_PostCommit_Python37 #5609
Posted by Apache Jenkins Server <je...@builds.apache.org>.
See <https://ci-beam.apache.org/job/beam_PostCommit_Python37/5609/display/redirect>
Changes:
------------------------------------------
[...truncated 45.54 MB...]
INFO apache_beam.utils.subprocess_server:subprocess_server.py:132 "type": "beam:metrics:sum_int64:v1",
INFO apache_beam.utils.subprocess_server:subprocess_server.py:132 "payload": "AA==",
INFO apache_beam.utils.subprocess_server:subprocess_server.py:132 "labels": {
INFO apache_beam.utils.subprocess_server:subprocess_server.py:132 "PTRANSFORM": "Write to Spanner/SpannerIO.Write/Write mutations to Cloud Spanner/Schema View/Combine.GloballyAsSingletonView/CombineValues/Combine.perKey(Singleton)/Merge"
INFO apache_beam.utils.subprocess_server:subprocess_server.py:132 }
INFO apache_beam.utils.subprocess_server:subprocess_server.py:132 }, {
INFO apache_beam.utils.subprocess_server:subprocess_server.py:132 "urn": "beam:metric:element_count:v1",
INFO apache_beam.utils.subprocess_server:subprocess_server.py:132 "type": "beam:metrics:sum_int64:v1",
INFO apache_beam.utils.subprocess_server:subprocess_server.py:132 "payload": "AQ==",
INFO apache_beam.utils.subprocess_server:subprocess_server.py:132 "labels": {
INFO apache_beam.utils.subprocess_server:subprocess_server.py:132 "PCOLLECTION": "pcollection_4"
INFO apache_beam.utils.subprocess_server:subprocess_server.py:132 }
INFO apache_beam.utils.subprocess_server:subprocess_server.py:132 }, {
INFO apache_beam.utils.subprocess_server:subprocess_server.py:132 "urn": "beam:metric:data_channel:read_index:v1",
INFO apache_beam.utils.subprocess_server:subprocess_server.py:132 "type": "beam:metrics:sum_int64:v1",
INFO apache_beam.utils.subprocess_server:subprocess_server.py:132 "payload": "AQ==",
INFO apache_beam.utils.subprocess_server:subprocess_server.py:132 "labels": {
INFO apache_beam.utils.subprocess_server:subprocess_server.py:132 "PTRANSFORM": "fn/read/pcollection_4:0"
INFO apache_beam.utils.subprocess_server:subprocess_server.py:132 }
INFO apache_beam.utils.subprocess_server:subprocess_server.py:132 }, {
INFO apache_beam.utils.subprocess_server:subprocess_server.py:132 "urn": "beam:metric:pardo_execution_time:finish_bundle_msecs:v1",
INFO apache_beam.utils.subprocess_server:subprocess_server.py:132 "type": "beam:metrics:sum_int64:v1",
INFO apache_beam.utils.subprocess_server:subprocess_server.py:132 "payload": "AA==",
INFO apache_beam.utils.subprocess_server:subprocess_server.py:132 "labels": {
INFO apache_beam.utils.subprocess_server:subprocess_server.py:132 "PTRANSFORM": "external_7Write-to-Spanner-SpannerIO-Write-Write-mutations-to-Cloud-Spanner-Schema-View-Combine-GloballyAsSing9"
INFO apache_beam.utils.subprocess_server:subprocess_server.py:132 }
INFO apache_beam.utils.subprocess_server:subprocess_server.py:132 }, {
INFO apache_beam.utils.subprocess_server:subprocess_server.py:132 "urn": "beam:metric:element_count:v1",
INFO apache_beam.utils.subprocess_server:subprocess_server.py:132 "type": "beam:metrics:sum_int64:v1",
INFO apache_beam.utils.subprocess_server:subprocess_server.py:132 "payload": "AQ==",
INFO apache_beam.utils.subprocess_server:subprocess_server.py:132 "labels": {
INFO apache_beam.utils.subprocess_server:subprocess_server.py:132 "PCOLLECTION": "pcollection_5"
INFO apache_beam.utils.subprocess_server:subprocess_server.py:132 }
INFO apache_beam.utils.subprocess_server:subprocess_server.py:132 }, {
INFO apache_beam.utils.subprocess_server:subprocess_server.py:132 "urn": "beam:metric:pardo_execution_time:process_bundle_msecs:v1",
INFO apache_beam.utils.subprocess_server:subprocess_server.py:132 "type": "beam:metrics:sum_int64:v1",
INFO apache_beam.utils.subprocess_server:subprocess_server.py:132 "payload": "AA==",
INFO apache_beam.utils.subprocess_server:subprocess_server.py:132 "labels": {
INFO apache_beam.utils.subprocess_server:subprocess_server.py:132 "PTRANSFORM": "fn/write/external_7Write to Spanner/SpannerIO.Write/Write mutations to Cloud Spanner/Schema View/Combine.GloballyAsSingletonView/CombineValues/Values/Values/Map/ParMultiDo(Anonymous).output:0"
INFO apache_beam.utils.subprocess_server:subprocess_server.py:132 }
INFO apache_beam.utils.subprocess_server:subprocess_server.py:132 }, {
INFO apache_beam.utils.subprocess_server:subprocess_server.py:132 "urn": "beam:metric:sampled_byte_size:v1",
INFO apache_beam.utils.subprocess_server:subprocess_server.py:132 "type": "beam:metrics:distribution_int64:v1",
INFO apache_beam.utils.subprocess_server:subprocess_server.py:132 "payload": "AcYUxhTGFA==",
INFO apache_beam.utils.subprocess_server:subprocess_server.py:132 "labels": {
INFO apache_beam.utils.subprocess_server:subprocess_server.py:132 "PCOLLECTION": "external_7Write to Spanner/SpannerIO.Write/Write mutations to Cloud Spanner/Schema View/Combine.GloballyAsSingletonView/CombineValues/Values/Values/Map/ParMultiDo(Anonymous).output"
INFO apache_beam.utils.subprocess_server:subprocess_server.py:132 }
INFO apache_beam.utils.subprocess_server:subprocess_server.py:132 }, {
INFO apache_beam.utils.subprocess_server:subprocess_server.py:132 "urn": "beam:metric:sampled_byte_size:v1",
INFO apache_beam.utils.subprocess_server:subprocess_server.py:132 "type": "beam:metrics:distribution_int64:v1",
INFO apache_beam.utils.subprocess_server:subprocess_server.py:132 "payload": "Ac4UzhTOFA==",
INFO apache_beam.utils.subprocess_server:subprocess_server.py:132 "labels": {
INFO apache_beam.utils.subprocess_server:subprocess_server.py:132 "PCOLLECTION": "pcollection_4"
INFO apache_beam.utils.subprocess_server:subprocess_server.py:132 }
INFO apache_beam.utils.subprocess_server:subprocess_server.py:132 }, {
INFO apache_beam.utils.subprocess_server:subprocess_server.py:132 "urn": "beam:metric:sampled_byte_size:v1",
INFO apache_beam.utils.subprocess_server:subprocess_server.py:132 "type": "beam:metrics:distribution_int64:v1",
INFO apache_beam.utils.subprocess_server:subprocess_server.py:132 "payload": "AccUxxTHFA==",
INFO apache_beam.utils.subprocess_server:subprocess_server.py:132 "labels": {
INFO apache_beam.utils.subprocess_server:subprocess_server.py:132 "PCOLLECTION": "pcollection_5"
INFO apache_beam.utils.subprocess_server:subprocess_server.py:132 }
INFO apache_beam.utils.subprocess_server:subprocess_server.py:132 }, {
INFO apache_beam.utils.subprocess_server:subprocess_server.py:132 "urn": "beam:metric:sampled_byte_size:v1",
INFO apache_beam.utils.subprocess_server:subprocess_server.py:132 "type": "beam:metrics:distribution_int64:v1",
INFO apache_beam.utils.subprocess_server:subprocess_server.py:132 "payload": "AcYUxhTGFA==",
INFO apache_beam.utils.subprocess_server:subprocess_server.py:132 "labels": {
INFO apache_beam.utils.subprocess_server:subprocess_server.py:132 "PCOLLECTION": "external_7Write to Spanner/SpannerIO.Write/Write mutations to Cloud Spanner/Schema View/Combine.GloballyAsSingletonView/CombineValues/Combine.perKey(Singleton)/Combine.GroupedValues/ParDo(Anonymous)/ParMultiDo(Anonymous).output"
INFO apache_beam.utils.subprocess_server:subprocess_server.py:132 }
INFO apache_beam.utils.subprocess_server:subprocess_server.py:132 }]
INFO apache_beam.utils.subprocess_server:subprocess_server.py:132 }
INFO apache_beam.utils.subprocess_server:subprocess_server.py:132 }
INFO apache_beam.utils.subprocess_server:subprocess_server.py:132 Aug 18, 2022 7:38:59 AM org.apache.flink.runtime.dispatcher.Dispatcher onStop
INFO apache_beam.utils.subprocess_server:subprocess_server.py:132 INFO: Stopping dispatcher akka://flink/user/rpc/dispatcher_2.
INFO apache_beam.utils.subprocess_server:subprocess_server.py:132 Aug 18, 2022 7:38:59 AM org.apache.flink.runtime.dispatcher.Dispatcher terminateRunningJobs
INFO apache_beam.utils.subprocess_server:subprocess_server.py:132 INFO: Stopping all currently running jobs of dispatcher akka://flink/user/rpc/dispatcher_2.
INFO apache_beam.utils.subprocess_server:subprocess_server.py:132 Aug 18, 2022 7:38:59 AM org.apache.flink.runtime.dispatcher.Dispatcher lambda$onStop$1
INFO apache_beam.utils.subprocess_server:subprocess_server.py:132 INFO: Stopped dispatcher akka://flink/user/rpc/dispatcher_2.
INFO apache_beam.utils.subprocess_server:subprocess_server.py:132 Aug 18, 2022 7:38:59 AM org.apache.flink.runtime.rpc.akka.AkkaRpcService stopService
INFO apache_beam.utils.subprocess_server:subprocess_server.py:132 INFO: Stopping Akka RPC service.
INFO apache_beam.utils.subprocess_server:subprocess_server.py:132 Aug 18, 2022 7:38:59 AM org.apache.flink.runtime.rpc.akka.AkkaRpcService stopService
INFO apache_beam.utils.subprocess_server:subprocess_server.py:132 INFO: Stopping Akka RPC service.
INFO apache_beam.utils.subprocess_server:subprocess_server.py:132 Aug 18, 2022 7:38:59 AM org.apache.flink.runtime.rpc.akka.AkkaRpcService lambda$stopService$8
INFO apache_beam.utils.subprocess_server:subprocess_server.py:132 INFO: Stopped Akka RPC service.
INFO apache_beam.utils.subprocess_server:subprocess_server.py:132 Aug 18, 2022 7:38:59 AM org.apache.flink.runtime.blob.AbstractBlobCache close
INFO apache_beam.utils.subprocess_server:subprocess_server.py:132 INFO: Shutting down BLOB cache
INFO apache_beam.utils.subprocess_server:subprocess_server.py:132 Aug 18, 2022 7:38:59 AM org.apache.flink.runtime.blob.AbstractBlobCache close
INFO apache_beam.utils.subprocess_server:subprocess_server.py:132 INFO: Shutting down BLOB cache
INFO apache_beam.utils.subprocess_server:subprocess_server.py:132 Aug 18, 2022 7:38:59 AM org.apache.flink.runtime.blob.BlobServer close
INFO apache_beam.utils.subprocess_server:subprocess_server.py:132 INFO: Stopped BLOB server at 0.0.0.0:35839
INFO apache_beam.utils.subprocess_server:subprocess_server.py:132 Aug 18, 2022 7:38:59 AM org.apache.flink.runtime.rpc.akka.AkkaRpcService lambda$stopService$8
INFO apache_beam.utils.subprocess_server:subprocess_server.py:132 INFO: Stopped Akka RPC service.
=============================== warnings summary ===============================
../../build/gradleenv/2022703441/lib/python3.7/site-packages/hdfs/config.py:15
Exception in thread read_grpc_client_inputs:
Traceback (most recent call last):
File "/usr/lib/python3.7/threading.py", line 926, in _bootstrap_inner
self.run()
File "/usr/lib/python3.7/threading.py", line 870, in run
self._target(*self._args, **self._kwargs)
File "<https://ci-beam.apache.org/job/beam_PostCommit_Python37/ws/src/sdks/python/apache_beam/runners/worker/data_plane.py",> line 671, in <lambda>
target=lambda: self._read_inputs(elements_iterator),
File "<https://ci-beam.apache.org/job/beam_PostCommit_Python37/ws/src/sdks/python/apache_beam/runners/worker/data_plane.py",> line 654, in _read_inputs
for elements in elements_iterator:
File "<https://ci-beam.apache.org/job/beam_PostCommit_Python37/ws/src/build/gradleenv/2022703441/lib/python3.7/site-packages/grpc/_channel.py",> line 426, in __next__
return self._next()
File "<https://ci-beam.apache.org/job/beam_PostCommit_Python37/ws/src/build/gradleenv/2022703441/lib/python3.7/site-packages/grpc/_channel.py",> line 826, in _next
raise self
grpc._channel._MultiThreadedRendezvous: <_MultiThreadedRendezvous of RPC that terminated with:
status = StatusCode.CANCELLED
details = "Multiplexer hanging up"
debug_error_string = "{"created":"@1660808137.869190174","description":"Error received from peer ipv6:[::1]:35455","file":"src/core/lib/surface/call.cc","file_line":966,"grpc_message":"Multiplexer hanging up","grpc_status":1}"
<https://ci-beam.apache.org/job/beam_PostCommit_Python37/ws/src/build/gradleenv/2022703441/lib/python3.7/site-packages/hdfs/config.py>:15: DeprecationWarning: the imp module is deprecated in favour of importlib; see the module's documentation for alternative uses
from imp import load_source
-- Docs: https://docs.pytest.org/en/stable/how-to/capture-warnings.html
- generated xml file: <https://ci-beam.apache.org/job/beam_PostCommit_Python37/ws/src/sdks/python/pytest_postCommitIT-flink-py37.xml> -
>
=================== 7 passed, 1 warning in 242.13s (0:04:02) ===================
> Task :sdks:python:test-suites:dataflow:py37:postCommitIT FAILED
> Task :sdks:python:test-suites:dataflow:py37:spannerioIT
>>> RUNNING integration tests with pipeline options: --runner=TestDataflowRunner --project=apache-beam-testing --region=us-central1 --staging_location=gs://temp-storage-for-end-to-end-tests/staging-it --temp_location=gs://temp-storage-for-end-to-end-tests/temp-it --output=gs://temp-storage-for-end-to-end-tests/py-it-cloud/output --sdk_location=<https://ci-beam.apache.org/job/beam_PostCommit_Python37/ws/src/sdks/python/build/apache-beam.tar.gz> --requirements_file=postcommit_requirements.txt --num_workers=1 --sleep_secs=20 --dataflow_worker_jar=<https://ci-beam.apache.org/job/beam_PostCommit_Python37/ws/src/runners/google-cloud-dataflow-java/worker/build/libs/beam-runners-google-cloud-dataflow-java-fn-api-worker-2.42.0-SNAPSHOT.jar> --kms_key_name=projects/apache-beam-testing/locations/global/keyRings/beam-it/cryptoKeys/test --dataflow_kms_key=projects/apache-beam-testing/locations/global/keyRings/beam-it/cryptoKeys/test
>>> pytest options: --capture=no --timeout=4500 --color=yes --log-cli-level=INFO --numprocesses=8 --dist=loadfile
>>> collect markers: -m=spannerio_it
[1m============================= test session starts ==============================[0m
platform linux -- Python 3.7.12, pytest-7.1.2, pluggy-1.0.0
rootdir: <https://ci-beam.apache.org/job/beam_PostCommit_Python37/ws/src/sdks/python,> configfile: pytest.ini
plugins: xdist-2.5.0, timeout-2.1.0, forked-1.4.0, requests-mock-1.9.3
timeout: 4500.0s
timeout method: signal
timeout func_only: False
gw0 I / gw1 I / gw2 I / gw3 I / gw4 I / gw5 I / gw6 I / gw7 I
[1m[gw0] Python 3.7.12 (default, Jan 15 2022, 18:42:10) -- [GCC 9.3.0]
[0m[1m[gw1] Python 3.7.12 (default, Jan 15 2022, 18:42:10) -- [GCC 9.3.0]
[0m[1m[gw2] Python 3.7.12 (default, Jan 15 2022, 18:42:10) -- [GCC 9.3.0]
[0m[1m[gw3] Python 3.7.12 (default, Jan 15 2022, 18:42:10) -- [GCC 9.3.0]
[0m[1m[gw4] Python 3.7.12 (default, Jan 15 2022, 18:42:10) -- [GCC 9.3.0]
[0m[1m[gw5] Python 3.7.12 (default, Jan 15 2022, 18:42:10) -- [GCC 9.3.0]
[0m[1m[gw7] Python 3.7.12 (default, Jan 15 2022, 18:42:10) -- [GCC 9.3.0]
[0m[1m[gw6] Python 3.7.12 (default, Jan 15 2022, 18:42:10) -- [GCC 9.3.0]
[0mgw0 [15] / gw1 [15] / gw2 [15] / gw3 [15] / gw4 [15] / gw5 [15] / gw6 [15] / gw7 [15]
scheduling tests via LoadFileScheduling
apache_beam/io/gcp/experimental/spannerio_read_it_test.py::SpannerReadIntegrationTest::test_read_via_sql
apache_beam/io/gcp/experimental/spannerio_write_it_test.py::SpannerWriteIntegrationTest::test_metrics_error_call
[gw1] [33mSKIPPED[0m apache_beam/io/gcp/experimental/spannerio_write_it_test.py::SpannerWriteIntegrationTest::test_metrics_error_call
apache_beam/io/gcp/experimental/spannerio_write_it_test.py::SpannerWriteIntegrationTest::test_metrics_ok_call
[gw1] [33mSKIPPED[0m apache_beam/io/gcp/experimental/spannerio_write_it_test.py::SpannerWriteIntegrationTest::test_metrics_ok_call
apache_beam/io/gcp/experimental/spannerio_write_it_test.py::SpannerWriteIntegrationTest::test_spanner_error
[gw0] [32mPASSED[0m apache_beam/io/gcp/experimental/spannerio_read_it_test.py::SpannerReadIntegrationTest::test_read_via_sql
apache_beam/io/gcp/experimental/spannerio_read_it_test.py::SpannerReadIntegrationTest::test_read_via_table
[gw1] [32mPASSED[0m apache_beam/io/gcp/experimental/spannerio_write_it_test.py::SpannerWriteIntegrationTest::test_spanner_error
apache_beam/io/gcp/experimental/spannerio_write_it_test.py::SpannerWriteIntegrationTest::test_spanner_update
[gw1] [32mPASSED[0m apache_beam/io/gcp/experimental/spannerio_write_it_test.py::SpannerWriteIntegrationTest::test_spanner_update
apache_beam/io/gcp/experimental/spannerio_write_it_test.py::SpannerWriteIntegrationTest::test_write_batches
[gw0] [32mPASSED[0m apache_beam/io/gcp/experimental/spannerio_read_it_test.py::SpannerReadIntegrationTest::test_read_via_table
apache_beam/io/gcp/experimental/spannerio_read_it_test.py::SpannerReadIntegrationTest::test_sql_metrics_error_call
[gw0] [33mSKIPPED[0m apache_beam/io/gcp/experimental/spannerio_read_it_test.py::SpannerReadIntegrationTest::test_sql_metrics_error_call
apache_beam/io/gcp/experimental/spannerio_read_it_test.py::SpannerReadIntegrationTest::test_sql_metrics_ok_call
[gw0] [33mSKIPPED[0m apache_beam/io/gcp/experimental/spannerio_read_it_test.py::SpannerReadIntegrationTest::test_sql_metrics_ok_call
apache_beam/io/gcp/experimental/spannerio_read_it_test.py::SpannerReadIntegrationTest::test_table_metrics_error_call
[gw0] [33mSKIPPED[0m apache_beam/io/gcp/experimental/spannerio_read_it_test.py::SpannerReadIntegrationTest::test_table_metrics_error_call
apache_beam/io/gcp/experimental/spannerio_read_it_test.py::SpannerReadIntegrationTest::test_table_metrics_ok_call
[gw0] [33mSKIPPED[0m apache_beam/io/gcp/experimental/spannerio_read_it_test.py::SpannerReadIntegrationTest::test_table_metrics_ok_call
apache_beam/io/gcp/experimental/spannerio_read_it_test.py::SpannerReadIntegrationTest::test_transaction_sql_metrics_error_call
[gw0] [33mSKIPPED[0m apache_beam/io/gcp/experimental/spannerio_read_it_test.py::SpannerReadIntegrationTest::test_transaction_sql_metrics_error_call
apache_beam/io/gcp/experimental/spannerio_read_it_test.py::SpannerReadIntegrationTest::test_transaction_sql_metrics_ok_call
[gw0] [33mSKIPPED[0m apache_beam/io/gcp/experimental/spannerio_read_it_test.py::SpannerReadIntegrationTest::test_transaction_sql_metrics_ok_call
apache_beam/io/gcp/experimental/spannerio_read_it_test.py::SpannerReadIntegrationTest::test_transaction_table_metrics_error_call
[gw0] [33mSKIPPED[0m apache_beam/io/gcp/experimental/spannerio_read_it_test.py::SpannerReadIntegrationTest::test_transaction_table_metrics_error_call
apache_beam/io/gcp/experimental/spannerio_read_it_test.py::SpannerReadIntegrationTest::test_transaction_table_metrics_ok_call
[gw0] [33mSKIPPED[0m apache_beam/io/gcp/experimental/spannerio_read_it_test.py::SpannerReadIntegrationTest::test_transaction_table_metrics_ok_call
[gw1] [32mPASSED[0m apache_beam/io/gcp/experimental/spannerio_write_it_test.py::SpannerWriteIntegrationTest::test_write_batches
[33m=============================== warnings summary ===============================[0m
../../build/gradleenv/-1734967052/lib/python3.7/site-packages/hdfs/config.py:15
../../build/gradleenv/-1734967052/lib/python3.7/site-packages/hdfs/config.py:15
../../build/gradleenv/-1734967052/lib/python3.7/site-packages/hdfs/config.py:15
../../build/gradleenv/-1734967052/lib/python3.7/site-packages/hdfs/config.py:15
../../build/gradleenv/-1734967052/lib/python3.7/site-packages/hdfs/config.py:15
../../build/gradleenv/-1734967052/lib/python3.7/site-packages/hdfs/config.py:15
../../build/gradleenv/-1734967052/lib/python3.7/site-packages/hdfs/config.py:15
../../build/gradleenv/-1734967052/lib/python3.7/site-packages/hdfs/config.py:15
../../build/gradleenv/-1734967052/lib/python3.7/site-packages/hdfs/config.py:15
<https://ci-beam.apache.org/job/beam_PostCommit_Python37/ws/src/build/gradleenv/-1734967052/lib/python3.7/site-packages/hdfs/config.py>:15: DeprecationWarning: the imp module is deprecated in favour of importlib; see the module's documentation for alternative uses
from imp import load_source
apache_beam/io/gcp/experimental/spannerio_read_it_test.py::SpannerReadIntegrationTest::test_read_via_sql
<https://ci-beam.apache.org/job/beam_PostCommit_Python37/ws/src/sdks/python/apache_beam/io/gcp/experimental/spannerio_read_it_test.py>:128: FutureWarning: ReadFromSpanner is experimental. No backwards-compatibility guarantees.
sql="select * from Users")
apache_beam/io/gcp/experimental/spannerio_write_it_test.py::SpannerWriteIntegrationTest::test_spanner_error
<https://ci-beam.apache.org/job/beam_PostCommit_Python37/ws/src/sdks/python/apache_beam/io/gcp/experimental/spannerio_write_it_test.py>:190: FutureWarning: WriteToSpanner is experimental. No backwards-compatibility guarantees.
database_id=self.TEST_DATABASE))
apache_beam/io/gcp/experimental/spannerio_write_it_test.py::SpannerWriteIntegrationTest::test_spanner_update
<https://ci-beam.apache.org/job/beam_PostCommit_Python37/ws/src/sdks/python/apache_beam/io/gcp/experimental/spannerio_write_it_test.py>:171: FutureWarning: WriteToSpanner is experimental. No backwards-compatibility guarantees.
database_id=self.TEST_DATABASE))
apache_beam/io/gcp/experimental/spannerio_read_it_test.py::SpannerReadIntegrationTest::test_read_via_table
<https://ci-beam.apache.org/job/beam_PostCommit_Python37/ws/src/sdks/python/apache_beam/io/gcp/experimental/spannerio_read_it_test.py>:117: FutureWarning: ReadFromSpanner is experimental. No backwards-compatibility guarantees.
columns=["UserId", "Key"])
apache_beam/io/gcp/experimental/spannerio_write_it_test.py::SpannerWriteIntegrationTest::test_write_batches
<https://ci-beam.apache.org/job/beam_PostCommit_Python37/ws/src/sdks/python/apache_beam/io/gcp/experimental/spannerio_write_it_test.py>:135: FutureWarning: WriteToSpanner is experimental. No backwards-compatibility guarantees.
max_batch_size_bytes=250))
-- Docs: https://docs.pytest.org/en/stable/how-to/capture-warnings.html
- generated xml file: <https://ci-beam.apache.org/job/beam_PostCommit_Python37/ws/src/sdks/python/pytest_postCommitIT-df-py37.xml> -
[33m=========== [32m5 passed[0m, [33m[1m12 skipped[0m, [33m[1m14 warnings[0m[33m in 1605.17s (0:26:45)[0m[33m ============[0m
FAILURE: Build failed with an exception.
* Where:
Script '<https://ci-beam.apache.org/job/beam_PostCommit_Python37/ws/src/sdks/python/test-suites/dataflow/common.gradle'> line: 121
* What went wrong:
Execution failed for task ':sdks:python:test-suites:dataflow:py37:postCommitIT'.
> Process 'command 'sh'' finished with non-zero exit value 1
* Try:
> Run with --stacktrace option to get the stack trace.
> Run with --info or --debug option to get more log output.
> Run with --scan to get full insights.
* Get more help at https://help.gradle.org
Deprecated Gradle features were used in this build, making it incompatible with Gradle 8.0.
You can use '--warning-mode all' to show the individual deprecation warnings and determine if they come from your own scripts or plugins.
See https://docs.gradle.org/7.4/userguide/command_line_interface.html#sec:command_line_warnings
Execution optimizations have been disabled for 1 invalid unit(s) of work during this build to ensure correctness.
Please consult deprecation warnings for more details.
BUILD FAILED in 3h 29m 2s
227 actionable tasks: 157 executed, 64 from cache, 6 up-to-date
Publishing build scan...
https://gradle.com/s/wxpn5tn4evjay
Build step 'Invoke Gradle script' changed build result to FAILURE
Build step 'Invoke Gradle script' marked build as failure
---------------------------------------------------------------------
To unsubscribe, e-mail: builds-unsubscribe@beam.apache.org
For additional commands, e-mail: builds-help@beam.apache.org