You are viewing a plain text version of this content. The canonical link for it is here.
Posted to fx-dev@ws.apache.org by Anindita Mahapatra <An...@rocketmail.com> on 2004/07/21 05:31:58 UTC
newbie question
A few days back I downloaded the wss4j code base onto
my xp machine. I was able to do ant compile & ant
javadoc, however doing 'ant test' gives error message:
BUILD FAILED
C:\ws-fx\wss4j\build.xml:400: Following error occured
while executing this line
C:\ws-fx\wss4j\build.xml:457: Test
interop.PackageTests failed
My classpath is:
C:\ws-fx\wss4j>echo %CLASSPATH%
.;C:\axis-1_1\lib\axis.jar;C:\axis-1_1\lib\axis-ant.jar;C:\axis-1_1\lib\commons-discovery.jar;C:\axis-1_1\lib\commons-l
ogging.jar;C:\axis-1_1\lib\jaxrpc.jar;C:\axis-1_1\lib\saaj.jar;C:\axis-1_1\lib\wsdl4j.jar;C:\axis-1_1\lib\log4j-1.2.8.jar;c:\junit3.8.1\junit.jar
Attached is also the interop test report generated
Do I need to add something to my classpath ? Earlier I
had installed axis1.1 is that conflicting ?
thanks
Anindita
__________________________________
Do you Yahoo!?
Read only the mail you want - Yahoo! Mail SpamGuard.
http://promotions.yahoo.com/new_mail
Re: newbie question
Posted by Anindita Mahapatra <An...@rocketmail.com>.
Maybe I didn't understand but I think my problem is
something else.
First I did not findWSconvScenario2.java in the code
base I downloaded.
Moreover the kind of err msgs I'm seeing in
TSET-interop.PackageTests.xml are like:
<testcase classname="interop.TestInteropKeys"
name="testInteropKeys1" time="0.47">
<error
message="org.apache.ws.security.components.crypto.Merlin
cannot create instance"
type="java.lang.RuntimeException">java.lang.RuntimeException:
org.apache.ws.security.components.crypto.Merlin cannot
create instance
at
org.apache.ws.security.components.crypto.CryptoFactory.loadClass(CryptoFactory.java:130)
at
org.apache.ws.security.components.crypto.CryptoFactory.getInstance(CryptoFactory.java:101)
at
interop.TestInteropKeys.testInteropKeys1(TestInteropKeys.java:41)
at
sun.reflect.NativeMethodAccessorImpl.invoke0(Native
Method)
at
sun.reflect.NativeMethodAccessorImpl.invoke(NativeMethodAccessorImpl.java:39)
at
sun.reflect.DelegatingMethodAccessorImpl.invoke(DelegatingMethodAccessorImpl.java:25)
</error>
</testcase>
<testcase classname="interop.TestInteropKeys"
name="testInteropKeys2" time="0.02">
...
<testcase classname="interop.TestScenario1"
name="testScenario1" time="2.844">
<error message="The AXIS engine could not find a
target service to invoke! targetService is Ping1"
type="org.apache.axis.AxisFault">AxisFault
faultCode:
{http://xml.apache.org/axis/}Server.NoService
faultSubcode:
faultString: The AXIS engine could not find a target
service to invoke! targetService is Ping1
--- Jason Essington <ja...@GreenRiverComputing.com>
wrote:
> Well, currently there is a compile error in the
> test/secconv tests,
> however until that changes (likely within a day or
> two) you should be
> able to:
>
> 1) update your copy of wss4j to the most recent
> version from cvs
> cvs update -Pd
>
> 2) delete the broken secconv test (after this test
> is fixed you can skip
> this step)
> del test/secconv/WSconvScenario2.java
>
> 3) ant clean jar
> The jar target compiles and runs the tests
> before it actually builds
> the jar.
>
> This works just fine for me with java 1.4.x and ant
> 1.6.x on both linux
> and MacOS X. You should not have to be concerned
> about what is in your
> classpath as ant handles the classpath details for
> the build process.
>
> wss4j does require axis1.2 but it has its own copy.
>
> One note however, I have had to download the
> junit.jar and place it in
> the [ANT_HOME]/lib directory to get the tests to
> run.
>
> -jason
>
> On Tue, 2004-07-20 at 21:31, Anindita Mahapatra
> wrote:
> > A few days back I downloaded the wss4j code base
> onto
> > my xp machine. I was able to do ant compile & ant
> > javadoc, however doing 'ant test' gives error
> message:
> > BUILD FAILED
> > C:\ws-fx\wss4j\build.xml:400: Following error
> occured
> > while executing this line
> > C:\ws-fx\wss4j\build.xml:457: Test
> > interop.PackageTests failed
> >
> > My classpath is:
> > C:\ws-fx\wss4j>echo %CLASSPATH%
> >
>
.;C:\axis-1_1\lib\axis.jar;C:\axis-1_1\lib\axis-ant.jar;C:\axis-1_1\lib\commons-discovery.jar;C:\axis-1_1\lib\commons-l
> >
>
ogging.jar;C:\axis-1_1\lib\jaxrpc.jar;C:\axis-1_1\lib\saaj.jar;C:\axis-1_1\lib\wsdl4j.jar;C:\axis-1_1\lib\log4j-1.2.8.jar;c:\junit3.8.1\junit.jar
> >
> > Attached is also the interop test report generated
>
> > Do I need to add something to my classpath ?
> Earlier I
> > had installed axis1.1 is that conflicting ?
> >
> > thanks
> > Anindita
> >
> >
> >
> >
> > __________________________________
> > Do you Yahoo!?
> > Read only the mail you want - Yahoo! Mail
> SpamGuard.
> > http://promotions.yahoo.com/new_mail
> >
> >
>
______________________________________________________________________
> > <?xml version="1.0" encoding="UTF-8" ?>
> > <testsuite errors="12" failures="0"
> name="interop.PackageTests" tests="12" time="5.668">
> > <properties>
> > <property name="java.vendor" value="Sun
> Microsystems Inc."></property>
> > <property name="http.proxyPassword"
> value=""></property>
> > <property name="dir.libs"
> value="./lib"></property>
> > <property name="dir.dist"
> value="./dist"></property>
> > <property name="os.name" value="Windows
> XP"></property>
> > <property name="sun.boot.class.path"
>
value="C:\ws-fx\wss4j/endorsed\dom3-xercesImpl-2_6_2.jar;C:\ws-fx\wss4j/endorsed\dom3-xml-apis-2_6_2.jar;C:\j2sdk1.4.2\jre\lib\rt.jar;C:\j2sdk1.4.2\jre\lib\i18n.jar;C:\j2sdk1.4.2\jre\lib\sunrsasign.jar;C:\j2sdk1.4.2\jre\lib\jsse.jar;C:\j2sdk1.4.2\jre\lib\jce.jar;C:\j2sdk1.4.2\jre\lib\charsets.jar;C:\j2sdk1.4.2\jre\classes"></property>
> > <property name="TODAY" value="July 20
> 2004"></property>
> > <property name="sun.java2d.fontpath"
> value=""></property>
> > <property name="java.vm.specification.vendor"
> value="Sun Microsystems Inc."></property>
> > <property name="ant.home"
> value="C:\apache-ant-1.6.1"></property>
> > <property name="java.runtime.version"
> value="1.4.2-b28"></property>
> > <property name="http.proxyPort"
> value=""></property>
> > <property name="user.name"
> value="Sony_Partha"></property>
> > <property name="dir.specs"
> value="./specs"></property>
> > <property name="build.dir"
> value="./build"></property>
> > <property name="user.language"
> value="en"></property>
> > <property name="build.javadoc"
> value="./build/doc/html/api"></property>
> > <property name="sun.boot.library.path"
> value="C:\j2sdk1.4.2\jre\bin"></property>
> > <property name="product.Version"
> value="1.0.Beta"></property>
> > <property name="http.proxyUser"
> value=""></property>
> > <property name="ant.project.name" value="Web
> Services Security (WSS4J)"></property>
> > <property name="DSTAMP"
> value="20040720"></property>
> > <property name="java.version"
> value="1.4.2"></property>
> > <property name="user.timezone"
> value=""></property>
> > <property name="sun.arch.data.model"
> value="32"></property>
> > <property name="dir.endorsed.libs"
> value="./endorsed"></property>
> > <property name="build.doc"
> value="./build/doc"></property>
> > <property name="http.nonProxyHosts"
> value="localhost"></property>
> > <property name="java.endorsed.dirs"
> value="C:\ws-fx\wss4j/endorsed"></property>
> > <property name="sun.cpu.isalist"
> value="pentium i486 i386"></property>
> > <property name="product.name"
> value="wss4j"></property>
> > <property name="file.encoding.pkg"
> value="sun.io"></property>
> > <property name="undeploy_xml_property"
>
value="C:\ws-fx\wss4j\build\work\org\apache\ws\axis\oasis\ping\undeploy.wsdd;C:\ws-fx\wss4j\build\work\secconv\undeploy.wsdd"></property>
> > <property name="file.separator"
> value="\"></property>
> > <property name="java.specification.name"
> value="Java Platform API Specification"></property>
> > <property name="javadoc.packages" value="
> org.apache.ws.security,
> org.apache.ws.security.components,
> org.apache.ws.security.components.crypto,
> org.apache.ws.security.message,
> org.apache.ws.security.message.token,
> org.apache.ws.security.util, org.apache.ws.axis,
> org.apache.ws.axis.security,
> org.apache.ws.axis.security.util "></property>
> > <property name="java.class.version"
> value="48.0"></property>
> > <property name="user.country"
> value="US"></property>
> > <property name="dir.keys"
> value="./keys"></property>
> > <property name="java.home"
> value="C:\j2sdk1.4.2\jre"></property>
> > <property name="dir.webapp"
> value="C:\ws-fx\wss4j\webapps\axis"></property>
> > <property name="java.vm.info" value="mixed
> mode"></property>
> > <property name="ant.file"
> value="C:\ws-fx\wss4j\build.xml"></property>
> > <property name="build.junit.html"
> value="./build/doc/html/junit"></property>
> > <property name="os.version"
> value="5.1"></property>
> > <property name="product_version"
> value="1_0_Beta"></property>
> > <property name="product.version.major"
> value="1"></property>
> > <property name="path.separator"
> value=";"></property>
> > <property name="java.vm.version"
> value="1.4.2-b28"></property>
> > <property name="build.doc.xml"
> value="./build/doc/xml"></property>
> > <property
> name="java.util.prefs.PreferencesFactory"
>
value="java.util.prefs.WindowsPreferencesFactory"></property>
> > <property name="user.variant"
> value=""></property>
> > <property name="ant.library.dir"
> value="C:\apache-ant-1.6.1\lib"></property>
> > <property name="classpath.test.as.string"
>
value="C:\ws-fx\wss4j\build\classes;C:\ws-fx\wss4j\build\wss4j.jar;C:\ws-fx\wss4j\lib\axis-ant.jar;C:\ws-fx\wss4j\lib\axis.jar;C:\ws-fx\wss4j\lib\commons-codec-1.2.jar;C:\ws-fx\wss4j\lib\commons-discovery.jar;C:\ws-fx\wss4j\lib\commons-httpclient-3.0-alpha1.jar;C:\ws-fx\wss4j\lib\commons-logging.jar;C:\ws-fx\wss4j\lib\jaxrpc.jar;C:\ws-fx\wss4j\lib\jce-jdk13-123.jar;C:\ws-fx\wss4j\lib\junit-3.8.1.jar;C:\ws-fx\wss4j\lib\log4j-1.2.8.jar;C:\ws-fx\wss4j\lib\opensaml.jar;C:\ws-fx\wss4j\lib\saaj.jar;C:\ws-fx\wss4j\lib\wsdl4j.jar;C:\ws-fx\wss4j\lib\xalan.jar;C:\ws-fx\wss4j\lib\xmlsec.jar;C:\ws-fx\wss4j\endorsed\dom3-xercesImpl-2_6_2.jar;C:\ws-fx\wss4j\endorsed\dom3-xml-apis-2_6_2.jar;C:\apache-ant-1.6.1\lib\ant-launcher.jar;C:\ws-fx\wss4j;C:\cci.jar;C:\axis-1_1\lib\axis.jar;C:\axis-1_1\lib\commons-discovery.jar;C:\ws-fx\wss4j\
>
C;C:\axis-1_1\lib\commons-logging.jar;C:\axis-1_1\lib\jaxrpc.jar;C:\axis-1_1\lib\saaj.jar;C:\axis-1_1\lib\xml-apis.jar;C:\axis-1_1\lib\xercesImpl.jar;C:\axis-1_1\lib\wsdl4j.jar;C:\axis-1_1\lib\log4j-1.2.8.jar;C:\axis-1_1\lib\activation.jar;C:\axis-1_1\lib\axis-ant.jar;C:\axis-1_1\lib\tools.jar;C:\axis-1_1\lib;C:\axis-1_1;C:\junit3.8.1\junit.jar;C:\apache-ant-1.6.1\lib\ant-antlr.jar;C:\apache-ant-1.6.1\lib\ant-apache-bsf.jar;C:\apache-ant-1.6.1\lib\ant-apache-resolver.jar;C:\apache-ant-1.6.1\lib\ant-commons-logging.jar;C:\apache-ant-1.6.1\lib\ant-commons-net.jar;C:\apache-ant-1.6.1\lib\ant-icontract.jar;C:\apache-ant-1.6.1\lib\ant-jai.jar;C:\apache-ant-1.6.1\lib\ant-jakarta-bcel.jar;C:\apache-ant-1.6.1\lib\ant-jakarta-log4j.jar;C:\apache-ant-1.6.1\lib\ant-jakarta-oro.jar;C:\apache-ant-1.6.1\lib\ant-jakarta-regexp.jar;C:\apache-ant-1.6.1\lib\ant-javamail.jar;C:\apache-ant-1.6.1\lib\ant-jdepend.jar;C:\apache-ant-1.6.1\lib\ant-jmf.jar;C:\apache-ant-1.6.1\lib\ant-jsch.jar;C:\apache-ant-1.
6.1\lib\ant-junit.jar;C:\apache-ant-1.6.1\lib\ant-netrexx.jar;C:\apache-ant-1.6.1\lib\ant-nodeps.jar;C:\apache-ant-1.6.1\lib\ant-starteam.jar;C:\apache-ant-1.6.1\lib\ant-stylebook.jar;C:\apache-ant-1.6.1\lib\ant-swing.jar;C:\apache-ant-1.6.1\lib\ant-trax.jar;C:\apache-ant-1.6.1\lib\ant-vaj.jar;C:\apache-ant-1.6.1\lib\ant-weblogic.jar;C:\apache-ant-1.6.1\lib\ant-xalan1.jar;C:\apache-ant-1.6.1\lib\ant-xalan2.jar;C:\apache-ant-1.6.1\lib\ant-xslp.jar;C:\apache-ant-1.6.1\lib\ant.jar;C:\apache-ant-1.6.1\lib\xercesImpl.jar;C:\apache-ant-1.6.1\lib\xml-apis.jar;C:\j2sdk1.4.2\lib\tools.jar"></property>
> > <property name="build.webapp"
>
value="C:\ws-fx\wss4j\build\webapps\axis"></property>
> > <property name="product.Name"
> value="Apache-WS-Security-J"></property>
>
=== message truncated ===
__________________________________
Do you Yahoo!?
Vote for the stars of Yahoo!'s next ad campaign!
http://advision.webevents.yahoo.com/yahoo/votelifeengine/
Re: newbie question
Posted by Jason Essington <ja...@GreenRiverComputing.com>.
Well, currently there is a compile error in the test/secconv tests,
however until that changes (likely within a day or two) you should be
able to:
1) update your copy of wss4j to the most recent version from cvs
cvs update -Pd
2) delete the broken secconv test (after this test is fixed you can skip
this step)
del test/secconv/WSconvScenario2.java
3) ant clean jar
The jar target compiles and runs the tests before it actually builds
the jar.
This works just fine for me with java 1.4.x and ant 1.6.x on both linux
and MacOS X. You should not have to be concerned about what is in your
classpath as ant handles the classpath details for the build process.
wss4j does require axis1.2 but it has its own copy.
One note however, I have had to download the junit.jar and place it in
the [ANT_HOME]/lib directory to get the tests to run.
-jason
On Tue, 2004-07-20 at 21:31, Anindita Mahapatra wrote:
> A few days back I downloaded the wss4j code base onto
> my xp machine. I was able to do ant compile & ant
> javadoc, however doing 'ant test' gives error message:
> BUILD FAILED
> C:\ws-fx\wss4j\build.xml:400: Following error occured
> while executing this line
> C:\ws-fx\wss4j\build.xml:457: Test
> interop.PackageTests failed
>
> My classpath is:
> C:\ws-fx\wss4j>echo %CLASSPATH%
> .;C:\axis-1_1\lib\axis.jar;C:\axis-1_1\lib\axis-ant.jar;C:\axis-1_1\lib\commons-discovery.jar;C:\axis-1_1\lib\commons-l
> ogging.jar;C:\axis-1_1\lib\jaxrpc.jar;C:\axis-1_1\lib\saaj.jar;C:\axis-1_1\lib\wsdl4j.jar;C:\axis-1_1\lib\log4j-1.2.8.jar;c:\junit3.8.1\junit.jar
>
> Attached is also the interop test report generated
> Do I need to add something to my classpath ? Earlier I
> had installed axis1.1 is that conflicting ?
>
> thanks
> Anindita
>
>
>
>
> __________________________________
> Do you Yahoo!?
> Read only the mail you want - Yahoo! Mail SpamGuard.
> http://promotions.yahoo.com/new_mail
>
> ______________________________________________________________________
> <?xml version="1.0" encoding="UTF-8" ?>
> <testsuite errors="12" failures="0" name="interop.PackageTests" tests="12" time="5.668">
> <properties>
> <property name="java.vendor" value="Sun Microsystems Inc."></property>
> <property name="http.proxyPassword" value=""></property>
> <property name="dir.libs" value="./lib"></property>
> <property name="dir.dist" value="./dist"></property>
> <property name="os.name" value="Windows XP"></property>
> <property name="sun.boot.class.path" value="C:\ws-fx\wss4j/endorsed\dom3-xercesImpl-2_6_2.jar;C:\ws-fx\wss4j/endorsed\dom3-xml-apis-2_6_2.jar;C:\j2sdk1.4.2\jre\lib\rt.jar;C:\j2sdk1.4.2\jre\lib\i18n.jar;C:\j2sdk1.4.2\jre\lib\sunrsasign.jar;C:\j2sdk1.4.2\jre\lib\jsse.jar;C:\j2sdk1.4.2\jre\lib\jce.jar;C:\j2sdk1.4.2\jre\lib\charsets.jar;C:\j2sdk1.4.2\jre\classes"></property>
> <property name="TODAY" value="July 20 2004"></property>
> <property name="sun.java2d.fontpath" value=""></property>
> <property name="java.vm.specification.vendor" value="Sun Microsystems Inc."></property>
> <property name="ant.home" value="C:\apache-ant-1.6.1"></property>
> <property name="java.runtime.version" value="1.4.2-b28"></property>
> <property name="http.proxyPort" value=""></property>
> <property name="user.name" value="Sony_Partha"></property>
> <property name="dir.specs" value="./specs"></property>
> <property name="build.dir" value="./build"></property>
> <property name="user.language" value="en"></property>
> <property name="build.javadoc" value="./build/doc/html/api"></property>
> <property name="sun.boot.library.path" value="C:\j2sdk1.4.2\jre\bin"></property>
> <property name="product.Version" value="1.0.Beta"></property>
> <property name="http.proxyUser" value=""></property>
> <property name="ant.project.name" value="Web Services Security (WSS4J)"></property>
> <property name="DSTAMP" value="20040720"></property>
> <property name="java.version" value="1.4.2"></property>
> <property name="user.timezone" value=""></property>
> <property name="sun.arch.data.model" value="32"></property>
> <property name="dir.endorsed.libs" value="./endorsed"></property>
> <property name="build.doc" value="./build/doc"></property>
> <property name="http.nonProxyHosts" value="localhost"></property>
> <property name="java.endorsed.dirs" value="C:\ws-fx\wss4j/endorsed"></property>
> <property name="sun.cpu.isalist" value="pentium i486 i386"></property>
> <property name="product.name" value="wss4j"></property>
> <property name="file.encoding.pkg" value="sun.io"></property>
> <property name="undeploy_xml_property" value="C:\ws-fx\wss4j\build\work\org\apache\ws\axis\oasis\ping\undeploy.wsdd;C:\ws-fx\wss4j\build\work\secconv\undeploy.wsdd"></property>
> <property name="file.separator" value="\"></property>
> <property name="java.specification.name" value="Java Platform API Specification"></property>
> <property name="javadoc.packages" value=" org.apache.ws.security, org.apache.ws.security.components, org.apache.ws.security.components.crypto, org.apache.ws.security.message, org.apache.ws.security.message.token, org.apache.ws.security.util, org.apache.ws.axis, org.apache.ws.axis.security, org.apache.ws.axis.security.util "></property>
> <property name="java.class.version" value="48.0"></property>
> <property name="user.country" value="US"></property>
> <property name="dir.keys" value="./keys"></property>
> <property name="java.home" value="C:\j2sdk1.4.2\jre"></property>
> <property name="dir.webapp" value="C:\ws-fx\wss4j\webapps\axis"></property>
> <property name="java.vm.info" value="mixed mode"></property>
> <property name="ant.file" value="C:\ws-fx\wss4j\build.xml"></property>
> <property name="build.junit.html" value="./build/doc/html/junit"></property>
> <property name="os.version" value="5.1"></property>
> <property name="product_version" value="1_0_Beta"></property>
> <property name="product.version.major" value="1"></property>
> <property name="path.separator" value=";"></property>
> <property name="java.vm.version" value="1.4.2-b28"></property>
> <property name="build.doc.xml" value="./build/doc/xml"></property>
> <property name="java.util.prefs.PreferencesFactory" value="java.util.prefs.WindowsPreferencesFactory"></property>
> <property name="user.variant" value=""></property>
> <property name="ant.library.dir" value="C:\apache-ant-1.6.1\lib"></property>
> <property name="classpath.test.as.string" value="C:\ws-fx\wss4j\build\classes;C:\ws-fx\wss4j\build\wss4j.jar;C:\ws-fx\wss4j\lib\axis-ant.jar;C:\ws-fx\wss4j\lib\axis.jar;C:\ws-fx\wss4j\lib\commons-codec-1.2.jar;C:\ws-fx\wss4j\lib\commons-discovery.jar;C:\ws-fx\wss4j\lib\commons-httpclient-3.0-alpha1.jar;C:\ws-fx\wss4j\lib\commons-logging.jar;C:\ws-fx\wss4j\lib\jaxrpc.jar;C:\ws-fx\wss4j\lib\jce-jdk13-123.jar;C:\ws-fx\wss4j\lib\junit-3.8.1.jar;C:\ws-fx\wss4j\lib\log4j-1.2.8.jar;C:\ws-fx\wss4j\lib\opensaml.jar;C:\ws-fx\wss4j\lib\saaj.jar;C:\ws-fx\wss4j\lib\wsdl4j.jar;C:\ws-fx\wss4j\lib\xalan.jar;C:\ws-fx\wss4j\lib\xmlsec.jar;C:\ws-fx\wss4j\endorsed\dom3-xercesImpl-2_6_2.jar;C:\ws-fx\wss4j\endorsed\dom3-xml-apis-2_6_2.jar;C:\apache-ant-1.6.1\lib\ant-launcher.jar;C:\ws-fx\wss4j;C:\cci.jar;C:\axis-1_1\lib\axis.jar;C:\axis-1_1\lib\commons-discovery.jar;C:\ws-fx\wss4j\ C;C:\axis-1_1\lib\commons-logging.jar;C:\axis-1_1\lib\jaxrpc.jar;C:\axis-1_1\lib\saaj.jar;C:\axis-1_1\lib\xml-apis.jar;C:\axis-1_1\lib\xercesImpl.jar;C:\axis-1_1\lib\wsdl4j.jar;C:\axis-1_1\lib\log4j-1.2.8.jar;C:\axis-1_1\lib\activation.jar;C:\axis-1_1\lib\axis-ant.jar;C:\axis-1_1\lib\tools.jar;C:\axis-1_1\lib;C:\axis-1_1;C:\junit3.8.1\junit.jar;C:\apache-ant-1.6.1\lib\ant-antlr.jar;C:\apache-ant-1.6.1\lib\ant-apache-bsf.jar;C:\apache-ant-1.6.1\lib\ant-apache-resolver.jar;C:\apache-ant-1.6.1\lib\ant-commons-logging.jar;C:\apache-ant-1.6.1\lib\ant-commons-net.jar;C:\apache-ant-1.6.1\lib\ant-icontract.jar;C:\apache-ant-1.6.1\lib\ant-jai.jar;C:\apache-ant-1.6.1\lib\ant-jakarta-bcel.jar;C:\apache-ant-1.6.1\lib\ant-jakarta-log4j.jar;C:\apache-ant-1.6.1\lib\ant-jakarta-oro.jar;C:\apache-ant-1.6.1\lib\ant-jakarta-regexp.jar;C:\apache-ant-1.6.1\lib\ant-javamail.jar;C:\apache-ant-1.6.1\lib\ant-jdepend.jar;C:\apache-ant-1.6.1\lib\ant-jmf.jar;C:\apache-ant-1.6.1\lib\ant-jsch.jar;C:\apache-ant-1.6.1\lib\ant-junit.jar;C:\apache-ant-1.6.1\lib\ant-netrexx.jar;C:\apache-ant-1.6.1\lib\ant-nodeps.jar;C:\apache-ant-1.6.1\lib\ant-starteam.jar;C:\apache-ant-1.6.1\lib\ant-stylebook.jar;C:\apache-ant-1.6.1\lib\ant-swing.jar;C:\apache-ant-1.6.1\lib\ant-trax.jar;C:\apache-ant-1.6.1\lib\ant-vaj.jar;C:\apache-ant-1.6.1\lib\ant-weblogic.jar;C:\apache-ant-1.6.1\lib\ant-xalan1.jar;C:\apache-ant-1.6.1\lib\ant-xalan2.jar;C:\apache-ant-1.6.1\lib\ant-xslp.jar;C:\apache-ant-1.6.1\lib\ant.jar;C:\apache-ant-1.6.1\lib\xercesImpl.jar;C:\apache-ant-1.6.1\lib\xml-apis.jar;C:\j2sdk1.4.2\lib\tools.jar"></property>
> <property name="build.webapp" value="C:\ws-fx\wss4j\build\webapps\axis"></property>
> <property name="product.Name" value="Apache-WS-Security-J"></property>
> <property name="java.awt.printerjob" value="sun.awt.windows.WPrinterJob"></property>
> <property name="product.version.minor" value="0"></property>
> <property name="sun.io.unicode.encoding" value="UnicodeLittle"></property>
> <property name="awt.toolkit" value="sun.awt.windows.WToolkit"></property>
> <property name="jar.library" value="wss4j.jar"></property>
> <property name="product.version" value="1.0.Beta"></property>
> <property name="user.home" value="C:\Documents and Settings\Sony_Partha"></property>
> <property name="dir.samples" value="./samples"></property>
> <property name="java.specification.vendor" value="Sun Microsystems Inc."></property>
> <property name="dir.test" value="./test"></property>
> <property name="dir.doc" value="./doc"></property>
> <property name="java.library.path" value="C:\j2sdk1.4.2\jre\bin;.;C:\WINDOWS\System32;C:\WINDOWS;C:/DCPANT/MKSNT/MKSNT;C:\WINDOWS\system32;C:\WINDOWS;C:\WINDOWS\System32\Wbem;C:\j2sdk1.4.2\bin;C:/DCPANT/MKSNT/MKSNT;C:\WINDOWS\system32;C:\WINDOWS;C:\WINDOWS\System32\Wbem;C:\j2sdk1.4.2\bin;C:\apache-ant-1.6.1\bin"></property>
> <property name="java.vendor.url" value="http://java.sun.com/"></property>
> <property name="java.vm.vendor" value="Sun Microsystems Inc."></property>
> <property name="java.runtime.name" value="Java(TM) 2 Runtime Environment, Standard Edition"></property>
> <property name="dir.src" value="./src"></property>
> <property name="copyright" value="Copyright © 2004 Apache WS-Security Project. All Rights Reserved."></property>
> <property name="ant.version" value="Apache Ant version 1.6.1 compiled on February 12 2004"></property>
> <property name="year" value="2004"></property>
> <property name="java.class.path" value="C:\ws-fx\wss4j\build\classes;C:\ws-fx\wss4j\lib\axis-ant.jar;C:\ws-fx\wss4j\lib\axis.jar;C:\ws-fx\wss4j\lib\commons-codec-1.2.jar;C:\ws-fx\wss4j\lib\commons-discovery.jar;C:\ws-fx\wss4j\lib\commons-httpclient-3.0-alpha1.jar;C:\ws-fx\wss4j\lib\commons-logging.jar;C:\ws-fx\wss4j\lib\jaxrpc.jar;C:\ws-fx\wss4j\lib\jce-jdk13-123.jar;C:\ws-fx\wss4j\lib\junit-3.8.1.jar;C:\ws-fx\wss4j\lib\log4j-1.2.8.jar;C:\ws-fx\wss4j\lib\opensaml.jar;C:\ws-fx\wss4j\lib\saaj.jar;C:\ws-fx\wss4j\lib\wsdl4j.jar;C:\ws-fx\wss4j\lib\xalan.jar;C:\ws-fx\wss4j\lib\xmlsec.jar;C:\ws-fx\wss4j\endorsed\dom3-xercesImpl-2_6_2.jar;C:\ws-fx\wss4j\endorsed\dom3-xml-apis-2_6_2.jar;C:\apache-ant-1.6.1\lib\ant-launcher.jar;C:\ws-fx\wss4j;C:\cci.jar;C:\axis-1_1\lib\axis.jar;C:\axis-1_1\lib\commons-discovery.jar;C:\axis-1_1\lib\commons-logging.jar;C:\axis-1_1\lib\jaxrpc.jar;C:\axis-1_1\lib\saaj.jar;C:\axis-1_1\lib\xml-apis.jar;C:\axis-1_1\lib\xercesImpl.jar;C:\axis-1_1\lib\wsdl4j.jar;C:\axis-1_1\lib\log4j-1.2.8.jar;C:\axis-1_1\lib\activation.jar;C:\axis-1_1\lib\axis-ant.jar;C:\axis-1_1\lib\tools.jar;C:\axis-1_1\lib;C:\axis-1_1;C:\junit3.8.1\junit.jar;C:\apache-ant-1.6.1\lib\ant-antlr.jar;C:\apache-ant-1.6.1\lib\ant-apache-bsf.jar;C:\apache-ant-1.6.1\lib\ant-apache-resolver.jar;C:\apache-ant-1.6.1\lib\ant-commons-logging.jar;C:\apache-ant-1.6.1\lib\ant-commons-net.jar;C:\apache-ant-1.6.1\lib\ant-icontract.jar;C:\apache-ant-1.6.1\lib\ant-jai.jar;C:\apache-ant-1.6.1\lib\ant-jakarta-bcel.jar;C:\apache-ant-1.6.1\lib\ant-jakarta-log4j.jar;C:\apache-ant-1.6.1\lib\ant-jakarta-oro.jar;C:\apache-ant-1.6.1\lib\ant-jakarta-regexp.jar;C:\apache-ant-1.6.1\lib\ant-javamail.jar;C:\apache-ant-1.6.1\lib\ant-jdepend.jar;C:\apache-ant-1.6.1\lib\ant-jmf.jar;C:\apache-ant-1.6.1\lib\ant-jsch.jar;C:\apache-ant-1.6.1\lib\ant-junit.jar;C:\apache-ant-1.6.1\lib\ant-netrexx.jar;C:\apache-ant-1.6.1\lib\ant-nodeps.jar;C:\apache-ant-1.6.1\lib\ant-starteam.jar;C:\apache-ant-1.6.1\lib\ant-stylebook.jar;C:\apache-ant-1.6.1\lib\ant-swing.jar;C:\apache-ant-1.6.1\lib\ant-trax.jar;C:\apache-ant-1.6.1\lib\ant-vaj.jar;C:\apache-ant-1.6.1\lib\ant-weblogic.jar;C:\apache-ant-1.6.1\lib\ant-xalan1.jar;C:\apache-ant-1.6.1\lib\ant-xalan2.jar;C:\apache-ant-1.6.1\lib\ant-xslp.jar;C:\apache-ant-1.6.1\lib\ant.jar;C:\apache-ant-1.6.1\lib\xercesImpl.jar;C:\apache-ant-1.6.1\lib\xml-apis.jar;C:\j2sdk1.4.2\lib\tools.jar"></property>
> <property name="TSTAMP" value="2306"></property>
> <property name="build.doc.html" value="./build/doc/html"></property>
> <property name="java.vm.specification.name" value="Java Virtual Machine Specification"></property>
> <property name="java.vm.specification.version" value="1.0"></property>
> <property name="build.junit.xml" value="./build/doc/xml/junit"></property>
> <property name="build.classes" value="./build/classes"></property>
> <property name="sun.os.patch.level" value="Service Pack 1"></property>
> <property name="sun.cpu.endian" value="little"></property>
> <property name="java.io.tmpdir" value="C:\DOCUME~1\SONY_P~1\LOCALS~1\Temp\"></property>
> <property name="junit.present" value="true"></property>
> <property name="java.vendor.url.bug" value="http://java.sun.com/cgi-bin/bugreport.cgi"></property>
> <property name="http.proxyHost" value=""></property>
> <property name="java.awt.graphicsenv" value="sun.awt.Win32GraphicsEnvironment"></property>
> <property name="os.arch" value="x86"></property>
> <property name="ant.file.Web Services Security (WSS4J)" value="C:\ws-fx\wss4j\build.xml"></property>
> <property name="java.ext.dirs" value="C:\j2sdk1.4.2\jre\lib\ext"></property>
> <property name="user.dir" value="C:\ws-fx\wss4j"></property>
> <property name="line.separator" value="
> "></property>
> <property name="deploy_xml_property" value="C:\ws-fx\wss4j\build\work\org\apache\ws\axis\oasis\ping\deploy.wsdd;C:\ws-fx\wss4j\build\work\secconv\deploy.wsdd"></property>
> <property name="java.vm.name" value="Java HotSpot(TM) Client VM"></property>
> <property name="dir.interop" value="./interop"></property>
> <property name="bc.present" value="true"></property>
> <property name="basedir" value="C:\ws-fx\wss4j"></property>
> <property name="product.shortname" value="wss4j"></property>
> <property name="ant.java.version" value="1.4"></property>
> <property name="file.encoding" value="Cp1252"></property>
> <property name="build.work" value="./build/work"></property>
> <property name="jdk14.present" value="true"></property>
> <property name="java.specification.version" value="1.4"></property>
> <property name="product.version.level" value="Beta"></property>
> </properties>
> <testcase classname="interop.TestInteropKeys" name="testInteropKeys1" time="0.711">
> <error message="org.apache.ws.security.components.crypto.Merlin cannot create instance" type="java.lang.RuntimeException">java.lang.RuntimeException: org.apache.ws.security.components.crypto.Merlin cannot create instance
> at org.apache.ws.security.components.crypto.CryptoFactory.loadClass(CryptoFactory.java:130)
> at org.apache.ws.security.components.crypto.CryptoFactory.getInstance(CryptoFactory.java:101)
> at interop.TestInteropKeys.testInteropKeys1(TestInteropKeys.java:41)
> at sun.reflect.NativeMethodAccessorImpl.invoke0(Native Method)
> at sun.reflect.NativeMethodAccessorImpl.invoke(NativeMethodAccessorImpl.java:39)
> at sun.reflect.DelegatingMethodAccessorImpl.invoke(DelegatingMethodAccessorImpl.java:25)
> </error>
> </testcase>
> <testcase classname="interop.TestInteropKeys" name="testInteropKeys2" time="0.01">
> <error message="org.apache.ws.security.components.crypto.Merlin cannot create instance" type="java.lang.RuntimeException">java.lang.RuntimeException: org.apache.ws.security.components.crypto.Merlin cannot create instance
> at org.apache.ws.security.components.crypto.CryptoFactory.loadClass(CryptoFactory.java:130)
> at org.apache.ws.security.components.crypto.CryptoFactory.getInstance(CryptoFactory.java:101)
> at interop.TestInteropKeys.testInteropKeys2(TestInteropKeys.java:50)
> at sun.reflect.NativeMethodAccessorImpl.invoke0(Native Method)
> at sun.reflect.NativeMethodAccessorImpl.invoke(NativeMethodAccessorImpl.java:39)
> at sun.reflect.DelegatingMethodAccessorImpl.invoke(DelegatingMethodAccessorImpl.java:25)
> </error>
> </testcase>
> <testcase classname="interop.TestScenario1" name="testScenario1" time="2.374">
> <error message="The AXIS engine could not find a target service to invoke! targetService is Ping1" type="org.apache.axis.AxisFault">AxisFault
> faultCode: {http://xml.apache.org/axis/}Server.NoService
> faultSubcode:
> faultString: The AXIS engine could not find a target service to invoke! targetService is Ping1
> faultActor:
> faultNode:
> faultDetail:
> {http://xml.apache.org/axis/}stackTrace:AxisFault
> faultCode: {http://xml.apache.org/axis/}Server.NoService
> faultSubcode:
> faultString: The AXIS engine could not find a target service to invoke! targetService is Ping1
> faultActor:
> faultNode:
> faultDetail:
>
> The AXIS engine could not find a target service to invoke! targetService is Ping1
> at org.apache.axis.message.SOAPFaultBuilder.createFault(SOAPFaultBuilder.java:223)
> at org.apache.axis.message.SOAPFaultBuilder.endElement(SOAPFaultBuilder.java:130)
> at org.apache.axis.encoding.DeserializationContextImpl.endElement(DeserializationContextImpl.java:1060)
> at org.apache.xerces.parsers.AbstractSAXParser.endElement(Unknown Source)
> at org.apache.xerces.impl.XMLNSDocumentScannerImpl.scanEndElement(Unknown Source)
> at org.apache.xerces.impl.XMLDocumentFragmentScannerImpl$FragmentContentDispatcher.dispatch(Unknown Source)
> at org.apache.xerces.impl.XMLDocumentFragmentScannerImpl.scanDocument(Unknown Source)
> at org.apache.xerces.parsers.XML11Configuration.parse(Unknown Source)
> at org.apache.xerces.parsers.XML11Configuration.parse(Unknown Source)
> at org.apache.xerces.parsers.XMLParser.parse(Unknown Source)
> at org.apache.xerces.parsers.AbstractSAXParser.parse(Unknown Source)
> at javax.xml.parsers.SAXParser.parse(Unknown Source)
> at org.apache.axis.encoding.DeserializationContextImpl.parse(DeserializationContextImpl.java:218)
> at org.apache.axis.SOAPPart.getAsSOAPEnvelope(SOAPPart.java:646)
> at org.apache.axis.Message.getSOAPEnvelope(Message.java:424)
> at org.apache.axis.handlers.soap.MustUnderstandChecker.invoke(MustUnderstandChecker.java:61)
> at org.apache.axis.client.AxisClient.invoke(AxisClient.java:173)
> at org.apache.axis.client.Call.invokeEngine(Call.java:2735)
> at org.apache.axis.client.Call.invoke(Call.java:2718)
> at org.apache.axis.client.Call.invoke(Call.java:2394)
> at org.apache.axis.client.Call.invoke(Call.java:2317)
> at org.apache.axis.client.Call.invoke(Call.java:1774)
> at org.apache.ws.axis.oasis.ping.PingBindingStub.ping(PingBindingStub.java:137)
> at org.apache.ws.axis.oasis.Scenario1.main(Scenario1.java:86)
> at interop.TestScenario1.testScenario1(TestScenario1.java:63)
> at sun.reflect.NativeMethodAccessorImpl.invoke0(Native Method)
> at sun.reflect.NativeMethodAccessorImpl.invoke(NativeMethodAccessorImpl.java:39)
> at sun.reflect.DelegatingMethodAccessorImpl.invoke(DelegatingMethodAccessorImpl.java:25)
>
> {http://xml.apache.org/axis/}hostname:DH76W321
>
> The AXIS engine could not find a target service to invoke! targetService is Ping1
> at org.apache.axis.message.SOAPFaultBuilder.createFault(SOAPFaultBuilder.java:223)
> at org.apache.axis.message.SOAPFaultBuilder.endElement(SOAPFaultBuilder.java:130)
> at org.apache.axis.encoding.DeserializationContextImpl.endElement(DeserializationContextImpl.java:1060)
> at org.apache.xerces.parsers.AbstractSAXParser.endElement(Unknown Source)
> at org.apache.xerces.impl.XMLNSDocumentScannerImpl.scanEndElement(Unknown Source)
> at org.apache.xerces.impl.XMLDocumentFragmentScannerImpl$FragmentContentDispatcher.dispatch(Unknown Source)
> at org.apache.xerces.impl.XMLDocumentFragmentScannerImpl.scanDocument(Unknown Source)
> at org.apache.xerces.parsers.XML11Configuration.parse(Unknown Source)
> at org.apache.xerces.parsers.XML11Configuration.parse(Unknown Source)
> at org.apache.xerces.parsers.XMLParser.parse(Unknown Source)
> at org.apache.xerces.parsers.AbstractSAXParser.parse(Unknown Source)
> at javax.xml.parsers.SAXParser.parse(Unknown Source)
> at org.apache.axis.encoding.DeserializationContextImpl.parse(DeserializationContextImpl.java:218)
> at org.apache.axis.SOAPPart.getAsSOAPEnvelope(SOAPPart.java:646)
> at org.apache.axis.Message.getSOAPEnvelope(Message.java:424)
> at org.apache.axis.handlers.soap.MustUnderstandChecker.invoke(MustUnderstandChecker.java:61)
> at org.apache.axis.client.AxisClient.invoke(AxisClient.java:173)
> at org.apache.axis.client.Call.invokeEngine(Call.java:2735)
> at org.apache.axis.client.Call.invoke(Call.java:2718)
> at org.apache.axis.client.Call.invoke(Call.java:2394)
> at org.apache.axis.client.Call.invoke(Call.java:2317)
> at org.apache.axis.client.Call.invoke(Call.java:1774)
> at org.apache.ws.axis.oasis.ping.PingBindingStub.ping(PingBindingStub.java:137)
> at org.apache.ws.axis.oasis.Scenario1.main(Scenario1.java:86)
> at interop.TestScenario1.testScenario1(TestScenario1.java:63)
> at sun.reflect.NativeMethodAccessorImpl.invoke0(Native Method)
> at sun.reflect.NativeMethodAccessorImpl.invoke(NativeMethodAccessorImpl.java:39)
> at sun.reflect.DelegatingMethodAccessorImpl.invoke(DelegatingMethodAccessorImpl.java:25)
> </error>
> </testcase>
> <testcase classname="interop.TestScenario2" name="testScenario2" time="0.16">
> <error message="; nested exception is:
> java.lang.RuntimeException: org.apache.ws.security.components.crypto.Merlin cannot create instance" type="org.apache.axis.AxisFault">AxisFault
> faultCode: {http://schemas.xmlsoap.org/soap/envelope/}Server.userException
> faultSubcode:
> faultString: java.lang.RuntimeException: org.apache.ws.security.components.crypto.Merlin cannot create instance
> faultActor:
> faultNode:
> faultDetail:
> {http://xml.apache.org/axis/}stackTrace:java.lang.RuntimeException: org.apache.ws.security.components.crypto.Merlin cannot create instance
> at org.apache.ws.security.components.crypto.CryptoFactory.loadClass(CryptoFactory.java:130)
> at org.apache.ws.security.components.crypto.CryptoFactory.getInstance(CryptoFactory.java:101)
> at org.apache.ws.axis.security.WSDoAllSender.loadEncryptionCrypto(WSDoAllSender.java:606)
> at org.apache.ws.axis.security.WSDoAllSender.invoke(WSDoAllSender.java:260)
> at org.apache.axis.strategies.InvocationStrategy.visit(InvocationStrategy.java:32)
> at org.apache.axis.SimpleChain.doVisiting(SimpleChain.java:118)
> at org.apache.axis.SimpleChain.invoke(SimpleChain.java:83)
> at org.apache.axis.client.AxisClient.invoke(AxisClient.java:128)
> at org.apache.axis.client.Call.invokeEngine(Call.java:2735)
> at org.apache.axis.client.Call.invoke(Call.java:2718)
> at org.apache.axis.client.Call.invoke(Call.java:2394)
> at org.apache.axis.client.Call.invoke(Call.java:2317)
> at org.apache.axis.client.Call.invoke(Call.java:1774)
> at org.apache.ws.axis.oasis.ping.PingBindingStub.ping(PingBindingStub.java:137)
> at org.apache.ws.axis.oasis.Scenario2.main(Scenario2.java:86)
> at interop.TestScenario2.testScenario2(TestScenario2.java:63)
> at sun.reflect.NativeMethodAccessorImpl.invoke0(Native Method)
> at sun.reflect.NativeMethodAccessorImpl.invoke(NativeMethodAccessorImpl.java:39)
> at sun.reflect.DelegatingMethodAccessorImpl.invoke(DelegatingMethodAccessorImpl.java:25)
>
> {http://xml.apache.org/axis/}hostname:DH76W321
>
> java.lang.RuntimeException: org.apache.ws.security.components.crypto.Merlin cannot create instance
> at org.apache.axis.AxisFault.makeFault(AxisFault.java:99)
> at org.apache.axis.client.AxisClient.invoke(AxisClient.java:180)
> at org.apache.axis.client.Call.invokeEngine(Call.java:2735)
> at org.apache.axis.client.Call.invoke(Call.java:2718)
> at org.apache.axis.client.Call.invoke(Call.java:2394)
> at org.apache.axis.client.Call.invoke(Call.java:2317)
> at org.apache.axis.client.Call.invoke(Call.java:1774)
> at org.apache.ws.axis.oasis.ping.PingBindingStub.ping(PingBindingStub.java:137)
> at org.apache.ws.axis.oasis.Scenario2.main(Scenario2.java:86)
> at interop.TestScenario2.testScenario2(TestScenario2.java:63)
> at sun.reflect.NativeMethodAccessorImpl.invoke0(Native Method)
> at sun.reflect.NativeMethodAccessorImpl.invoke(NativeMethodAccessorImpl.java:39)
> at sun.reflect.DelegatingMethodAccessorImpl.invoke(DelegatingMethodAccessorImpl.java:25)
> Caused by: java.lang.RuntimeException: org.apache.ws.security.components.crypto.Merlin cannot create instance
> at org.apache.ws.security.components.crypto.CryptoFactory.loadClass(CryptoFactory.java:130)
> at org.apache.ws.security.components.crypto.CryptoFactory.getInstance(CryptoFactory.java:101)
> at org.apache.ws.axis.security.WSDoAllSender.loadEncryptionCrypto(WSDoAllSender.java:606)
> at org.apache.ws.axis.security.WSDoAllSender.invoke(WSDoAllSender.java:260)
> at org.apache.axis.strategies.InvocationStrategy.visit(InvocationStrategy.java:32)
> at org.apache.axis.SimpleChain.doVisiting(SimpleChain.java:118)
> at org.apache.axis.SimpleChain.invoke(SimpleChain.java:83)
> at org.apache.axis.client.AxisClient.invoke(AxisClient.java:128)
> ... 24 more
> </error>
> </testcase>
> <testcase classname="interop.TestScenario3" name="testScenario3" time="0.15">
> <error message="; nested exception is:
> java.lang.RuntimeException: org.apache.ws.security.components.crypto.Merlin cannot create instance" type="org.apache.axis.AxisFault">AxisFault
> faultCode: {http://schemas.xmlsoap.org/soap/envelope/}Server.userException
> faultSubcode:
> faultString: java.lang.RuntimeException: org.apache.ws.security.components.crypto.Merlin cannot create instance
> faultActor:
> faultNode:
> faultDetail:
> {http://xml.apache.org/axis/}stackTrace:java.lang.RuntimeException: org.apache.ws.security.components.crypto.Merlin cannot create instance
> at org.apache.ws.security.components.crypto.CryptoFactory.loadClass(CryptoFactory.java:130)
> at org.apache.ws.security.components.crypto.CryptoFactory.getInstance(CryptoFactory.java:101)
> at org.apache.ws.axis.security.WSDoAllSender.loadSignatureCrypto(WSDoAllSender.java:579)
> at org.apache.ws.axis.security.WSDoAllSender.invoke(WSDoAllSender.java:244)
> at org.apache.axis.strategies.InvocationStrategy.visit(InvocationStrategy.java:32)
> at org.apache.axis.SimpleChain.doVisiting(SimpleChain.java:118)
> at org.apache.axis.SimpleChain.invoke(SimpleChain.java:83)
> at org.apache.axis.client.AxisClient.invoke(AxisClient.java:128)
> at org.apache.axis.client.Call.invokeEngine(Call.java:2735)
> at org.apache.axis.client.Call.invoke(Call.java:2718)
> at org.apache.axis.client.Call.invoke(Call.java:2394)
> at org.apache.axis.client.Call.invoke(Call.java:2317)
> at org.apache.axis.client.Call.invoke(Call.java:1774)
> at org.apache.ws.axis.oasis.ping.PingBindingStub.ping(PingBindingStub.java:137)
> at org.apache.ws.axis.oasis.Scenario3.main(Scenario3.java:86)
> at interop.TestScenario3.testScenario3(TestScenario3.java:63)
> at sun.reflect.NativeMethodAccessorImpl.invoke0(Native Method)
> at sun.reflect.NativeMethodAccessorImpl.invoke(NativeMethodAccessorImpl.java:39)
> at sun.reflect.DelegatingMethodAccessorImpl.invoke(DelegatingMethodAccessorImpl.java:25)
>
> {http://xml.apache.org/axis/}hostname:DH76W321
>
> java.lang.RuntimeException: org.apache.ws.security.components.crypto.Merlin cannot create instance
> at org.apache.axis.AxisFault.makeFault(AxisFault.java:99)
> at org.apache.axis.client.AxisClient.invoke(AxisClient.java:180)
> at org.apache.axis.client.Call.invokeEngine(Call.java:2735)
> at org.apache.axis.client.Call.invoke(Call.java:2718)
> at org.apache.axis.client.Call.invoke(Call.java:2394)
> at org.apache.axis.client.Call.invoke(Call.java:2317)
> at org.apache.axis.client.Call.invoke(Call.java:1774)
> at org.apache.ws.axis.oasis.ping.PingBindingStub.ping(PingBindingStub.java:137)
> at org.apache.ws.axis.oasis.Scenario3.main(Scenario3.java:86)
> at interop.TestScenario3.testScenario3(TestScenario3.java:63)
> at sun.reflect.NativeMethodAccessorImpl.invoke0(Native Method)
> at sun.reflect.NativeMethodAccessorImpl.invoke(NativeMethodAccessorImpl.java:39)
> at sun.reflect.DelegatingMethodAccessorImpl.invoke(DelegatingMethodAccessorImpl.java:25)
> Caused by: java.lang.RuntimeException: org.apache.ws.security.components.crypto.Merlin cannot create instance
> at org.apache.ws.security.components.crypto.CryptoFactory.loadClass(CryptoFactory.java:130)
> at org.apache.ws.security.components.crypto.CryptoFactory.getInstance(CryptoFactory.java:101)
> at org.apache.ws.axis.security.WSDoAllSender.loadSignatureCrypto(WSDoAllSender.java:579)
> at org.apache.ws.axis.security.WSDoAllSender.invoke(WSDoAllSender.java:244)
> at org.apache.axis.strategies.InvocationStrategy.visit(InvocationStrategy.java:32)
> at org.apache.axis.SimpleChain.doVisiting(SimpleChain.java:118)
> at org.apache.axis.SimpleChain.invoke(SimpleChain.java:83)
> at org.apache.axis.client.AxisClient.invoke(AxisClient.java:128)
> ... 24 more
> </error>
> </testcase>
> <testcase classname="interop.TestScenario4" name="testScenario4" time="0.25">
> <error message="; nested exception is:
> java.lang.RuntimeException: org.apache.ws.security.components.crypto.Merlin cannot create instance" type="org.apache.axis.AxisFault">AxisFault
> faultCode: {http://schemas.xmlsoap.org/soap/envelope/}Server.userException
> faultSubcode:
> faultString: java.lang.RuntimeException: org.apache.ws.security.components.crypto.Merlin cannot create instance
> faultActor:
> faultNode:
> faultDetail:
> {http://xml.apache.org/axis/}stackTrace:java.lang.RuntimeException: org.apache.ws.security.components.crypto.Merlin cannot create instance
> at org.apache.ws.security.components.crypto.CryptoFactory.loadClass(CryptoFactory.java:130)
> at org.apache.ws.security.components.crypto.CryptoFactory.getInstance(CryptoFactory.java:101)
> at org.apache.ws.axis.security.WSDoAllSender.loadSignatureCrypto(WSDoAllSender.java:579)
> at org.apache.ws.axis.security.WSDoAllSender.invoke(WSDoAllSender.java:244)
> at org.apache.axis.strategies.InvocationStrategy.visit(InvocationStrategy.java:32)
> at org.apache.axis.SimpleChain.doVisiting(SimpleChain.java:118)
> at org.apache.axis.SimpleChain.invoke(SimpleChain.java:83)
> at org.apache.axis.client.AxisClient.invoke(AxisClient.java:128)
> at org.apache.axis.client.Call.invokeEngine(Call.java:2735)
> at org.apache.axis.client.Call.invoke(Call.java:2718)
> at org.apache.axis.client.Call.invoke(Call.java:2394)
> at org.apache.axis.client.Call.invoke(Call.java:2317)
> at org.apache.axis.client.Call.invoke(Call.java:1774)
> at org.apache.ws.axis.oasis.ping.PingBindingStub.ping(PingBindingStub.java:137)
> at org.apache.ws.axis.oasis.Scenario4.main(Scenario4.java:86)
> at interop.TestScenario4.testScenario4(TestScenario4.java:63)
> at sun.reflect.NativeMethodAccessorImpl.invoke0(Native Method)
> at sun.reflect.NativeMethodAccessorImpl.invoke(NativeMethodAccessorImpl.java:39)
> at sun.reflect.DelegatingMethodAccessorImpl.invoke(DelegatingMethodAccessorImpl.java:25)
>
> {http://xml.apache.org/axis/}hostname:DH76W321
>
> java.lang.RuntimeException: org.apache.ws.security.components.crypto.Merlin cannot create instance
> at org.apache.axis.AxisFault.makeFault(AxisFault.java:99)
> at org.apache.axis.client.AxisClient.invoke(AxisClient.java:180)
> at org.apache.axis.client.Call.invokeEngine(Call.java:2735)
> at org.apache.axis.client.Call.invoke(Call.java:2718)
> at org.apache.axis.client.Call.invoke(Call.java:2394)
> at org.apache.axis.client.Call.invoke(Call.java:2317)
> at org.apache.axis.client.Call.invoke(Call.java:1774)
> at org.apache.ws.axis.oasis.ping.PingBindingStub.ping(PingBindingStub.java:137)
> at org.apache.ws.axis.oasis.Scenario4.main(Scenario4.java:86)
> at interop.TestScenario4.testScenario4(TestScenario4.java:63)
> at sun.reflect.NativeMethodAccessorImpl.invoke0(Native Method)
> at sun.reflect.NativeMethodAccessorImpl.invoke(NativeMethodAccessorImpl.java:39)
> at sun.reflect.DelegatingMethodAccessorImpl.invoke(DelegatingMethodAccessorImpl.java:25)
> Caused by: java.lang.RuntimeException: org.apache.ws.security.components.crypto.Merlin cannot create instance
> at org.apache.ws.security.components.crypto.CryptoFactory.loadClass(CryptoFactory.java:130)
> at org.apache.ws.security.components.crypto.CryptoFactory.getInstance(CryptoFactory.java:101)
> at org.apache.ws.axis.security.WSDoAllSender.loadSignatureCrypto(WSDoAllSender.java:579)
> at org.apache.ws.axis.security.WSDoAllSender.invoke(WSDoAllSender.java:244)
> at org.apache.axis.strategies.InvocationStrategy.visit(InvocationStrategy.java:32)
> at org.apache.axis.SimpleChain.doVisiting(SimpleChain.java:118)
> at org.apache.axis.SimpleChain.invoke(SimpleChain.java:83)
> at org.apache.axis.client.AxisClient.invoke(AxisClient.java:128)
> ... 24 more
> </error>
> </testcase>
> <testcase classname="interop.TestScenario5" name="testScenario5" time="0.101">
> <error message="; nested exception is:
> java.lang.RuntimeException: org.apache.ws.security.components.crypto.Merlin cannot create instance" type="org.apache.axis.AxisFault">AxisFault
> faultCode: {http://schemas.xmlsoap.org/soap/envelope/}Server.userException
> faultSubcode:
> faultString: java.lang.RuntimeException: org.apache.ws.security.components.crypto.Merlin cannot create instance
> faultActor:
> faultNode:
> faultDetail:
> {http://xml.apache.org/axis/}stackTrace:java.lang.RuntimeException: org.apache.ws.security.components.crypto.Merlin cannot create instance
> at org.apache.ws.security.components.crypto.CryptoFactory.loadClass(CryptoFactory.java:130)
> at org.apache.ws.security.components.crypto.CryptoFactory.getInstance(CryptoFactory.java:101)
> at org.apache.ws.axis.security.WSDoAllSender.loadSignatureCrypto(WSDoAllSender.java:579)
> at org.apache.ws.axis.security.WSDoAllSender.invoke(WSDoAllSender.java:244)
> at org.apache.axis.strategies.InvocationStrategy.visit(InvocationStrategy.java:32)
> at org.apache.axis.SimpleChain.doVisiting(SimpleChain.java:118)
> at org.apache.axis.SimpleChain.invoke(SimpleChain.java:83)
> at org.apache.axis.client.AxisClient.invoke(AxisClient.java:128)
> at org.apache.axis.client.Call.invokeEngine(Call.java:2735)
> at org.apache.axis.client.Call.invoke(Call.java:2718)
> at org.apache.axis.client.Call.invoke(Call.java:2394)
> at org.apache.axis.client.Call.invoke(Call.java:2317)
> at org.apache.axis.client.Call.invoke(Call.java:1774)
> at org.apache.ws.axis.oasis.ping.PingBindingStub.ping(PingBindingStub.java:137)
> at org.apache.ws.axis.oasis.Scenario5.main(Scenario5.java:90)
> at interop.TestScenario5.testScenario5(TestScenario5.java:63)
> at sun.reflect.NativeMethodAccessorImpl.invoke0(Native Method)
> at sun.reflect.NativeMethodAccessorImpl.invoke(NativeMethodAccessorImpl.java:39)
> at sun.reflect.DelegatingMethodAccessorImpl.invoke(DelegatingMethodAccessorImpl.java:25)
>
> {http://xml.apache.org/axis/}hostname:DH76W321
>
> java.lang.RuntimeException: org.apache.ws.security.components.crypto.Merlin cannot create instance
> at org.apache.axis.AxisFault.makeFault(AxisFault.java:99)
> at org.apache.axis.client.AxisClient.invoke(AxisClient.java:180)
> at org.apache.axis.client.Call.invokeEngine(Call.java:2735)
> at org.apache.axis.client.Call.invoke(Call.java:2718)
> at org.apache.axis.client.Call.invoke(Call.java:2394)
> at org.apache.axis.client.Call.invoke(Call.java:2317)
> at org.apache.axis.client.Call.invoke(Call.java:1774)
> at org.apache.ws.axis.oasis.ping.PingBindingStub.ping(PingBindingStub.java:137)
> at org.apache.ws.axis.oasis.Scenario5.main(Scenario5.java:90)
> at interop.TestScenario5.testScenario5(TestScenario5.java:63)
> at sun.reflect.NativeMethodAccessorImpl.invoke0(Native Method)
> at sun.reflect.NativeMethodAccessorImpl.invoke(NativeMethodAccessorImpl.java:39)
> at sun.reflect.DelegatingMethodAccessorImpl.invoke(DelegatingMethodAccessorImpl.java:25)
> Caused by: java.lang.RuntimeException: org.apache.ws.security.components.crypto.Merlin cannot create instance
> at org.apache.ws.security.components.crypto.CryptoFactory.loadClass(CryptoFactory.java:130)
> at org.apache.ws.security.components.crypto.CryptoFactory.getInstance(CryptoFactory.java:101)
> at org.apache.ws.axis.security.WSDoAllSender.loadSignatureCrypto(WSDoAllSender.java:579)
> at org.apache.ws.axis.security.WSDoAllSender.invoke(WSDoAllSender.java:244)
> at org.apache.axis.strategies.InvocationStrategy.visit(InvocationStrategy.java:32)
> at org.apache.axis.SimpleChain.doVisiting(SimpleChain.java:118)
> at org.apache.axis.SimpleChain.invoke(SimpleChain.java:83)
> at org.apache.axis.client.AxisClient.invoke(AxisClient.java:128)
> ... 24 more
> </error>
> </testcase>
> <testcase classname="interop.TestScenario6" name="testScenario6" time="0.13">
> <error message="; nested exception is:
> java.lang.RuntimeException: org.apache.ws.security.components.crypto.Merlin cannot create instance" type="org.apache.axis.AxisFault">AxisFault
> faultCode: {http://schemas.xmlsoap.org/soap/envelope/}Server.userException
> faultSubcode:
> faultString: java.lang.RuntimeException: org.apache.ws.security.components.crypto.Merlin cannot create instance
> faultActor:
> faultNode:
> faultDetail:
> {http://xml.apache.org/axis/}stackTrace:java.lang.RuntimeException: org.apache.ws.security.components.crypto.Merlin cannot create instance
> at org.apache.ws.security.components.crypto.CryptoFactory.loadClass(CryptoFactory.java:130)
> at org.apache.ws.security.components.crypto.CryptoFactory.getInstance(CryptoFactory.java:101)
> at org.apache.ws.axis.security.WSDoAllSender.loadSignatureCrypto(WSDoAllSender.java:579)
> at org.apache.ws.axis.security.WSDoAllSender.invoke(WSDoAllSender.java:244)
> at org.apache.axis.strategies.InvocationStrategy.visit(InvocationStrategy.java:32)
> at org.apache.axis.SimpleChain.doVisiting(SimpleChain.java:118)
> at org.apache.axis.SimpleChain.invoke(SimpleChain.java:83)
> at org.apache.axis.client.AxisClient.invoke(AxisClient.java:128)
> at org.apache.axis.client.Call.invokeEngine(Call.java:2735)
> at org.apache.axis.client.Call.invoke(Call.java:2718)
> at org.apache.axis.client.Call.invoke(Call.java:2394)
> at org.apache.axis.client.Call.invoke(Call.java:2317)
> at org.apache.axis.client.Call.invoke(Call.java:1774)
> at org.apache.ws.axis.oasis.ping.PingBindingStub.ping(PingBindingStub.java:137)
> at org.apache.ws.axis.oasis.Scenario6.main(Scenario6.java:86)
> at interop.TestScenario6.testScenario6(TestScenario6.java:63)
> at sun.reflect.NativeMethodAccessorImpl.invoke0(Native Method)
> at sun.reflect.NativeMethodAccessorImpl.invoke(NativeMethodAccessorImpl.java:39)
> at sun.reflect.DelegatingMethodAccessorImpl.invoke(DelegatingMethodAccessorImpl.java:25)
>
> {http://xml.apache.org/axis/}hostname:DH76W321
>
> java.lang.RuntimeException: org.apache.ws.security.components.crypto.Merlin cannot create instance
> at org.apache.axis.AxisFault.makeFault(AxisFault.java:99)
> at org.apache.axis.client.AxisClient.invoke(AxisClient.java:180)
> at org.apache.axis.client.Call.invokeEngine(Call.java:2735)
> at org.apache.axis.client.Call.invoke(Call.java:2718)
> at org.apache.axis.client.Call.invoke(Call.java:2394)
> at org.apache.axis.client.Call.invoke(Call.java:2317)
> at org.apache.axis.client.Call.invoke(Call.java:1774)
> at org.apache.ws.axis.oasis.ping.PingBindingStub.ping(PingBindingStub.java:137)
> at org.apache.ws.axis.oasis.Scenario6.main(Scenario6.java:86)
> at interop.TestScenario6.testScenario6(TestScenario6.java:63)
> at sun.reflect.NativeMethodAccessorImpl.invoke0(Native Method)
> at sun.reflect.NativeMethodAccessorImpl.invoke(NativeMethodAccessorImpl.java:39)
> at sun.reflect.DelegatingMethodAccessorImpl.invoke(DelegatingMethodAccessorImpl.java:25)
> Caused by: java.lang.RuntimeException: org.apache.ws.security.components.crypto.Merlin cannot create instance
> at org.apache.ws.security.components.crypto.CryptoFactory.loadClass(CryptoFactory.java:130)
> at org.apache.ws.security.components.crypto.CryptoFactory.getInstance(CryptoFactory.java:101)
> at org.apache.ws.axis.security.WSDoAllSender.loadSignatureCrypto(WSDoAllSender.java:579)
> at org.apache.ws.axis.security.WSDoAllSender.invoke(WSDoAllSender.java:244)
> at org.apache.axis.strategies.InvocationStrategy.visit(InvocationStrategy.java:32)
> at org.apache.axis.SimpleChain.doVisiting(SimpleChain.java:118)
> at org.apache.axis.SimpleChain.invoke(SimpleChain.java:83)
> at org.apache.axis.client.AxisClient.invoke(AxisClient.java:128)
> ... 24 more
> </error>
> </testcase>
> <testcase classname="interop.TestScenario7" name="testScenario7" time="0.24">
> <error message="; nested exception is:
> java.lang.RuntimeException: org.apache.ws.security.components.crypto.Merlin cannot create instance" type="org.apache.axis.AxisFault">AxisFault
> faultCode: {http://schemas.xmlsoap.org/soap/envelope/}Server.userException
> faultSubcode:
> faultString: java.lang.RuntimeException: org.apache.ws.security.components.crypto.Merlin cannot create instance
> faultActor:
> faultNode:
> faultDetail:
> {http://xml.apache.org/axis/}stackTrace:java.lang.RuntimeException: org.apache.ws.security.components.crypto.Merlin cannot create instance
> at org.apache.ws.security.components.crypto.CryptoFactory.loadClass(CryptoFactory.java:130)
> at org.apache.ws.security.components.crypto.CryptoFactory.getInstance(CryptoFactory.java:101)
> at org.apache.ws.axis.security.WSDoAllSender.loadSignatureCrypto(WSDoAllSender.java:579)
> at org.apache.ws.axis.security.WSDoAllSender.invoke(WSDoAllSender.java:244)
> at org.apache.axis.strategies.InvocationStrategy.visit(InvocationStrategy.java:32)
> at org.apache.axis.SimpleChain.doVisiting(SimpleChain.java:118)
> at org.apache.axis.SimpleChain.invoke(SimpleChain.java:83)
> at org.apache.axis.client.AxisClient.invoke(AxisClient.java:128)
> at org.apache.axis.client.Call.invokeEngine(Call.java:2735)
> at org.apache.axis.client.Call.invoke(Call.java:2718)
> at org.apache.axis.client.Call.invoke(Call.java:2394)
> at org.apache.axis.client.Call.invoke(Call.java:2317)
> at org.apache.axis.client.Call.invoke(Call.java:1774)
> at org.apache.ws.axis.oasis.ping.PingBindingStub.ping(PingBindingStub.java:137)
> at org.apache.ws.axis.oasis.Scenario7.main(Scenario7.java:86)
> at interop.TestScenario7.testScenario7(TestScenario7.java:63)
> at sun.reflect.NativeMethodAccessorImpl.invoke0(Native Method)
> at sun.reflect.NativeMethodAccessorImpl.invoke(NativeMethodAccessorImpl.java:39)
> at sun.reflect.DelegatingMethodAccessorImpl.invoke(DelegatingMethodAccessorImpl.java:25)
>
> {http://xml.apache.org/axis/}hostname:DH76W321
>
> java.lang.RuntimeException: org.apache.ws.security.components.crypto.Merlin cannot create instance
> at org.apache.axis.AxisFault.makeFault(AxisFault.java:99)
> at org.apache.axis.client.AxisClient.invoke(AxisClient.java:180)
> at org.apache.axis.client.Call.invokeEngine(Call.java:2735)
> at org.apache.axis.client.Call.invoke(Call.java:2718)
> at org.apache.axis.client.Call.invoke(Call.java:2394)
> at org.apache.axis.client.Call.invoke(Call.java:2317)
> at org.apache.axis.client.Call.invoke(Call.java:1774)
> at org.apache.ws.axis.oasis.ping.PingBindingStub.ping(PingBindingStub.java:137)
> at org.apache.ws.axis.oasis.Scenario7.main(Scenario7.java:86)
> at interop.TestScenario7.testScenario7(TestScenario7.java:63)
> at sun.reflect.NativeMethodAccessorImpl.invoke0(Native Method)
> at sun.reflect.NativeMethodAccessorImpl.invoke(NativeMethodAccessorImpl.java:39)
> at sun.reflect.DelegatingMethodAccessorImpl.invoke(DelegatingMethodAccessorImpl.java:25)
> Caused by: java.lang.RuntimeException: org.apache.ws.security.components.crypto.Merlin cannot create instance
> at org.apache.ws.security.components.crypto.CryptoFactory.loadClass(CryptoFactory.java:130)
> at org.apache.ws.security.components.crypto.CryptoFactory.getInstance(CryptoFactory.java:101)
> at org.apache.ws.axis.security.WSDoAllSender.loadSignatureCrypto(WSDoAllSender.java:579)
> at org.apache.ws.axis.security.WSDoAllSender.invoke(WSDoAllSender.java:244)
> at org.apache.axis.strategies.InvocationStrategy.visit(InvocationStrategy.java:32)
> at org.apache.axis.SimpleChain.doVisiting(SimpleChain.java:118)
> at org.apache.axis.SimpleChain.invoke(SimpleChain.java:83)
> at org.apache.axis.client.AxisClient.invoke(AxisClient.java:128)
> ... 24 more
> </error>
> </testcase>
> <testcase classname="interop.TestSTScenario1" name="testSTScenario1" time="0.461">
> <error message="The AXIS engine could not find a target service to invoke! targetService is STPing1" type="org.apache.axis.AxisFault">AxisFault
> faultCode: {http://xml.apache.org/axis/}Server.NoService
> faultSubcode:
> faultString: The AXIS engine could not find a target service to invoke! targetService is STPing1
> faultActor:
> faultNode:
> faultDetail:
> {http://xml.apache.org/axis/}stackTrace:AxisFault
> faultCode: {http://xml.apache.org/axis/}Server.NoService
> faultSubcode:
> faultString: The AXIS engine could not find a target service to invoke! targetService is STPing1
> faultActor:
> faultNode:
> faultDetail:
>
> The AXIS engine could not find a target service to invoke! targetService is STPing1
> at org.apache.axis.message.SOAPFaultBuilder.createFault(SOAPFaultBuilder.java:223)
> at org.apache.axis.message.SOAPFaultBuilder.endElement(SOAPFaultBuilder.java:130)
> at org.apache.axis.encoding.DeserializationContextImpl.endElement(DeserializationContextImpl.java:1060)
> at org.apache.xerces.parsers.AbstractSAXParser.endElement(Unknown Source)
> at org.apache.xerces.impl.XMLNSDocumentScannerImpl.scanEndElement(Unknown Source)
> at org.apache.xerces.impl.XMLDocumentFragmentScannerImpl$FragmentContentDispatcher.dispatch(Unknown Source)
> at org.apache.xerces.impl.XMLDocumentFragmentScannerImpl.scanDocument(Unknown Source)
> at org.apache.xerces.parsers.XML11Configuration.parse(Unknown Source)
> at org.apache.xerces.parsers.XML11Configuration.parse(Unknown Source)
> at org.apache.xerces.parsers.XMLParser.parse(Unknown Source)
> at org.apache.xerces.parsers.AbstractSAXParser.parse(Unknown Source)
> at javax.xml.parsers.SAXParser.parse(Unknown Source)
> at org.apache.axis.encoding.DeserializationContextImpl.parse(DeserializationContextImpl.java:218)
> at org.apache.axis.SOAPPart.getAsSOAPEnvelope(SOAPPart.java:646)
> at org.apache.axis.Message.getSOAPEnvelope(Message.java:424)
> at org.apache.axis.handlers.soap.MustUnderstandChecker.invoke(MustUnderstandChecker.java:61)
> at org.apache.axis.client.AxisClient.invoke(AxisClient.java:173)
> at org.apache.axis.client.Call.invokeEngine(Call.java:2735)
> at org.apache.axis.client.Call.invoke(Call.java:2718)
> at org.apache.axis.client.Call.invoke(Call.java:2394)
> at org.apache.axis.client.Call.invoke(Call.java:2317)
> at org.apache.axis.client.Call.invoke(Call.java:1774)
> at org.apache.ws.axis.oasis.ping.PingBindingStub.ping(PingBindingStub.java:137)
> at org.apache.ws.axis.oasis.STScenario1.main(STScenario1.java:86)
> at interop.TestSTScenario1.testSTScenario1(TestSTScenario1.java:63)
> at sun.reflect.NativeMethodAccessorImpl.invoke0(Native Method)
> at sun.reflect.NativeMethodAccessorImpl.invoke(NativeMethodAccessorImpl.java:39)
> at sun.reflect.DelegatingMethodAccessorImpl.invoke(DelegatingMethodAccessorImpl.java:25)
>
> {http://xml.apache.org/axis/}hostname:DH76W321
>
> The AXIS engine could not find a target service to invoke! targetService is STPing1
> at org.apache.axis.message.SOAPFaultBuilder.createFault(SOAPFaultBuilder.java:223)
> at org.apache.axis.message.SOAPFaultBuilder.endElement(SOAPFaultBuilder.java:130)
> at org.apache.axis.encoding.DeserializationContextImpl.endElement(DeserializationContextImpl.java:1060)
> at org.apache.xerces.parsers.AbstractSAXParser.endElement(Unknown Source)
> at org.apache.xerces.impl.XMLNSDocumentScannerImpl.scanEndElement(Unknown Source)
> at org.apache.xerces.impl.XMLDocumentFragmentScannerImpl$FragmentContentDispatcher.dispatch(Unknown Source)
> at org.apache.xerces.impl.XMLDocumentFragmentScannerImpl.scanDocument(Unknown Source)
> at org.apache.xerces.parsers.XML11Configuration.parse(Unknown Source)
> at org.apache.xerces.parsers.XML11Configuration.parse(Unknown Source)
> at org.apache.xerces.parsers.XMLParser.parse(Unknown Source)
> at org.apache.xerces.parsers.AbstractSAXParser.parse(Unknown Source)
> at javax.xml.parsers.SAXParser.parse(Unknown Source)
> at org.apache.axis.encoding.DeserializationContextImpl.parse(DeserializationContextImpl.java:218)
> at org.apache.axis.SOAPPart.getAsSOAPEnvelope(SOAPPart.java:646)
> at org.apache.axis.Message.getSOAPEnvelope(Message.java:424)
> at org.apache.axis.handlers.soap.MustUnderstandChecker.invoke(MustUnderstandChecker.java:61)
> at org.apache.axis.client.AxisClient.invoke(AxisClient.java:173)
> at org.apache.axis.client.Call.invokeEngine(Call.java:2735)
> at org.apache.axis.client.Call.invoke(Call.java:2718)
> at org.apache.axis.client.Call.invoke(Call.java:2394)
> at org.apache.axis.client.Call.invoke(Call.java:2317)
> at org.apache.axis.client.Call.invoke(Call.java:1774)
> at org.apache.ws.axis.oasis.ping.PingBindingStub.ping(PingBindingStub.java:137)
> at org.apache.ws.axis.oasis.STScenario1.main(STScenario1.java:86)
> at interop.TestSTScenario1.testSTScenario1(TestSTScenario1.java:63)
> at sun.reflect.NativeMethodAccessorImpl.invoke0(Native Method)
> at sun.reflect.NativeMethodAccessorImpl.invoke(NativeMethodAccessorImpl.java:39)
> at sun.reflect.DelegatingMethodAccessorImpl.invoke(DelegatingMethodAccessorImpl.java:25)
> </error>
> </testcase>
> <testcase classname="interop.TestSTScenario3" name="testSTScenario3" time="0.611">
> <error message="The AXIS engine could not find a target service to invoke! targetService is STPing3" type="org.apache.axis.AxisFault">AxisFault
> faultCode: {http://xml.apache.org/axis/}Server.NoService
> faultSubcode:
> faultString: The AXIS engine could not find a target service to invoke! targetService is STPing3
> faultActor:
> faultNode:
> faultDetail:
> {http://xml.apache.org/axis/}stackTrace:AxisFault
> faultCode: {http://xml.apache.org/axis/}Server.NoService
> faultSubcode:
> faultString: The AXIS engine could not find a target service to invoke! targetService is STPing3
> faultActor:
> faultNode:
> faultDetail:
>
> The AXIS engine could not find a target service to invoke! targetService is STPing3
> at org.apache.axis.message.SOAPFaultBuilder.createFault(SOAPFaultBuilder.java:223)
> at org.apache.axis.message.SOAPFaultBuilder.endElement(SOAPFaultBuilder.java:130)
> at org.apache.axis.encoding.DeserializationContextImpl.endElement(DeserializationContextImpl.java:1060)
> at org.apache.xerces.parsers.AbstractSAXParser.endElement(Unknown Source)
> at org.apache.xerces.impl.XMLNSDocumentScannerImpl.scanEndElement(Unknown Source)
> at org.apache.xerces.impl.XMLDocumentFragmentScannerImpl$FragmentContentDispatcher.dispatch(Unknown Source)
> at org.apache.xerces.impl.XMLDocumentFragmentScannerImpl.scanDocument(Unknown Source)
> at org.apache.xerces.parsers.XML11Configuration.parse(Unknown Source)
> at org.apache.xerces.parsers.XML11Configuration.parse(Unknown Source)
> at org.apache.xerces.parsers.XMLParser.parse(Unknown Source)
> at org.apache.xerces.parsers.AbstractSAXParser.parse(Unknown Source)
> at javax.xml.parsers.SAXParser.parse(Unknown Source)
> at org.apache.axis.encoding.DeserializationContextImpl.parse(DeserializationContextImpl.java:218)
> at org.apache.axis.SOAPPart.getAsSOAPEnvelope(SOAPPart.java:646)
> at org.apache.axis.Message.getSOAPEnvelope(Message.java:424)
> at org.apache.axis.handlers.soap.MustUnderstandChecker.invoke(MustUnderstandChecker.java:61)
> at org.apache.axis.client.AxisClient.invoke(AxisClient.java:173)
> at org.apache.axis.client.Call.invokeEngine(Call.java:2735)
> at org.apache.axis.client.Call.invoke(Call.java:2718)
> at org.apache.axis.client.Call.invoke(Call.java:2394)
> at org.apache.axis.client.Call.invoke(Call.java:2317)
> at org.apache.axis.client.Call.invoke(Call.java:1774)
> at org.apache.ws.axis.oasis.ping.PingBindingStub.ping(PingBindingStub.java:137)
> at org.apache.ws.axis.oasis.STScenario3.main(STScenario3.java:86)
> at interop.TestSTScenario3.testSTScenario3(TestSTScenario3.java:63)
> at sun.reflect.NativeMethodAccessorImpl.invoke0(Native Method)
> at sun.reflect.NativeMethodAccessorImpl.invoke(NativeMethodAccessorImpl.java:39)
> at sun.reflect.DelegatingMethodAccessorImpl.invoke(DelegatingMethodAccessorImpl.java:25)
>
> {http://xml.apache.org/axis/}hostname:DH76W321
>
> The AXIS engine could not find a target service to invoke! targetService is STPing3
> at org.apache.axis.message.SOAPFaultBuilder.createFault(SOAPFaultBuilder.java:223)
> at org.apache.axis.message.SOAPFaultBuilder.endElement(SOAPFaultBuilder.java:130)
> at org.apache.axis.encoding.DeserializationContextImpl.endElement(DeserializationContextImpl.java:1060)
> at org.apache.xerces.parsers.AbstractSAXParser.endElement(Unknown Source)
> at org.apache.xerces.impl.XMLNSDocumentScannerImpl.scanEndElement(Unknown Source)
> at org.apache.xerces.impl.XMLDocumentFragmentScannerImpl$FragmentContentDispatcher.dispatch(Unknown Source)
> at org.apache.xerces.impl.XMLDocumentFragmentScannerImpl.scanDocument(Unknown Source)
> at org.apache.xerces.parsers.XML11Configuration.parse(Unknown Source)
> at org.apache.xerces.parsers.XML11Configuration.parse(Unknown Source)
> at org.apache.xerces.parsers.XMLParser.parse(Unknown Source)
> at org.apache.xerces.parsers.AbstractSAXParser.parse(Unknown Source)
> at javax.xml.parsers.SAXParser.parse(Unknown Source)
> at org.apache.axis.encoding.DeserializationContextImpl.parse(DeserializationContextImpl.java:218)
> at org.apache.axis.SOAPPart.getAsSOAPEnvelope(SOAPPart.java:646)
> at org.apache.axis.Message.getSOAPEnvelope(Message.java:424)
> at org.apache.axis.handlers.soap.MustUnderstandChecker.invoke(MustUnderstandChecker.java:61)
> at org.apache.axis.client.AxisClient.invoke(AxisClient.java:173)
> at org.apache.axis.client.Call.invokeEngine(Call.java:2735)
> at org.apache.axis.client.Call.invoke(Call.java:2718)
> at org.apache.axis.client.Call.invoke(Call.java:2394)
> at org.apache.axis.client.Call.invoke(Call.java:2317)
> at org.apache.axis.client.Call.invoke(Call.java:1774)
> at org.apache.ws.axis.oasis.ping.PingBindingStub.ping(PingBindingStub.java:137)
> at org.apache.ws.axis.oasis.STScenario3.main(STScenario3.java:86)
> at interop.TestSTScenario3.testSTScenario3(TestSTScenario3.java:63)
> at sun.reflect.NativeMethodAccessorImpl.invoke0(Native Method)
> at sun.reflect.NativeMethodAccessorImpl.invoke(NativeMethodAccessorImpl.java:39)
> at sun.reflect.DelegatingMethodAccessorImpl.invoke(DelegatingMethodAccessorImpl.java:25)
> </error>
> </testcase>
> <testcase classname="interop.TestSTScenario4" name="testSTScenario4" time="0.4">
> <error message="The AXIS engine could not find a target service to invoke! targetService is STPing4" type="org.apache.axis.AxisFault">AxisFault
> faultCode: {http://xml.apache.org/axis/}Server.NoService
> faultSubcode:
> faultString: The AXIS engine could not find a target service to invoke! targetService is STPing4
> faultActor:
> faultNode:
> faultDetail:
> {http://xml.apache.org/axis/}stackTrace:AxisFault
> faultCode: {http://xml.apache.org/axis/}Server.NoService
> faultSubcode:
> faultString: The AXIS engine could not find a target service to invoke! targetService is STPing4
> faultActor:
> faultNode:
> faultDetail:
>
> The AXIS engine could not find a target service to invoke! targetService is STPing4
> at org.apache.axis.message.SOAPFaultBuilder.createFault(SOAPFaultBuilder.java:223)
> at org.apache.axis.message.SOAPFaultBuilder.endElement(SOAPFaultBuilder.java:130)
> at org.apache.axis.encoding.DeserializationContextImpl.endElement(DeserializationContextImpl.java:1060)
> at org.apache.xerces.parsers.AbstractSAXParser.endElement(Unknown Source)
> at org.apache.xerces.impl.XMLNSDocumentScannerImpl.scanEndElement(Unknown Source)
> at org.apache.xerces.impl.XMLDocumentFragmentScannerImpl$FragmentContentDispatcher.dispatch(Unknown Source)
> at org.apache.xerces.impl.XMLDocumentFragmentScannerImpl.scanDocument(Unknown Source)
> at org.apache.xerces.parsers.XML11Configuration.parse(Unknown Source)
> at org.apache.xerces.parsers.XML11Configuration.parse(Unknown Source)
> at org.apache.xerces.parsers.XMLParser.parse(Unknown Source)
> at org.apache.xerces.parsers.AbstractSAXParser.parse(Unknown Source)
> at javax.xml.parsers.SAXParser.parse(Unknown Source)
> at org.apache.axis.encoding.DeserializationContextImpl.parse(DeserializationContextImpl.java:218)
> at org.apache.axis.SOAPPart.getAsSOAPEnvelope(SOAPPart.java:646)
> at org.apache.axis.Message.getSOAPEnvelope(Message.java:424)
> at org.apache.axis.handlers.soap.MustUnderstandChecker.invoke(MustUnderstandChecker.java:61)
> at org.apache.axis.client.AxisClient.invoke(AxisClient.java:173)
> at org.apache.axis.client.Call.invokeEngine(Call.java:2735)
> at org.apache.axis.client.Call.invoke(Call.java:2718)
> at org.apache.axis.client.Call.invoke(Call.java:2394)
> at org.apache.axis.client.Call.invoke(Call.java:2317)
> at org.apache.axis.client.Call.invoke(Call.java:1774)
> at org.apache.ws.axis.oasis.ping.PingBindingStub.ping(PingBindingStub.java:137)
> at org.apache.ws.axis.oasis.STScenario4.main(STScenario4.java:86)
> at interop.TestSTScenario4.testSTScenario4(TestSTScenario4.java:63)
> at sun.reflect.NativeMethodAccessorImpl.invoke0(Native Method)
> at sun.reflect.NativeMethodAccessorImpl.invoke(NativeMethodAccessorImpl.java:39)
> at sun.reflect.DelegatingMethodAccessorImpl.invoke(DelegatingMethodAccessorImpl.java:25)
>
> {http://xml.apache.org/axis/}hostname:DH76W321
>
> The AXIS engine could not find a target service to invoke! targetService is STPing4
> at org.apache.axis.message.SOAPFaultBuilder.createFault(SOAPFaultBuilder.java:223)
> at org.apache.axis.message.SOAPFaultBuilder.endElement(SOAPFaultBuilder.java:130)
> at org.apache.axis.encoding.DeserializationContextImpl.endElement(DeserializationContextImpl.java:1060)
> at org.apache.xerces.parsers.AbstractSAXParser.endElement(Unknown Source)
> at org.apache.xerces.impl.XMLNSDocumentScannerImpl.scanEndElement(Unknown Source)
> at org.apache.xerces.impl.XMLDocumentFragmentScannerImpl$FragmentContentDispatcher.dispatch(Unknown Source)
> at org.apache.xerces.impl.XMLDocumentFragmentScannerImpl.scanDocument(Unknown Source)
> at org.apache.xerces.parsers.XML11Configuration.parse(Unknown Source)
> at org.apache.xerces.parsers.XML11Configuration.parse(Unknown Source)
> at org.apache.xerces.parsers.XMLParser.parse(Unknown Source)
> at org.apache.xerces.parsers.AbstractSAXParser.parse(Unknown Source)
> at javax.xml.parsers.SAXParser.parse(Unknown Source)
> at org.apache.axis.encoding.DeserializationContextImpl.parse(DeserializationContextImpl.java:218)
> at org.apache.axis.SOAPPart.getAsSOAPEnvelope(SOAPPart.java:646)
> at org.apache.axis.Message.getSOAPEnvelope(Message.java:424)
> at org.apache.axis.handlers.soap.MustUnderstandChecker.invoke(MustUnderstandChecker.java:61)
> at org.apache.axis.client.AxisClient.invoke(AxisClient.java:173)
> at org.apache.axis.client.Call.invokeEngine(Call.java:2735)
> at org.apache.axis.client.Call.invoke(Call.java:2718)
> at org.apache.axis.client.Call.invoke(Call.java:2394)
> at org.apache.axis.client.Call.invoke(Call.java:2317)
> at org.apache.axis.client.Call.invoke(Call.java:1774)
> at org.apache.ws.axis.oasis.ping.PingBindingStub.ping(PingBindingStub.java:137)
> at org.apache.ws.axis.oasis.STScenario4.main(STScenario4.java:86)
> at interop.TestSTScenario4.testSTScenario4(TestSTScenario4.java:63)
> at sun.reflect.NativeMethodAccessorImpl.invoke0(Native Method)
> at sun.reflect.NativeMethodAccessorImpl.invoke(NativeMethodAccessorImpl.java:39)
> at sun.reflect.DelegatingMethodAccessorImpl.invoke(DelegatingMethodAccessorImpl.java:25)
> </error>
> </testcase>
> <system-out><![CDATA[unknown attr1.3.6.1.4.1.311.17.1
> unknown attr1.3.6.1.4.1.311.17.1
> unknown attr1.3.6.1.4.1.311.17.1
> unknown attr1.3.6.1.4.1.311.17.1
> ]]></system-out>
> <system-err><![CDATA[java.security.cert.CertificateParsingException: java.io.IOException: java.io.IOException: Host portion is not a valid DNS name, IPv4 address, or IPv6 address
> at sun.security.x509.X509CertInfo.<init>(X509CertInfo.java:157)
> at sun.security.x509.X509CertImpl.parse(X509CertImpl.java:1679)
> at sun.security.x509.X509CertImpl.<init>(X509CertImpl.java:173)
> at sun.security.provider.X509Factory.engineGenerateCertificate(X509Factory.java:90)
> at java.security.cert.CertificateFactory.generateCertificate(CertificateFactory.java:389)
> at sun.security.provider.JavaKeyStore.engineLoad(JavaKeyStore.java:684)
> at java.security.KeyStore.load(KeyStore.java:652)
> at org.apache.ws.security.components.crypto.Merlin.load(Merlin.java:507)
> at org.apache.ws.security.components.crypto.Merlin.<init>(Merlin.java:114)
> at sun.reflect.NativeConstructorAccessorImpl.newInstance0(Native Method)
> at sun.reflect.NativeConstructorAccessorImpl.newInstance(NativeConstructorAccessorImpl.java:39)
> at sun.reflect.DelegatingConstructorAccessorImpl.newInstance(DelegatingConstructorAccessorImpl.java:27)
> at java.lang.reflect.Constructor.newInstance(Constructor.java:274)
> at org.apache.ws.security.components.crypto.CryptoFactory.loadClass(CryptoFactory.java:117)
> at org.apache.ws.security.components.crypto.CryptoFactory.getInstance(CryptoFactory.java:101)
> at interop.TestInteropKeys.testInteropKeys1(TestInteropKeys.java:41)
> at sun.reflect.NativeMethodAccessorImpl.invoke0(Native Method)
> at sun.reflect.NativeMethodAccessorImpl.invoke(NativeMethodAccessorImpl.java:39)
> at sun.reflect.DelegatingMethodAccessorImpl.invoke(DelegatingMethodAccessorImpl.java:25)
> at java.lang.reflect.Method.invoke(Method.java:324)
> at junit.framework.TestCase.runTest(TestCase.java:154)
> at junit.framework.TestCase.runBare(TestCase.java:127)
> at junit.framework.TestResult$1.protect(TestResult.java:106)
> at junit.framework.TestResult.runProtected(TestResult.java:124)
> at junit.framework.TestResult.run(TestResult.java:109)
> at junit.framework.TestCase.run(TestCase.java:118)
> at junit.framework.TestSuite.runTest(TestSuite.java:208)
> at junit.framework.TestSuite.run(TestSuite.java:203)
> at junit.framework.TestSuite.runTest(TestSuite.java:208)
> at junit.framework.TestSuite.run(TestSuite.java:203)
> at org.apache.tools.ant.taskdefs.optional.junit.JUnitTestRunner.run(JUnitTestRunner.java:289)
> at org.apache.tools.ant.taskdefs.optional.junit.JUnitTestRunner.main(JUnitTestRunner.java:523)
> Caused by: java.io.IOException: java.io.IOException: Host portion is not a valid DNS name, IPv4 address, or IPv6 address
> at sun.security.x509.CertificateExtensions.parseExtension(CertificateExtensions.java:111)
> at sun.security.x509.CertificateExtensions.init(CertificateExtensions.java:78)
> at sun.security.x509.CertificateExtensions.<init>(CertificateExtensions.java:57)
> at sun.security.x509.X509CertInfo.parse(X509CertInfo.java:731)
> at sun.security.x509.X509CertInfo.<init>(X509CertInfo.java:155)
> ... 31 more
> Caused by: java.io.IOException: Host portion is not a valid DNS name, IPv4 address, or IPv6 address
> at sun.security.x509.URIName.parseName(URIName.java:205)
> at sun.security.x509.URIName.<init>(URIName.java:85)
> at sun.security.x509.GeneralName.<init>(GeneralName.java:94)
> at sun.security.x509.GeneralNames.<init>(GeneralNames.java:51)
> at sun.security.x509.DistributionPoint.<init>(DistributionPoint.java:193)
> at sun.security.x509.CRLDistributionPointsExtension.<init>(CRLDistributionPointsExtension.java:126)
> at sun.reflect.NativeConstructorAccessorImpl.newInstance0(Native Method)
> at sun.reflect.NativeConstructorAccessorImpl.newInstance(NativeConstructorAccessorImpl.java:39)
> at sun.reflect.DelegatingConstructorAccessorImpl.newInstance(DelegatingConstructorAccessorImpl.java:27)
> at java.lang.reflect.Constructor.newInstance(Constructor.java:274)
> at sun.security.x509.CertificateExtensions.parseExtension(CertificateExtensions.java:105)
> ... 35 more
> java.lang.reflect.InvocationTargetException
> at sun.reflect.NativeConstructorAccessorImpl.newInstance0(Native Method)
> at sun.reflect.NativeConstructorAccessorImpl.newInstance(NativeConstructorAccessorImpl.java:39)
> at sun.reflect.DelegatingConstructorAccessorImpl.newInstance(DelegatingConstructorAccessorImpl.java:27)
> at java.lang.reflect.Constructor.newInstance(Constructor.java:274)
> at org.apache.ws.security.components.crypto.CryptoFactory.loadClass(CryptoFactory.java:117)
> at org.apache.ws.security.components.crypto.CryptoFactory.getInstance(CryptoFactory.java:101)
> at interop.TestInteropKeys.testInteropKeys1(TestInteropKeys.java:41)
> at sun.reflect.NativeMethodAccessorImpl.invoke0(Native Method)
> at sun.reflect.NativeMethodAccessorImpl.invoke(NativeMethodAccessorImpl.java:39)
> at sun.reflect.DelegatingMethodAccessorImpl.invoke(DelegatingMethodAccessorImpl.java:25)
> at java.lang.reflect.Method.invoke(Method.java:324)
> at junit.framework.TestCase.runTest(TestCase.java:154)
> at junit.framework.TestCase.runBare(TestCase.java:127)
> at junit.framework.TestResult$1.protect(TestResult.java:106)
> at junit.framework.TestResult.runProtected(TestResult.java:124)
> at junit.framework.TestResult.run(TestResult.java:109)
> at junit.framework.TestCase.run(TestCase.java:118)
> at junit.framework.TestSuite.runTest(TestSuite.java:208)
> at junit.framework.TestSuite.run(TestSuite.java:203)
> at junit.framework.TestSuite.runTest(TestSuite.java:208)
> at junit.framework.TestSuite.run(TestSuite.java:203)
> at org.apache.tools.ant.taskdefs.optional.junit.JUnitTestRunner.run(JUnitTestRunner.java:289)
> at org.apache.tools.ant.taskdefs.optional.junit.JUnitTestRunner.main(JUnitTestRunner.java:523)
> Caused by: org.apache.ws.security.components.crypto.CredentialException: Failed to load credentials. Inner Exception: [java.io.IOException: java.io.IOException: Host portion is not a valid DNS name, IPv4 address, or IPv6 address]
> at org.apache.ws.security.components.crypto.Merlin.load(Merlin.java:513)
> at org.apache.ws.security.components.crypto.Merlin.<init>(Merlin.java:114)
> ... 23 more
> java.lang.InstantiationException: org.apache.ws.security.components.crypto.Merlin
> at java.lang.Class.newInstance0(Class.java:293)
> at java.lang.Class.newInstance(Class.java:261)
> at org.apache.ws.security.components.crypto.CryptoFactory.loadClass(CryptoFactory.java:125)
> at org.apache.ws.security.components.crypto.CryptoFactory.getInstance(CryptoFactory.java:101)
> at interop.TestInteropKeys.testInteropKeys1(TestInteropKeys.java:41)
> at sun.reflect.NativeMethodAccessorImpl.invoke0(Native Method)
> at sun.reflect.NativeMethodAccessorImpl.invoke(NativeMethodAccessorImpl.java:39)
> at sun.reflect.DelegatingMethodAccessorImpl.invoke(DelegatingMethodAccessorImpl.java:25)
> at java.lang.reflect.Method.invoke(Method.java:324)
> at junit.framework.TestCase.runTest(TestCase.java:154)
> at junit.framework.TestCase.runBare(TestCase.java:127)
> at junit.framework.TestResult$1.protect(TestResult.java:106)
> at junit.framework.TestResult.runProtected(TestResult.java:124)
> at junit.framework.TestResult.run(TestResult.java:109)
> at junit.framework.TestCase.run(TestCase.java:118)
> at junit.framework.TestSuite.runTest(TestSuite.java:208)
> at junit.framework.TestSuite.run(TestSuite.java:203)
> at junit.framework.TestSuite.runTest(TestSuite.java:208)
> at junit.framework.TestSuite.run(TestSuite.java:203)
> at org.apache.tools.ant.taskdefs.optional.junit.JUnitTestRunner.run(JUnitTestRunner.java:289)
> at org.apache.tools.ant.taskdefs.optional.junit.JUnitTestRunner.main(JUnitTestRunner.java:523)
> java.security.cert.CertificateParsingException: java.io.IOException: java.io.IOException: Host portion is not a valid DNS name, IPv4 address, or IPv6 address
> at sun.security.x509.X509CertInfo.<init>(X509CertInfo.java:157)
> at sun.security.x509.X509CertImpl.parse(X509CertImpl.java:1679)
> at sun.security.x509.X509CertImpl.<init>(X509CertImpl.java:173)
> at sun.security.provider.X509Factory.engineGenerateCertificate(X509Factory.java:90)
> at java.security.cert.CertificateFactory.generateCertificate(CertificateFactory.java:389)
> at sun.security.provider.JavaKeyStore.engineLoad(JavaKeyStore.java:684)
> at java.security.KeyStore.load(KeyStore.java:652)
> at org.apache.ws.security.components.crypto.Merlin.load(Merlin.java:507)
> at org.apache.ws.security.components.crypto.Merlin.<init>(Merlin.java:114)
> at sun.reflect.NativeConstructorAccessorImpl.newInstance0(Native Method)
> at sun.reflect.NativeConstructorAccessorImpl.newInstance(NativeConstructorAccessorImpl.java:39)
> at sun.reflect.DelegatingConstructorAccessorImpl.newInstance(DelegatingConstructorAccessorImpl.java:27)
> at java.lang.reflect.Constructor.newInstance(Constructor.java:274)
> at org.apache.ws.security.components.crypto.CryptoFactory.loadClass(CryptoFactory.java:117)
> at org.apache.ws.security.components.crypto.CryptoFactory.getInstance(CryptoFactory.java:101)
> at interop.TestInteropKeys.testInteropKeys2(TestInteropKeys.java:50)
> at sun.reflect.NativeMethodAccessorImpl.invoke0(Native Method)
> at sun.reflect.NativeMethodAccessorImpl.invoke(NativeMethodAccessorImpl.java:39)
> at sun.reflect.DelegatingMethodAccessorImpl.invoke(DelegatingMethodAccessorImpl.java:25)
> at java.lang.reflect.Method.invoke(Method.java:324)
> at junit.framework.TestCase.runTest(TestCase.java:154)
> at junit.framework.TestCase.runBare(TestCase.java:127)
> at junit.framework.TestResult$1.protect(TestResult.java:106)
> at junit.framework.TestResult.runProtected(TestResult.java:124)
> at junit.framework.TestResult.run(TestResult.java:109)
> at junit.framework.TestCase.run(TestCase.java:118)
> at junit.framework.TestSuite.runTest(TestSuite.java:208)
> at junit.framework.TestSuite.run(TestSuite.java:203)
> at junit.framework.TestSuite.runTest(TestSuite.java:208)
> at junit.framework.TestSuite.run(TestSuite.java:203)
> at org.apache.tools.ant.taskdefs.optional.junit.JUnitTestRunner.run(JUnitTestRunner.java:289)
> at org.apache.tools.ant.taskdefs.optional.junit.JUnitTestRunner.main(JUnitTestRunner.java:523)
> Caused by: java.io.IOException: java.io.IOException: Host portion is not a valid DNS name, IPv4 address, or IPv6 address
> at sun.security.x509.CertificateExtensions.parseExtension(CertificateExtensions.java:111)
> at sun.security.x509.CertificateExtensions.init(CertificateExtensions.java:78)
> at sun.security.x509.CertificateExtensions.<init>(CertificateExtensions.java:57)
> at sun.security.x509.X509CertInfo.parse(X509CertInfo.java:731)
> at sun.security.x509.X509CertInfo.<init>(X509CertInfo.java:155)
> ... 31 more
> Caused by: java.io.IOException: Host portion is not a valid DNS name, IPv4 address, or IPv6 address
> at sun.security.x509.URIName.parseName(URIName.java:205)
> at sun.security.x509.URIName.<init>(URIName.java:85)
> at sun.security.x509.GeneralName.<init>(GeneralName.java:94)
> at sun.security.x509.GeneralNames.<init>(GeneralNames.java:51)
> at sun.security.x509.DistributionPoint.<init>(DistributionPoint.java:193)
> at sun.security.x509.CRLDistributionPointsExtension.<init>(CRLDistributionPointsExtension.java:126)
> at sun.reflect.NativeConstructorAccessorImpl.newInstance0(Native Method)
> at sun.reflect.NativeConstructorAccessorImpl.newInstance(NativeConstructorAccessorImpl.java:39)
> at sun.reflect.DelegatingConstructorAccessorImpl.newInstance(DelegatingConstructorAccessorImpl.java:27)
> at java.lang.reflect.Constructor.newInstance(Constructor.java:274)
> at sun.security.x509.CertificateExtensions.parseExtension(CertificateExtensions.java:105)
> ... 35 more
> java.lang.reflect.InvocationTargetException
> at sun.reflect.NativeConstructorAccessorImpl.newInstance0(Native Method)
> at sun.reflect.NativeConstructorAccessorImpl.newInstance(NativeConstructorAccessorImpl.java:39)
> at sun.reflect.DelegatingConstructorAccessorImpl.newInstance(DelegatingConstructorAccessorImpl.java:27)
> at java.lang.reflect.Constructor.newInstance(Constructor.java:274)
> at org.apache.ws.security.components.crypto.CryptoFactory.loadClass(CryptoFactory.java:117)
> at org.apache.ws.security.components.crypto.CryptoFactory.getInstance(CryptoFactory.java:101)
> at interop.TestInteropKeys.testInteropKeys2(TestInteropKeys.java:50)
> at sun.reflect.NativeMethodAccessorImpl.invoke0(Native Method)
> at sun.reflect.NativeMethodAccessorImpl.invoke(NativeMethodAccessorImpl.java:39)
> at sun.reflect.DelegatingMethodAccessorImpl.invoke(DelegatingMethodAccessorImpl.java:25)
> at java.lang.reflect.Method.invoke(Method.java:324)
> at junit.framework.TestCase.runTest(TestCase.java:154)
> at junit.framework.TestCase.runBare(TestCase.java:127)
> at junit.framework.TestResult$1.protect(TestResult.java:106)
> at junit.framework.TestResult.runProtected(TestResult.java:124)
> at junit.framework.TestResult.run(TestResult.java:109)
> at junit.framework.TestCase.run(TestCase.java:118)
> at junit.framework.TestSuite.runTest(TestSuite.java:208)
> at junit.framework.TestSuite.run(TestSuite.java:203)
> at junit.framework.TestSuite.runTest(TestSuite.java:208)
> at junit.framework.TestSuite.run(TestSuite.java:203)
> at org.apache.tools.ant.taskdefs.optional.junit.JUnitTestRunner.run(JUnitTestRunner.java:289)
> at org.apache.tools.ant.taskdefs.optional.junit.JUnitTestRunner.main(JUnitTestRunner.java:523)
> Caused by: org.apache.ws.security.components.crypto.CredentialException: Failed to load credentials. Inner Exception: [java.io.IOException: java.io.IOException: Host portion is not a valid DNS name, IPv4 address, or IPv6 address]
> at org.apache.ws.security.components.crypto.Merlin.load(Merlin.java:513)
> at org.apache.ws.security.components.crypto.Merlin.<init>(Merlin.java:114)
> ... 23 more
> java.lang.InstantiationException: org.apache.ws.security.components.crypto.Merlin
> at java.lang.Class.newInstance0(Class.java:293)
> at java.lang.Class.newInstance(Class.java:261)
> at org.apache.ws.security.components.crypto.CryptoFactory.loadClass(CryptoFactory.java:125)
> at org.apache.ws.security.components.crypto.CryptoFactory.getInstance(CryptoFactory.java:101)
> at interop.TestInteropKeys.testInteropKeys2(TestInteropKeys.java:50)
> at sun.reflect.NativeMethodAccessorImpl.invoke0(Native Method)
> at sun.reflect.NativeMethodAccessorImpl.invoke(NativeMethodAccessorImpl.java:39)
> at sun.reflect.DelegatingMethodAccessorImpl.invoke(DelegatingMethodAccessorImpl.java:25)
> at java.lang.reflect.Method.invoke(Method.java:324)
> at junit.framework.TestCase.runTest(TestCase.java:154)
> at junit.framework.TestCase.runBare(TestCase.java:127)
> at junit.framework.TestResult$1.protect(TestResult.java:106)
> at junit.framework.TestResult.runProtected(TestResult.java:124)
> at junit.framework.TestResult.run(TestResult.java:109)
> at junit.framework.TestCase.run(TestCase.java:118)
> at junit.framework.TestSuite.runTest(TestSuite.java:208)
> at junit.framework.TestSuite.run(TestSuite.java:203)
> at junit.framework.TestSuite.runTest(TestSuite.java:208)
> at junit.framework.TestSuite.run(TestSuite.java:203)
> at org.apache.tools.ant.taskdefs.optional.junit.JUnitTestRunner.run(JUnitTestRunner.java:289)
> at org.apache.tools.ant.taskdefs.optional.junit.JUnitTestRunner.main(JUnitTestRunner.java:523)
> java.security.cert.CertificateParsingException: java.io.IOException: java.io.IOException: Host portion is not a valid DNS name, IPv4 address, or IPv6 address
> at sun.security.x509.X509CertInfo.<init>(X509CertInfo.java:157)
> at sun.security.x509.X509CertImpl.parse(X509CertImpl.java:1679)
> at sun.security.x509.X509CertImpl.<init>(X509CertImpl.java:173)
> at sun.security.provider.X509Factory.engineGenerateCertificate(X509Factory.java:90)
> at java.security.cert.CertificateFactory.generateCertificate(CertificateFactory.java:389)
> at sun.security.provider.JavaKeyStore.engineLoad(JavaKeyStore.java:684)
> at java.security.KeyStore.load(KeyStore.java:652)
> at org.apache.ws.security.components.crypto.Merlin.load(Merlin.java:507)
> at org.apache.ws.security.components.crypto.Merlin.<init>(Merlin.java:114)
> at sun.reflect.NativeConstructorAccessorImpl.newInstance0(Native Method)
> at sun.reflect.NativeConstructorAccessorImpl.newInstance(NativeConstructorAccessorImpl.java:39)
> at sun.reflect.DelegatingConstructorAccessorImpl.newInstance(DelegatingConstructorAccessorImpl.java:27)
> at java.lang.reflect.Constructor.newInstance(Constructor.java:274)
> at org.apache.ws.security.components.crypto.CryptoFactory.loadClass(CryptoFactory.java:117)
> at org.apache.ws.security.components.crypto.CryptoFactory.getInstance(CryptoFactory.java:101)
> at org.apache.ws.axis.security.WSDoAllSender.loadEncryptionCrypto(WSDoAllSender.java:606)
> at org.apache.ws.axis.security.WSDoAllSender.invoke(WSDoAllSender.java:260)
> at org.apache.axis.strategies.InvocationStrategy.visit(InvocationStrategy.java:32)
> at org.apache.axis.SimpleChain.doVisiting(SimpleChain.java:118)
> at org.apache.axis.SimpleChain.invoke(SimpleChain.java:83)
> at org.apache.axis.client.AxisClient.invoke(AxisClient.java:128)
> at org.apache.axis.client.Call.invokeEngine(Call.java:2735)
> at org.apache.axis.client.Call.invoke(Call.java:2718)
> at org.apache.axis.client.Call.invoke(Call.java:2394)
> at org.apache.axis.client.Call.invoke(Call.java:2317)
> at org.apache.axis.client.Call.invoke(Call.java:1774)
> at org.apache.ws.axis.oasis.ping.PingBindingStub.ping(PingBindingStub.java:137)
> at org.apache.ws.axis.oasis.Scenario2.main(Scenario2.java:86)
> at interop.TestScenario2.testScenario2(TestScenario2.java:63)
> at sun.reflect.NativeMethodAccessorImpl.invoke0(Native Method)
> at sun.reflect.NativeMethodAccessorImpl.invoke(NativeMethodAccessorImpl.java:39)
> at sun.reflect.DelegatingMethodAccessorImpl.invoke(DelegatingMethodAccessorImpl.java:25)
> at java.lang.reflect.Method.invoke(Method.java:324)
> at junit.framework.TestCase.runTest(TestCase.java:154)
> at junit.framework.TestCase.runBare(TestCase.java:127)
> at junit.framework.TestResult$1.protect(TestResult.java:106)
> at junit.framework.TestResult.runProtected(TestResult.java:124)
> at junit.framework.TestResult.run(TestResult.java:109)
> at junit.framework.TestCase.run(TestCase.java:118)
> at junit.framework.TestSuite.runTest(TestSuite.java:208)
> at junit.framework.TestSuite.run(TestSuite.java:203)
> at junit.framework.TestSuite.runTest(TestSuite.java:208)
> at junit.framework.TestSuite.run(TestSuite.java:203)
> at org.apache.tools.ant.taskdefs.optional.junit.JUnitTestRunner.run(JUnitTestRunner.java:289)
> at org.apache.tools.ant.taskdefs.optional.junit.JUnitTestRunner.main(JUnitTestRunner.java:523)
> Caused by: java.io.IOException: java.io.IOException: Host portion is not a valid DNS name, IPv4 address, or IPv6 address
> at sun.security.x509.CertificateExtensions.parseExtension(CertificateExtensions.java:111)
> at sun.security.x509.CertificateExtensions.init(CertificateExtensions.java:78)
> at sun.security.x509.CertificateExtensions.<init>(CertificateExtensions.java:57)
> at sun.security.x509.X509CertInfo.parse(X509CertInfo.java:731)
> at sun.security.x509.X509CertInfo.<init>(X509CertInfo.java:155)
> ... 44 more
> Caused by: java.io.IOException: Host portion is not a valid DNS name, IPv4 address, or IPv6 address
> at sun.security.x509.URIName.parseName(URIName.java:205)
> at sun.security.x509.URIName.<init>(URIName.java:85)
> at sun.security.x509.GeneralName.<init>(GeneralName.java:94)
> at sun.security.x509.GeneralNames.<init>(GeneralNames.java:51)
> at sun.security.x509.DistributionPoint.<init>(DistributionPoint.java:193)
> at sun.security.x509.CRLDistributionPointsExtension.<init>(CRLDistributionPointsExtension.java:126)
> at sun.reflect.NativeConstructorAccessorImpl.newInstance0(Native Method)
> at sun.reflect.NativeConstructorAccessorImpl.newInstance(NativeConstructorAccessorImpl.java:39)
> at sun.reflect.DelegatingConstructorAccessorImpl.newInstance(DelegatingConstructorAccessorImpl.java:27)
> at java.lang.reflect.Constructor.newInstance(Constructor.java:274)
> at sun.security.x509.CertificateExtensions.parseExtension(CertificateExtensions.java:105)
> ... 48 more
> java.lang.reflect.InvocationTargetException
> at sun.reflect.NativeConstructorAccessorImpl.newInstance0(Native Method)
> at sun.reflect.NativeConstructorAccessorImpl.newInstance(NativeConstructorAccessorImpl.java:39)
> at sun.reflect.DelegatingConstructorAccessorImpl.newInstance(DelegatingConstructorAccessorImpl.java:27)
> at java.lang.reflect.Constructor.newInstance(Constructor.java:274)
> at org.apache.ws.security.components.crypto.CryptoFactory.loadClass(CryptoFactory.java:117)
> at org.apache.ws.security.components.crypto.CryptoFactory.getInstance(CryptoFactory.java:101)
> at org.apache.ws.axis.security.WSDoAllSender.loadEncryptionCrypto(WSDoAllSender.java:606)
> at org.apache.ws.axis.security.WSDoAllSender.invoke(WSDoAllSender.java:260)
> at org.apache.axis.strategies.InvocationStrategy.visit(InvocationStrategy.java:32)
> at org.apache.axis.SimpleChain.doVisiting(SimpleChain.java:118)
> at org.apache.axis.SimpleChain.invoke(SimpleChain.java:83)
> at org.apache.axis.client.AxisClient.invoke(AxisClient.java:128)
> at org.apache.axis.client.Call.invokeEngine(Call.java:2735)
> at org.apache.axis.client.Call.invoke(Call.java:2718)
> at org.apache.axis.client.Call.invoke(Call.java:2394)
> at org.apache.axis.client.Call.invoke(Call.java:2317)
> at org.apache.axis.client.Call.invoke(Call.java:1774)
> at org.apache.ws.axis.oasis.ping.PingBindingStub.ping(PingBindingStub.java:137)
> at org.apache.ws.axis.oasis.Scenario2.main(Scenario2.java:86)
> at interop.TestScenario2.testScenario2(TestScenario2.java:63)
> at sun.reflect.NativeMethodAccessorImpl.invoke0(Native Method)
> at sun.reflect.NativeMethodAccessorImpl.invoke(NativeMethodAccessorImpl.java:39)
> at sun.reflect.DelegatingMethodAccessorImpl.invoke(DelegatingMethodAccessorImpl.java:25)
> at java.lang.reflect.Method.invoke(Method.java:324)
> at junit.framework.TestCase.runTest(TestCase.java:154)
> at junit.framework.TestCase.runBare(TestCase.java:127)
> at junit.framework.TestResult$1.protect(TestResult.java:106)
> at junit.framework.TestResult.runProtected(TestResult.java:124)
> at junit.framework.TestResult.run(TestResult.java:109)
> at junit.framework.TestCase.run(TestCase.java:118)
> at junit.framework.TestSuite.runTest(TestSuite.java:208)
> at junit.framework.TestSuite.run(TestSuite.java:203)
> at junit.framework.TestSuite.runTest(TestSuite.java:208)
> at junit.framework.TestSuite.run(TestSuite.java:203)
> at org.apache.tools.ant.taskdefs.optional.junit.JUnitTestRunner.run(JUnitTestRunner.java:289)
> at org.apache.tools.ant.taskdefs.optional.junit.JUnitTestRunner.main(JUnitTestRunner.java:523)
> Caused by: org.apache.ws.security.components.crypto.CredentialException: Failed to load credentials. Inner Exception: [java.io.IOException: java.io.IOException: Host portion is not a valid DNS name, IPv4 address, or IPv6 address]
> at org.apache.ws.security.components.crypto.Merlin.load(Merlin.java:513)
> at org.apache.ws.security.components.crypto.Merlin.<init>(Merlin.java:114)
> ... 36 more
> java.lang.InstantiationException: org.apache.ws.security.components.crypto.Merlin
> at java.lang.Class.newInstance0(Class.java:293)
> at java.lang.Class.newInstance(Class.java:261)
> at org.apache.ws.security.components.crypto.CryptoFactory.loadClass(CryptoFactory.java:125)
> at org.apache.ws.security.components.crypto.CryptoFactory.getInstance(CryptoFactory.java:101)
> at org.apache.ws.axis.security.WSDoAllSender.loadEncryptionCrypto(WSDoAllSender.java:606)
> at org.apache.ws.axis.security.WSDoAllSender.invoke(WSDoAllSender.java:260)
> at org.apache.axis.strategies.InvocationStrategy.visit(InvocationStrategy.java:32)
> at org.apache.axis.SimpleChain.doVisiting(SimpleChain.java:118)
> at org.apache.axis.SimpleChain.invoke(SimpleChain.java:83)
> at org.apache.axis.client.AxisClient.invoke(AxisClient.java:128)
> at org.apache.axis.client.Call.invokeEngine(Call.java:2735)
> at org.apache.axis.client.Call.invoke(Call.java:2718)
> at org.apache.axis.client.Call.invoke(Call.java:2394)
> at org.apache.axis.client.Call.invoke(Call.java:2317)
> at org.apache.axis.client.Call.invoke(Call.java:1774)
> at org.apache.ws.axis.oasis.ping.PingBindingStub.ping(PingBindingStub.java:137)
> at org.apache.ws.axis.oasis.Scenario2.main(Scenario2.java:86)
> at interop.TestScenario2.testScenario2(TestScenario2.java:63)
> at sun.reflect.NativeMethodAccessorImpl.invoke0(Native Method)
> at sun.reflect.NativeMethodAccessorImpl.invoke(NativeMethodAccessorImpl.java:39)
> at sun.reflect.DelegatingMethodAccessorImpl.invoke(DelegatingMethodAccessorImpl.java:25)
> at java.lang.reflect.Method.invoke(Method.java:324)
> at junit.framework.TestCase.runTest(TestCase.java:154)
> at junit.framework.TestCase.runBare(TestCase.java:127)
> at junit.framework.TestResult$1.protect(TestResult.java:106)
> at junit.framework.TestResult.runProtected(TestResult.java:124)
> at junit.framework.TestResult.run(TestResult.java:109)
> at junit.framework.TestCase.run(TestCase.java:118)
> at junit.framework.TestSuite.runTest(TestSuite.java:208)
> at junit.framework.TestSuite.run(TestSuite.java:203)
> at junit.framework.TestSuite.runTest(TestSuite.java:208)
> at junit.framework.TestSuite.run(TestSuite.java:203)
> at org.apache.tools.ant.taskdefs.optional.junit.JUnitTestRunner.run(JUnitTestRunner.java:289)
> at org.apache.tools.ant.taskdefs.optional.junit.JUnitTestRunner.main(JUnitTestRunner.java:523)
> java.security.cert.CertificateParsingException: java.io.IOException: java.io.IOException: Host portion is not a valid DNS name, IPv4 address, or IPv6 address
> at sun.security.x509.X509CertInfo.<init>(X509CertInfo.java:157)
> at sun.security.x509.X509CertImpl.parse(X509CertImpl.java:1679)
> at sun.security.x509.X509CertImpl.<init>(X509CertImpl.java:173)
> at sun.security.provider.X509Factory.engineGenerateCertificate(X509Factory.java:90)
> at java.security.cert.CertificateFactory.generateCertificate(CertificateFactory.java:389)
> at sun.security.provider.JavaKeyStore.engineLoad(JavaKeyStore.java:684)
> at java.security.KeyStore.load(KeyStore.java:652)
> at org.apache.ws.security.components.crypto.Merlin.load(Merlin.java:507)
> at org.apache.ws.security.components.crypto.Merlin.<init>(Merlin.java:114)
> at sun.reflect.NativeConstructorAccessorImpl.newInstance0(Native Method)
> at sun.reflect.NativeConstructorAccessorImpl.newInstance(NativeConstructorAccessorImpl.java:39)
> at sun.reflect.DelegatingConstructorAccessorImpl.newInstance(DelegatingConstructorAccessorImpl.java:27)
> at java.lang.reflect.Constructor.newInstance(Constructor.java:274)
> at org.apache.ws.security.components.crypto.CryptoFactory.loadClass(CryptoFactory.java:117)
> at org.apache.ws.security.components.crypto.CryptoFactory.getInstance(CryptoFactory.java:101)
> at org.apache.ws.axis.security.WSDoAllSender.loadSignatureCrypto(WSDoAllSender.java:579)
> at org.apache.ws.axis.security.WSDoAllSender.invoke(WSDoAllSender.java:244)
> at org.apache.axis.strategies.InvocationStrategy.visit(InvocationStrategy.java:32)
> at org.apache.axis.SimpleChain.doVisiting(SimpleChain.java:118)
> at org.apache.axis.SimpleChain.invoke(SimpleChain.java:83)
> at org.apache.axis.client.AxisClient.invoke(AxisClient.java:128)
> at org.apache.axis.client.Call.invokeEngine(Call.java:2735)
> at org.apache.axis.client.Call.invoke(Call.java:2718)
> at org.apache.axis.client.Call.invoke(Call.java:2394)
> at org.apache.axis.client.Call.invoke(Call.java:2317)
> at org.apache.axis.client.Call.invoke(Call.java:1774)
> at org.apache.ws.axis.oasis.ping.PingBindingStub.ping(PingBindingStub.java:137)
> at org.apache.ws.axis.oasis.Scenario3.main(Scenario3.java:86)
> at interop.TestScenario3.testScenario3(TestScenario3.java:63)
> at sun.reflect.NativeMethodAccessorImpl.invoke0(Native Method)
> at sun.reflect.NativeMethodAccessorImpl.invoke(NativeMethodAccessorImpl.java:39)
> at sun.reflect.DelegatingMethodAccessorImpl.invoke(DelegatingMethodAccessorImpl.java:25)
> at java.lang.reflect.Method.invoke(Method.java:324)
> at junit.framework.TestCase.runTest(TestCase.java:154)
> at junit.framework.TestCase.runBare(TestCase.java:127)
> at junit.framework.TestResult$1.protect(TestResult.java:106)
> at junit.framework.TestResult.runProtected(TestResult.java:124)
> at junit.framework.TestResult.run(TestResult.java:109)
> at junit.framework.TestCase.run(TestCase.java:118)
> at junit.framework.TestSuite.runTest(TestSuite.java:208)
> at junit.framework.TestSuite.run(TestSuite.java:203)
> at junit.framework.TestSuite.runTest(TestSuite.java:208)
> at junit.framework.TestSuite.run(TestSuite.java:203)
> at org.apache.tools.ant.taskdefs.optional.junit.JUnitTestRunner.run(JUnitTestRunner.java:289)
> at org.apache.tools.ant.taskdefs.optional.junit.JUnitTestRunner.main(JUnitTestRunner.java:523)
> Caused by: java.io.IOException: java.io.IOException: Host portion is not a valid DNS name, IPv4 address, or IPv6 address
> at sun.security.x509.CertificateExtensions.parseExtension(CertificateExtensions.java:111)
> at sun.security.x509.CertificateExtensions.init(CertificateExtensions.java:78)
> at sun.security.x509.CertificateExtensions.<init>(CertificateExtensions.java:57)
> at sun.security.x509.X509CertInfo.parse(X509CertInfo.java:731)
> at sun.security.x509.X509CertInfo.<init>(X509CertInfo.java:155)
> ... 44 more
> Caused by: java.io.IOException: Host portion is not a valid DNS name, IPv4 address, or IPv6 address
> at sun.security.x509.URIName.parseName(URIName.java:205)
> at sun.security.x509.URIName.<init>(URIName.java:85)
> at sun.security.x509.GeneralName.<init>(GeneralName.java:94)
> at sun.security.x509.GeneralNames.<init>(GeneralNames.java:51)
> at sun.security.x509.DistributionPoint.<init>(DistributionPoint.java:193)
> at sun.security.x509.CRLDistributionPointsExtension.<init>(CRLDistributionPointsExtension.java:126)
> at sun.reflect.NativeConstructorAccessorImpl.newInstance0(Native Method)
> at sun.reflect.NativeConstructorAccessorImpl.newInstance(NativeConstructorAccessorImpl.java:39)
> at sun.reflect.DelegatingConstructorAccessorImpl.newInstance(DelegatingConstructorAccessorImpl.java:27)
> at java.lang.reflect.Constructor.newInstance(Constructor.java:274)
> at sun.security.x509.CertificateExtensions.parseExtension(CertificateExtensions.java:105)
> ... 48 more
> java.lang.reflect.InvocationTargetException
> at sun.reflect.NativeConstructorAccessorImpl.newInstance0(Native Method)
> at sun.reflect.NativeConstructorAccessorImpl.newInstance(NativeConstructorAccessorImpl.java:39)
> at sun.reflect.DelegatingConstructorAccessorImpl.newInstance(DelegatingConstructorAccessorImpl.java:27)
> at java.lang.reflect.Constructor.newInstance(Constructor.java:274)
> at org.apache.ws.security.components.crypto.CryptoFactory.loadClass(CryptoFactory.java:117)
> at org.apache.ws.security.components.crypto.CryptoFactory.getInstance(CryptoFactory.java:101)
> at org.apache.ws.axis.security.WSDoAllSender.loadSignatureCrypto(WSDoAllSender.java:579)
> at org.apache.ws.axis.security.WSDoAllSender.invoke(WSDoAllSender.java:244)
> at org.apache.axis.strategies.InvocationStrategy.visit(InvocationStrategy.java:32)
> at org.apache.axis.SimpleChain.doVisiting(SimpleChain.java:118)
> at org.apache.axis.SimpleChain.invoke(SimpleChain.java:83)
> at org.apache.axis.client.AxisClient.invoke(AxisClient.java:128)
> at org.apache.axis.client.Call.invokeEngine(Call.java:2735)
> at org.apache.axis.client.Call.invoke(Call.java:2718)
> at org.apache.axis.client.Call.invoke(Call.java:2394)
> at org.apache.axis.client.Call.invoke(Call.java:2317)
> at org.apache.axis.client.Call.invoke(Call.java:1774)
> at org.apache.ws.axis.oasis.ping.PingBindingStub.ping(PingBindingStub.java:137)
> at org.apache.ws.axis.oasis.Scenario3.main(Scenario3.java:86)
> at interop.TestScenario3.testScenario3(TestScenario3.java:63)
> at sun.reflect.NativeMethodAccessorImpl.invoke0(Native Method)
> at sun.reflect.NativeMethodAccessorImpl.invoke(NativeMethodAccessorImpl.java:39)
> at sun.reflect.DelegatingMethodAccessorImpl.invoke(DelegatingMethodAccessorImpl.java:25)
> at java.lang.reflect.Method.invoke(Method.java:324)
> at junit.framework.TestCase.runTest(TestCase.java:154)
> at junit.framework.TestCase.runBare(TestCase.java:127)
> at junit.framework.TestResult$1.protect(TestResult.java:106)
> at junit.framework.TestResult.runProtected(TestResult.java:124)
> at junit.framework.TestResult.run(TestResult.java:109)
> at junit.framework.TestCase.run(TestCase.java:118)
> at junit.framework.TestSuite.runTest(TestSuite.java:208)
> at junit.framework.TestSuite.run(TestSuite.java:203)
> at junit.framework.TestSuite.runTest(TestSuite.java:208)
> at junit.framework.TestSuite.run(TestSuite.java:203)
> at org.apache.tools.ant.taskdefs.optional.junit.JUnitTestRunner.run(JUnitTestRunner.java:289)
> at org.apache.tools.ant.taskdefs.optional.junit.JUnitTestRunner.main(JUnitTestRunner.java:523)
> Caused by: org.apache.ws.security.components.crypto.CredentialException: Failed to load credentials. Inner Exception: [java.io.IOException: java.io.IOException: Host portion is not a valid DNS name, IPv4 address, or IPv6 address]
> at org.apache.ws.security.components.crypto.Merlin.load(Merlin.java:513)
> at org.apache.ws.security.components.crypto.Merlin.<init>(Merlin.java:114)
> ... 36 more
> java.lang.InstantiationException: org.apache.ws.security.components.crypto.Merlin
> at java.lang.Class.newInstance0(Class.java:293)
> at java.lang.Class.newInstance(Class.java:261)
> at org.apache.ws.security.components.crypto.CryptoFactory.loadClass(CryptoFactory.java:125)
> at org.apache.ws.security.components.crypto.CryptoFactory.getInstance(CryptoFactory.java:101)
> at org.apache.ws.axis.security.WSDoAllSender.loadSignatureCrypto(WSDoAllSender.java:579)
> at org.apache.ws.axis.security.WSDoAllSender.invoke(WSDoAllSender.java:244)
> at org.apache.axis.strategies.InvocationStrategy.visit(InvocationStrategy.java:32)
> at org.apache.axis.SimpleChain.doVisiting(SimpleChain.java:118)
> at org.apache.axis.SimpleChain.invoke(SimpleChain.java:83)
> at org.apache.axis.client.AxisClient.invoke(AxisClient.java:128)
> at org.apache.axis.client.Call.invokeEngine(Call.java:2735)
> at org.apache.axis.client.Call.invoke(Call.java:2718)
> at org.apache.axis.client.Call.invoke(Call.java:2394)
> at org.apache.axis.client.Call.invoke(Call.java:2317)
> at org.apache.axis.client.Call.invoke(Call.java:1774)
> at org.apache.ws.axis.oasis.ping.PingBindingStub.ping(PingBindingStub.java:137)
> at org.apache.ws.axis.oasis.Scenario3.main(Scenario3.java:86)
> at interop.TestScenario3.testScenario3(TestScenario3.java:63)
> at sun.reflect.NativeMethodAccessorImpl.invoke0(Native Method)
> at sun.reflect.NativeMethodAccessorImpl.invoke(NativeMethodAccessorImpl.java:39)
> at sun.reflect.DelegatingMethodAccessorImpl.invoke(DelegatingMethodAccessorImpl.java:25)
> at java.lang.reflect.Method.invoke(Method.java:324)
> at junit.framework.TestCase.runTest(TestCase.java:154)
> at junit.framework.TestCase.runBare(TestCase.java:127)
> at junit.framework.TestResult$1.protect(TestResult.java:106)
> at junit.framework.TestResult.runProtected(TestResult.java:124)
> at junit.framework.TestResult.run(TestResult.java:109)
> at junit.framework.TestCase.run(TestCase.java:118)
> at junit.framework.TestSuite.runTest(TestSuite.java:208)
> at junit.framework.TestSuite.run(TestSuite.java:203)
> at junit.framework.TestSuite.runTest(TestSuite.java:208)
> at junit.framework.TestSuite.run(TestSuite.java:203)
> at org.apache.tools.ant.taskdefs.optional.junit.JUnitTestRunner.run(JUnitTestRunner.java:289)
> at org.apache.tools.ant.taskdefs.optional.junit.JUnitTestRunner.main(JUnitTestRunner.java:523)
> java.security.cert.CertificateParsingException: java.io.IOException: java.io.IOException: Host portion is not a valid DNS name, IPv4 address, or IPv6 address
> at sun.security.x509.X509CertInfo.<init>(X509CertInfo.java:157)
> at sun.security.x509.X509CertImpl.parse(X509CertImpl.java:1679)
> at sun.security.x509.X509CertImpl.<init>(X509CertImpl.java:173)
> at sun.security.provider.X509Factory.engineGenerateCertificate(X509Factory.java:90)
> at java.security.cert.CertificateFactory.generateCertificate(CertificateFactory.java:389)
> at sun.security.provider.JavaKeyStore.engineLoad(JavaKeyStore.java:684)
> at java.security.KeyStore.load(KeyStore.java:652)
> at org.apache.ws.security.components.crypto.Merlin.load(Merlin.java:507)
> at org.apache.ws.security.components.crypto.Merlin.<init>(Merlin.java:114)
> at sun.reflect.NativeConstructorAccessorImpl.newInstance0(Native Method)
> at sun.reflect.NativeConstructorAccessorImpl.newInstance(NativeConstructorAccessorImpl.java:39)
> at sun.reflect.DelegatingConstructorAccessorImpl.newInstance(DelegatingConstructorAccessorImpl.java:27)
> at java.lang.reflect.Constructor.newInstance(Constructor.java:274)
> at org.apache.ws.security.components.crypto.CryptoFactory.loadClass(CryptoFactory.java:117)
> at org.apache.ws.security.components.crypto.CryptoFactory.getInstance(CryptoFactory.java:101)
> at org.apache.ws.axis.security.WSDoAllSender.loadSignatureCrypto(WSDoAllSender.java:579)
> at org.apache.ws.axis.security.WSDoAllSender.invoke(WSDoAllSender.java:244)
> at org.apache.axis.strategies.InvocationStrategy.visit(InvocationStrategy.java:32)
> at org.apache.axis.SimpleChain.doVisiting(SimpleChain.java:118)
> at org.apache.axis.SimpleChain.invoke(SimpleChain.java:83)
> at org.apache.axis.client.AxisClient.invoke(AxisClient.java:128)
> at org.apache.axis.client.Call.invokeEngine(Call.java:2735)
> at org.apache.axis.client.Call.invoke(Call.java:2718)
> at org.apache.axis.client.Call.invoke(Call.java:2394)
> at org.apache.axis.client.Call.invoke(Call.java:2317)
> at org.apache.axis.client.Call.invoke(Call.java:1774)
> at org.apache.ws.axis.oasis.ping.PingBindingStub.ping(PingBindingStub.java:137)
> at org.apache.ws.axis.oasis.Scenario4.main(Scenario4.java:86)
> at interop.TestScenario4.testScenario4(TestScenario4.java:63)
> at sun.reflect.NativeMethodAccessorImpl.invoke0(Native Method)
> at sun.reflect.NativeMethodAccessorImpl.invoke(NativeMethodAccessorImpl.java:39)
> at sun.reflect.DelegatingMethodAccessorImpl.invoke(DelegatingMethodAccessorImpl.java:25)
> at java.lang.reflect.Method.invoke(Method.java:324)
> at junit.framework.TestCase.runTest(TestCase.java:154)
> at junit.framework.TestCase.runBare(TestCase.java:127)
> at junit.framework.TestResult$1.protect(TestResult.java:106)
> at junit.framework.TestResult.runProtected(TestResult.java:124)
> at junit.framework.TestResult.run(TestResult.java:109)
> at junit.framework.TestCase.run(TestCase.java:118)
> at junit.framework.TestSuite.runTest(TestSuite.java:208)
> at junit.framework.TestSuite.run(TestSuite.java:203)
> at junit.framework.TestSuite.runTest(TestSuite.java:208)
> at junit.framework.TestSuite.run(TestSuite.java:203)
> at org.apache.tools.ant.taskdefs.optional.junit.JUnitTestRunner.run(JUnitTestRunner.java:289)
> at org.apache.tools.ant.taskdefs.optional.junit.JUnitTestRunner.main(JUnitTestRunner.java:523)
> Caused by: java.io.IOException: java.io.IOException: Host portion is not a valid DNS name, IPv4 address, or IPv6 address
> at sun.security.x509.CertificateExtensions.parseExtension(CertificateExtensions.java:111)
> at sun.security.x509.CertificateExtensions.init(CertificateExtensions.java:78)
> at sun.security.x509.CertificateExtensions.<init>(CertificateExtensions.java:57)
> at sun.security.x509.X509CertInfo.parse(X509CertInfo.java:731)
> at sun.security.x509.X509CertInfo.<init>(X509CertInfo.java:155)
> ... 44 more
> Caused by: java.io.IOException: Host portion is not a valid DNS name, IPv4 address, or IPv6 address
> at sun.security.x509.URIName.parseName(URIName.java:205)
> at sun.security.x509.URIName.<init>(URIName.java:85)
> at sun.security.x509.GeneralName.<init>(GeneralName.java:94)
> at sun.security.x509.GeneralNames.<init>(GeneralNames.java:51)
> at sun.security.x509.DistributionPoint.<init>(DistributionPoint.java:193)
> at sun.security.x509.CRLDistributionPointsExtension.<init>(CRLDistributionPointsExtension.java:126)
> at sun.reflect.NativeConstructorAccessorImpl.newInstance0(Native Method)
> at sun.reflect.NativeConstructorAccessorImpl.newInstance(NativeConstructorAccessorImpl.java:39)
> at sun.reflect.DelegatingConstructorAccessorImpl.newInstance(DelegatingConstructorAccessorImpl.java:27)
> at java.lang.reflect.Constructor.newInstance(Constructor.java:274)
> at sun.security.x509.CertificateExtensions.parseExtension(CertificateExtensions.java:105)
> ... 48 more
> java.lang.reflect.InvocationTargetException
> at sun.reflect.NativeConstructorAccessorImpl.newInstance0(Native Method)
> at sun.reflect.NativeConstructorAccessorImpl.newInstance(NativeConstructorAccessorImpl.java:39)
> at sun.reflect.DelegatingConstructorAccessorImpl.newInstance(DelegatingConstructorAccessorImpl.java:27)
> at java.lang.reflect.Constructor.newInstance(Constructor.java:274)
> at org.apache.ws.security.components.crypto.CryptoFactory.loadClass(CryptoFactory.java:117)
> at org.apache.ws.security.components.crypto.CryptoFactory.getInstance(CryptoFactory.java:101)
> at org.apache.ws.axis.security.WSDoAllSender.loadSignatureCrypto(WSDoAllSender.java:579)
> at org.apache.ws.axis.security.WSDoAllSender.invoke(WSDoAllSender.java:244)
> at org.apache.axis.strategies.InvocationStrategy.visit(InvocationStrategy.java:32)
> at org.apache.axis.SimpleChain.doVisiting(SimpleChain.java:118)
> at org.apache.axis.SimpleChain.invoke(SimpleChain.java:83)
> at org.apache.axis.client.AxisClient.invoke(AxisClient.java:128)
> at org.apache.axis.client.Call.invokeEngine(Call.java:2735)
> at org.apache.axis.client.Call.invoke(Call.java:2718)
> at org.apache.axis.client.Call.invoke(Call.java:2394)
> at org.apache.axis.client.Call.invoke(Call.java:2317)
> at org.apache.axis.client.Call.invoke(Call.java:1774)
> at org.apache.ws.axis.oasis.ping.PingBindingStub.ping(PingBindingStub.java:137)
> at org.apache.ws.axis.oasis.Scenario4.main(Scenario4.java:86)
> at interop.TestScenario4.testScenario4(TestScenario4.java:63)
> at sun.reflect.NativeMethodAccessorImpl.invoke0(Native Method)
> at sun.reflect.NativeMethodAccessorImpl.invoke(NativeMethodAccessorImpl.java:39)
> at sun.reflect.DelegatingMethodAccessorImpl.invoke(DelegatingMethodAccessorImpl.java:25)
> at java.lang.reflect.Method.invoke(Method.java:324)
> at junit.framework.TestCase.runTest(TestCase.java:154)
> at junit.framework.TestCase.runBare(TestCase.java:127)
> at junit.framework.TestResult$1.protect(TestResult.java:106)
> at junit.framework.TestResult.runProtected(TestResult.java:124)
> at junit.framework.TestResult.run(TestResult.java:109)
> at junit.framework.TestCase.run(TestCase.java:118)
> at junit.framework.TestSuite.runTest(TestSuite.java:208)
> at junit.framework.TestSuite.run(TestSuite.java:203)
> at junit.framework.TestSuite.runTest(TestSuite.java:208)
> at junit.framework.TestSuite.run(TestSuite.java:203)
> at org.apache.tools.ant.taskdefs.optional.junit.JUnitTestRunner.run(JUnitTestRunner.java:289)
> at org.apache.tools.ant.taskdefs.optional.junit.JUnitTestRunner.main(JUnitTestRunner.java:523)
> Caused by: org.apache.ws.security.components.crypto.CredentialException: Failed to load credentials. Inner Exception: [java.io.IOException: java.io.IOException: Host portion is not a valid DNS name, IPv4 address, or IPv6 address]
> at org.apache.ws.security.components.crypto.Merlin.load(Merlin.java:513)
> at org.apache.ws.security.components.crypto.Merlin.<init>(Merlin.java:114)
> ... 36 more
> java.lang.InstantiationException: org.apache.ws.security.components.crypto.Merlin
> at java.lang.Class.newInstance0(Class.java:293)
> at java.lang.Class.newInstance(Class.java:261)
> at org.apache.ws.security.components.crypto.CryptoFactory.loadClass(CryptoFactory.java:125)
> at org.apache.ws.security.components.crypto.CryptoFactory.getInstance(CryptoFactory.java:101)
> at org.apache.ws.axis.security.WSDoAllSender.loadSignatureCrypto(WSDoAllSender.java:579)
> at org.apache.ws.axis.security.WSDoAllSender.invoke(WSDoAllSender.java:244)
> at org.apache.axis.strategies.InvocationStrategy.visit(InvocationStrategy.java:32)
> at org.apache.axis.SimpleChain.doVisiting(SimpleChain.java:118)
> at org.apache.axis.SimpleChain.invoke(SimpleChain.java:83)
> at org.apache.axis.client.AxisClient.invoke(AxisClient.java:128)
> at org.apache.axis.client.Call.invokeEngine(Call.java:2735)
> at org.apache.axis.client.Call.invoke(Call.java:2718)
> at org.apache.axis.client.Call.invoke(Call.java:2394)
> at org.apache.axis.client.Call.invoke(Call.java:2317)
> at org.apache.axis.client.Call.invoke(Call.java:1774)
> at org.apache.ws.axis.oasis.ping.PingBindingStub.ping(PingBindingStub.java:137)
> at org.apache.ws.axis.oasis.Scenario4.main(Scenario4.java:86)
> at interop.TestScenario4.testScenario4(TestScenario4.java:63)
> at sun.reflect.NativeMethodAccessorImpl.invoke0(Native Method)
> at sun.reflect.NativeMethodAccessorImpl.invoke(NativeMethodAccessorImpl.java:39)
> at sun.reflect.DelegatingMethodAccessorImpl.invoke(DelegatingMethodAccessorImpl.java:25)
> at java.lang.reflect.Method.invoke(Method.java:324)
> at junit.framework.TestCase.runTest(TestCase.java:154)
> at junit.framework.TestCase.runBare(TestCase.java:127)
> at junit.framework.TestResult$1.protect(TestResult.java:106)
> at junit.framework.TestResult.runProtected(TestResult.java:124)
> at junit.framework.TestResult.run(TestResult.java:109)
> at junit.framework.TestCase.run(TestCase.java:118)
> at junit.framework.TestSuite.runTest(TestSuite.java:208)
> at junit.framework.TestSuite.run(TestSuite.java:203)
> at junit.framework.TestSuite.runTest(TestSuite.java:208)
> at junit.framework.TestSuite.run(TestSuite.java:203)
> at org.apache.tools.ant.taskdefs.optional.junit.JUnitTestRunner.run(JUnitTestRunner.java:289)
> at org.apache.tools.ant.taskdefs.optional.junit.JUnitTestRunner.main(JUnitTestRunner.java:523)
> java.security.cert.CertificateParsingException: java.io.IOException: java.io.IOException: Host portion is not a valid DNS name, IPv4 address, or IPv6 address
> at sun.security.x509.X509CertInfo.<init>(X509CertInfo.java:157)
> at sun.security.x509.X509CertImpl.parse(X509CertImpl.java:1679)
> at sun.security.x509.X509CertImpl.<init>(X509CertImpl.java:173)
> at sun.security.provider.X509Factory.engineGenerateCertificate(X509Factory.java:90)
> at java.security.cert.CertificateFactory.generateCertificate(CertificateFactory.java:389)
> at sun.security.provider.JavaKeyStore.engineLoad(JavaKeyStore.java:684)
> at java.security.KeyStore.load(KeyStore.java:652)
> at org.apache.ws.security.components.crypto.Merlin.load(Merlin.java:507)
> at org.apache.ws.security.components.crypto.Merlin.<init>(Merlin.java:114)
> at sun.reflect.NativeConstructorAccessorImpl.newInstance0(Native Method)
> at sun.reflect.NativeConstructorAccessorImpl.newInstance(NativeConstructorAccessorImpl.java:39)
> at sun.reflect.DelegatingConstructorAccessorImpl.newInstance(DelegatingConstructorAccessorImpl.java:27)
> at java.lang.reflect.Constructor.newInstance(Constructor.java:274)
> at org.apache.ws.security.components.crypto.CryptoFactory.loadClass(CryptoFactory.java:117)
> at org.apache.ws.security.components.crypto.CryptoFactory.getInstance(CryptoFactory.java:101)
> at org.apache.ws.axis.security.WSDoAllSender.loadSignatureCrypto(WSDoAllSender.java:579)
> at org.apache.ws.axis.security.WSDoAllSender.invoke(WSDoAllSender.java:244)
> at org.apache.axis.strategies.InvocationStrategy.visit(InvocationStrategy.java:32)
> at org.apache.axis.SimpleChain.doVisiting(SimpleChain.java:118)
> at org.apache.axis.SimpleChain.invoke(SimpleChain.java:83)
> at org.apache.axis.client.AxisClient.invoke(AxisClient.java:128)
> at org.apache.axis.client.Call.invokeEngine(Call.java:2735)
> at org.apache.axis.client.Call.invoke(Call.java:2718)
> at org.apache.axis.client.Call.invoke(Call.java:2394)
> at org.apache.axis.client.Call.invoke(Call.java:2317)
> at org.apache.axis.client.Call.invoke(Call.java:1774)
> at org.apache.ws.axis.oasis.ping.PingBindingStub.ping(PingBindingStub.java:137)
> at org.apache.ws.axis.oasis.Scenario5.main(Scenario5.java:90)
> at interop.TestScenario5.testScenario5(TestScenario5.java:63)
> at sun.reflect.NativeMethodAccessorImpl.invoke0(Native Method)
> at sun.reflect.NativeMethodAccessorImpl.invoke(NativeMethodAccessorImpl.java:39)
> at sun.reflect.DelegatingMethodAccessorImpl.invoke(DelegatingMethodAccessorImpl.java:25)
> at java.lang.reflect.Method.invoke(Method.java:324)
> at junit.framework.TestCase.runTest(TestCase.java:154)
> at junit.framework.TestCase.runBare(TestCase.java:127)
> at junit.framework.TestResult$1.protect(TestResult.java:106)
> at junit.framework.TestResult.runProtected(TestResult.java:124)
> at junit.framework.TestResult.run(TestResult.java:109)
> at junit.framework.TestCase.run(TestCase.java:118)
> at junit.framework.TestSuite.runTest(TestSuite.java:208)
> at junit.framework.TestSuite.run(TestSuite.java:203)
> at junit.framework.TestSuite.runTest(TestSuite.java:208)
> at junit.framework.TestSuite.run(TestSuite.java:203)
> at org.apache.tools.ant.taskdefs.optional.junit.JUnitTestRunner.run(JUnitTestRunner.java:289)
> at org.apache.tools.ant.taskdefs.optional.junit.JUnitTestRunner.main(JUnitTestRunner.java:523)
> Caused by: java.io.IOException: java.io.IOException: Host portion is not a valid DNS name, IPv4 address, or IPv6 address
> at sun.security.x509.CertificateExtensions.parseExtension(CertificateExtensions.java:111)
> at sun.security.x509.CertificateExtensions.init(CertificateExtensions.java:78)
> at sun.security.x509.CertificateExtensions.<init>(CertificateExtensions.java:57)
> at sun.security.x509.X509CertInfo.parse(X509CertInfo.java:731)
> at sun.security.x509.X509CertInfo.<init>(X509CertInfo.java:155)
> ... 44 more
> Caused by: java.io.IOException: Host portion is not a valid DNS name, IPv4 address, or IPv6 address
> at sun.security.x509.URIName.parseName(URIName.java:205)
> at sun.security.x509.URIName.<init>(URIName.java:85)
> at sun.security.x509.GeneralName.<init>(GeneralName.java:94)
> at sun.security.x509.GeneralNames.<init>(GeneralNames.java:51)
> at sun.security.x509.DistributionPoint.<init>(DistributionPoint.java:193)
> at sun.security.x509.CRLDistributionPointsExtension.<init>(CRLDistributionPointsExtension.java:126)
> at sun.reflect.NativeConstructorAccessorImpl.newInstance0(Native Method)
> at sun.reflect.NativeConstructorAccessorImpl.newInstance(NativeConstructorAccessorImpl.java:39)
> at sun.reflect.DelegatingConstructorAccessorImpl.newInstance(DelegatingConstructorAccessorImpl.java:27)
> at java.lang.reflect.Constructor.newInstance(Constructor.java:274)
> at sun.security.x509.CertificateExtensions.parseExtension(CertificateExtensions.java:105)
> ... 48 more
> java.lang.reflect.InvocationTargetException
> at sun.reflect.NativeConstructorAccessorImpl.newInstance0(Native Method)
> at sun.reflect.NativeConstructorAccessorImpl.newInstance(NativeConstructorAccessorImpl.java:39)
> at sun.reflect.DelegatingConstructorAccessorImpl.newInstance(DelegatingConstructorAccessorImpl.java:27)
> at java.lang.reflect.Constructor.newInstance(Constructor.java:274)
> at org.apache.ws.security.components.crypto.CryptoFactory.loadClass(CryptoFactory.java:117)
> at org.apache.ws.security.components.crypto.CryptoFactory.getInstance(CryptoFactory.java:101)
> at org.apache.ws.axis.security.WSDoAllSender.loadSignatureCrypto(WSDoAllSender.java:579)
> at org.apache.ws.axis.security.WSDoAllSender.invoke(WSDoAllSender.java:244)
> at org.apache.axis.strategies.InvocationStrategy.visit(InvocationStrategy.java:32)
> at org.apache.axis.SimpleChain.doVisiting(SimpleChain.java:118)
> at org.apache.axis.SimpleChain.invoke(SimpleChain.java:83)
> at org.apache.axis.client.AxisClient.invoke(AxisClient.java:128)
> at org.apache.axis.client.Call.invokeEngine(Call.java:2735)
> at org.apache.axis.client.Call.invoke(Call.java:2718)
> at org.apache.axis.client.Call.invoke(Call.java:2394)
> at org.apache.axis.client.Call.invoke(Call.java:2317)
> at org.apache.axis.client.Call.invoke(Call.java:1774)
> at org.apache.ws.axis.oasis.ping.PingBindingStub.ping(PingBindingStub.java:137)
> at org.apache.ws.axis.oasis.Scenario5.main(Scenario5.java:90)
> at interop.TestScenario5.testScenario5(TestScenario5.java:63)
> at sun.reflect.NativeMethodAccessorImpl.invoke0(Native Method)
> at sun.reflect.NativeMethodAccessorImpl.invoke(NativeMethodAccessorImpl.java:39)
> at sun.reflect.DelegatingMethodAccessorImpl.invoke(DelegatingMethodAccessorImpl.java:25)
> at java.lang.reflect.Method.invoke(Method.java:324)
> at junit.framework.TestCase.runTest(TestCase.java:154)
> at junit.framework.TestCase.runBare(TestCase.java:127)
> at junit.framework.TestResult$1.protect(TestResult.java:106)
> at junit.framework.TestResult.runProtected(TestResult.java:124)
> at junit.framework.TestResult.run(TestResult.java:109)
> at junit.framework.TestCase.run(TestCase.java:118)
> at junit.framework.TestSuite.runTest(TestSuite.java:208)
> at junit.framework.TestSuite.run(TestSuite.java:203)
> at junit.framework.TestSuite.runTest(TestSuite.java:208)
> at junit.framework.TestSuite.run(TestSuite.java:203)
> at org.apache.tools.ant.taskdefs.optional.junit.JUnitTestRunner.run(JUnitTestRunner.java:289)
> at org.apache.tools.ant.taskdefs.optional.junit.JUnitTestRunner.main(JUnitTestRunner.java:523)
> Caused by: org.apache.ws.security.components.crypto.CredentialException: Failed to load credentials. Inner Exception: [java.io.IOException: java.io.IOException: Host portion is not a valid DNS name, IPv4 address, or IPv6 address]
> at org.apache.ws.security.components.crypto.Merlin.load(Merlin.java:513)
> at org.apache.ws.security.components.crypto.Merlin.<init>(Merlin.java:114)
> ... 36 more
> java.lang.InstantiationException: org.apache.ws.security.components.crypto.Merlin
> at java.lang.Class.newInstance0(Class.java:293)
> at java.lang.Class.newInstance(Class.java:261)
> at org.apache.ws.security.components.crypto.CryptoFactory.loadClass(CryptoFactory.java:125)
> at org.apache.ws.security.components.crypto.CryptoFactory.getInstance(CryptoFactory.java:101)
> at org.apache.ws.axis.security.WSDoAllSender.loadSignatureCrypto(WSDoAllSender.java:579)
> at org.apache.ws.axis.security.WSDoAllSender.invoke(WSDoAllSender.java:244)
> at org.apache.axis.strategies.InvocationStrategy.visit(InvocationStrategy.java:32)
> at org.apache.axis.SimpleChain.doVisiting(SimpleChain.java:118)
> at org.apache.axis.SimpleChain.invoke(SimpleChain.java:83)
> at org.apache.axis.client.AxisClient.invoke(AxisClient.java:128)
> at org.apache.axis.client.Call.invokeEngine(Call.java:2735)
> at org.apache.axis.client.Call.invoke(Call.java:2718)
> at org.apache.axis.client.Call.invoke(Call.java:2394)
> at org.apache.axis.client.Call.invoke(Call.java:2317)
> at org.apache.axis.client.Call.invoke(Call.java:1774)
> at org.apache.ws.axis.oasis.ping.PingBindingStub.ping(PingBindingStub.java:137)
> at org.apache.ws.axis.oasis.Scenario5.main(Scenario5.java:90)
> at interop.TestScenario5.testScenario5(TestScenario5.java:63)
> at sun.reflect.NativeMethodAccessorImpl.invoke0(Native Method)
> at sun.reflect.NativeMethodAccessorImpl.invoke(NativeMethodAccessorImpl.java:39)
> at sun.reflect.DelegatingMethodAccessorImpl.invoke(DelegatingMethodAccessorImpl.java:25)
> at java.lang.reflect.Method.invoke(Method.java:324)
> at junit.framework.TestCase.runTest(TestCase.java:154)
> at junit.framework.TestCase.runBare(TestCase.java:127)
> at junit.framework.TestResult$1.protect(TestResult.java:106)
> at junit.framework.TestResult.runProtected(TestResult.java:124)
> at junit.framework.TestResult.run(TestResult.java:109)
> at junit.framework.TestCase.run(TestCase.java:118)
> at junit.framework.TestSuite.runTest(TestSuite.java:208)
> at junit.framework.TestSuite.run(TestSuite.java:203)
> at junit.framework.TestSuite.runTest(TestSuite.java:208)
> at junit.framework.TestSuite.run(TestSuite.java:203)
> at org.apache.tools.ant.taskdefs.optional.junit.JUnitTestRunner.run(JUnitTestRunner.java:289)
> at org.apache.tools.ant.taskdefs.optional.junit.JUnitTestRunner.main(JUnitTestRunner.java:523)
> java.security.cert.CertificateParsingException: java.io.IOException: java.io.IOException: Host portion is not a valid DNS name, IPv4 address, or IPv6 address
> at sun.security.x509.X509CertInfo.<init>(X509CertInfo.java:157)
> at sun.security.x509.X509CertImpl.parse(X509CertImpl.java:1679)
> at sun.security.x509.X509CertImpl.<init>(X509CertImpl.java:173)
> at sun.security.provider.X509Factory.engineGenerateCertificate(X509Factory.java:90)
> at java.security.cert.CertificateFactory.generateCertificate(CertificateFactory.java:389)
> at sun.security.provider.JavaKeyStore.engineLoad(JavaKeyStore.java:684)
> at java.security.KeyStore.load(KeyStore.java:652)
> at org.apache.ws.security.components.crypto.Merlin.load(Merlin.java:507)
> at org.apache.ws.security.components.crypto.Merlin.<init>(Merlin.java:114)
> at sun.reflect.NativeConstructorAccessorImpl.newInstance0(Native Method)
> at sun.reflect.NativeConstructorAccessorImpl.newInstance(NativeConstructorAccessorImpl.java:39)
> at sun.reflect.DelegatingConstructorAccessorImpl.newInstance(DelegatingConstructorAccessorImpl.java:27)
> at java.lang.reflect.Constructor.newInstance(Constructor.java:274)
> at org.apache.ws.security.components.crypto.CryptoFactory.loadClass(CryptoFactory.java:117)
> at org.apache.ws.security.components.crypto.CryptoFactory.getInstance(CryptoFactory.java:101)
> at org.apache.ws.axis.security.WSDoAllSender.loadSignatureCrypto(WSDoAllSender.java:579)
> at org.apache.ws.axis.security.WSDoAllSender.invoke(WSDoAllSender.java:244)
> at org.apache.axis.strategies.InvocationStrategy.visit(InvocationStrategy.java:32)
> at org.apache.axis.SimpleChain.doVisiting(SimpleChain.java:118)
> at org.apache.axis.SimpleChain.invoke(SimpleChain.java:83)
> at org.apache.axis.client.AxisClient.invoke(AxisClient.java:128)
> at org.apache.axis.client.Call.invokeEngine(Call.java:2735)
> at org.apache.axis.client.Call.invoke(Call.java:2718)
> at org.apache.axis.client.Call.invoke(Call.java:2394)
> at org.apache.axis.client.Call.invoke(Call.java:2317)
> at org.apache.axis.client.Call.invoke(Call.java:1774)
> at org.apache.ws.axis.oasis.ping.PingBindingStub.ping(PingBindingStub.java:137)
> at org.apache.ws.axis.oasis.Scenario6.main(Scenario6.java:86)
> at interop.TestScenario6.testScenario6(TestScenario6.java:63)
> at sun.reflect.NativeMethodAccessorImpl.invoke0(Native Method)
> at sun.reflect.NativeMethodAccessorImpl.invoke(NativeMethodAccessorImpl.java:39)
> at sun.reflect.DelegatingMethodAccessorImpl.invoke(DelegatingMethodAccessorImpl.java:25)
> at java.lang.reflect.Method.invoke(Method.java:324)
> at junit.framework.TestCase.runTest(TestCase.java:154)
> at junit.framework.TestCase.runBare(TestCase.java:127)
> at junit.framework.TestResult$1.protect(TestResult.java:106)
> at junit.framework.TestResult.runProtected(TestResult.java:124)
> at junit.framework.TestResult.run(TestResult.java:109)
> at junit.framework.TestCase.run(TestCase.java:118)
> at junit.framework.TestSuite.runTest(TestSuite.java:208)
> at junit.framework.TestSuite.run(TestSuite.java:203)
> at junit.framework.TestSuite.runTest(TestSuite.java:208)
> at junit.framework.TestSuite.run(TestSuite.java:203)
> at org.apache.tools.ant.taskdefs.optional.junit.JUnitTestRunner.run(JUnitTestRunner.java:289)
> at org.apache.tools.ant.taskdefs.optional.junit.JUnitTestRunner.main(JUnitTestRunner.java:523)
> Caused by: java.io.IOException: java.io.IOException: Host portion is not a valid DNS name, IPv4 address, or IPv6 address
> at sun.security.x509.CertificateExtensions.parseExtension(CertificateExtensions.java:111)
> at sun.security.x509.CertificateExtensions.init(CertificateExtensions.java:78)
> at sun.security.x509.CertificateExtensions.<init>(CertificateExtensions.java:57)
> at sun.security.x509.X509CertInfo.parse(X509CertInfo.java:731)
> at sun.security.x509.X509CertInfo.<init>(X509CertInfo.java:155)
> ... 44 more
> Caused by: java.io.IOException: Host portion is not a valid DNS name, IPv4 address, or IPv6 address
> at sun.security.x509.URIName.parseName(URIName.java:205)
> at sun.security.x509.URIName.<init>(URIName.java:85)
> at sun.security.x509.GeneralName.<init>(GeneralName.java:94)
> at sun.security.x509.GeneralNames.<init>(GeneralNames.java:51)
> at sun.security.x509.DistributionPoint.<init>(DistributionPoint.java:193)
> at sun.security.x509.CRLDistributionPointsExtension.<init>(CRLDistributionPointsExtension.java:126)
> at sun.reflect.NativeConstructorAccessorImpl.newInstance0(Native Method)
> at sun.reflect.NativeConstructorAccessorImpl.newInstance(NativeConstructorAccessorImpl.java:39)
> at sun.reflect.DelegatingConstructorAccessorImpl.newInstance(DelegatingConstructorAccessorImpl.java:27)
> at java.lang.reflect.Constructor.newInstance(Constructor.java:274)
> at sun.security.x509.CertificateExtensions.parseExtension(CertificateExtensions.java:105)
> ... 48 more
> java.lang.reflect.InvocationTargetException
> at sun.reflect.NativeConstructorAccessorImpl.newInstance0(Native Method)
> at sun.reflect.NativeConstructorAccessorImpl.newInstance(NativeConstructorAccessorImpl.java:39)
> at sun.reflect.DelegatingConstructorAccessorImpl.newInstance(DelegatingConstructorAccessorImpl.java:27)
> at java.lang.reflect.Constructor.newInstance(Constructor.java:274)
> at org.apache.ws.security.components.crypto.CryptoFactory.loadClass(CryptoFactory.java:117)
> at org.apache.ws.security.components.crypto.CryptoFactory.getInstance(CryptoFactory.java:101)
> at org.apache.ws.axis.security.WSDoAllSender.loadSignatureCrypto(WSDoAllSender.java:579)
> at org.apache.ws.axis.security.WSDoAllSender.invoke(WSDoAllSender.java:244)
> at org.apache.axis.strategies.InvocationStrategy.visit(InvocationStrategy.java:32)
> at org.apache.axis.SimpleChain.doVisiting(SimpleChain.java:118)
> at org.apache.axis.SimpleChain.invoke(SimpleChain.java:83)
> at org.apache.axis.client.AxisClient.invoke(AxisClient.java:128)
> at org.apache.axis.client.Call.invokeEngine(Call.java:2735)
> at org.apache.axis.client.Call.invoke(Call.java:2718)
> at org.apache.axis.client.Call.invoke(Call.java:2394)
> at org.apache.axis.client.Call.invoke(Call.java:2317)
> at org.apache.axis.client.Call.invoke(Call.java:1774)
> at org.apache.ws.axis.oasis.ping.PingBindingStub.ping(PingBindingStub.java:137)
> at org.apache.ws.axis.oasis.Scenario6.main(Scenario6.java:86)
> at interop.TestScenario6.testScenario6(TestScenario6.java:63)
> at sun.reflect.NativeMethodAccessorImpl.invoke0(Native Method)
> at sun.reflect.NativeMethodAccessorImpl.invoke(NativeMethodAccessorImpl.java:39)
> at sun.reflect.DelegatingMethodAccessorImpl.invoke(DelegatingMethodAccessorImpl.java:25)
> at java.lang.reflect.Method.invoke(Method.java:324)
> at junit.framework.TestCase.runTest(TestCase.java:154)
> at junit.framework.TestCase.runBare(TestCase.java:127)
> at junit.framework.TestResult$1.protect(TestResult.java:106)
> at junit.framework.TestResult.runProtected(TestResult.java:124)
> at junit.framework.TestResult.run(TestResult.java:109)
> at junit.framework.TestCase.run(TestCase.java:118)
> at junit.framework.TestSuite.runTest(TestSuite.java:208)
> at junit.framework.TestSuite.run(TestSuite.java:203)
> at junit.framework.TestSuite.runTest(TestSuite.java:208)
> at junit.framework.TestSuite.run(TestSuite.java:203)
> at org.apache.tools.ant.taskdefs.optional.junit.JUnitTestRunner.run(JUnitTestRunner.java:289)
> at org.apache.tools.ant.taskdefs.optional.junit.JUnitTestRunner.main(JUnitTestRunner.java:523)
> Caused by: org.apache.ws.security.components.crypto.CredentialException: Failed to load credentials. Inner Exception: [java.io.IOException: java.io.IOException: Host portion is not a valid DNS name, IPv4 address, or IPv6 address]
> at org.apache.ws.security.components.crypto.Merlin.load(Merlin.java:513)
> at org.apache.ws.security.components.crypto.Merlin.<init>(Merlin.java:114)
> ... 36 more
> java.lang.InstantiationException: org.apache.ws.security.components.crypto.Merlin
> at java.lang.Class.newInstance0(Class.java:293)
> at java.lang.Class.newInstance(Class.java:261)
> at org.apache.ws.security.components.crypto.CryptoFactory.loadClass(CryptoFactory.java:125)
> at org.apache.ws.security.components.crypto.CryptoFactory.getInstance(CryptoFactory.java:101)
> at org.apache.ws.axis.security.WSDoAllSender.loadSignatureCrypto(WSDoAllSender.java:579)
> at org.apache.ws.axis.security.WSDoAllSender.invoke(WSDoAllSender.java:244)
> at org.apache.axis.strategies.InvocationStrategy.visit(InvocationStrategy.java:32)
> at org.apache.axis.SimpleChain.doVisiting(SimpleChain.java:118)
> at org.apache.axis.SimpleChain.invoke(SimpleChain.java:83)
> at org.apache.axis.client.AxisClient.invoke(AxisClient.java:128)
> at org.apache.axis.client.Call.invokeEngine(Call.java:2735)
> at org.apache.axis.client.Call.invoke(Call.java:2718)
> at org.apache.axis.client.Call.invoke(Call.java:2394)
> at org.apache.axis.client.Call.invoke(Call.java:2317)
> at org.apache.axis.client.Call.invoke(Call.java:1774)
> at org.apache.ws.axis.oasis.ping.PingBindingStub.ping(PingBindingStub.java:137)
> at org.apache.ws.axis.oasis.Scenario6.main(Scenario6.java:86)
> at interop.TestScenario6.testScenario6(TestScenario6.java:63)
> at sun.reflect.NativeMethodAccessorImpl.invoke0(Native Method)
> at sun.reflect.NativeMethodAccessorImpl.invoke(NativeMethodAccessorImpl.java:39)
> at sun.reflect.DelegatingMethodAccessorImpl.invoke(DelegatingMethodAccessorImpl.java:25)
> at java.lang.reflect.Method.invoke(Method.java:324)
> at junit.framework.TestCase.runTest(TestCase.java:154)
> at junit.framework.TestCase.runBare(TestCase.java:127)
> at junit.framework.TestResult$1.protect(TestResult.java:106)
> at junit.framework.TestResult.runProtected(TestResult.java:124)
> at junit.framework.TestResult.run(TestResult.java:109)
> at junit.framework.TestCase.run(TestCase.java:118)
> at junit.framework.TestSuite.runTest(TestSuite.java:208)
> at junit.framework.TestSuite.run(TestSuite.java:203)
> at junit.framework.TestSuite.runTest(TestSuite.java:208)
> at junit.framework.TestSuite.run(TestSuite.java:203)
> at org.apache.tools.ant.taskdefs.optional.junit.JUnitTestRunner.run(JUnitTestRunner.java:289)
> at org.apache.tools.ant.taskdefs.optional.junit.JUnitTestRunner.main(JUnitTestRunner.java:523)
> java.security.cert.CertificateParsingException: java.io.IOException: java.io.IOException: Host portion is not a valid DNS name, IPv4 address, or IPv6 address
> at sun.security.x509.X509CertInfo.<init>(X509CertInfo.java:157)
> at sun.security.x509.X509CertImpl.parse(X509CertImpl.java:1679)
> at sun.security.x509.X509CertImpl.<init>(X509CertImpl.java:173)
> at sun.security.provider.X509Factory.engineGenerateCertificate(X509Factory.java:90)
> at java.security.cert.CertificateFactory.generateCertificate(CertificateFactory.java:389)
> at sun.security.provider.JavaKeyStore.engineLoad(JavaKeyStore.java:684)
> at java.security.KeyStore.load(KeyStore.java:652)
> at org.apache.ws.security.components.crypto.Merlin.load(Merlin.java:507)
> at org.apache.ws.security.components.crypto.Merlin.<init>(Merlin.java:114)
> at sun.reflect.NativeConstructorAccessorImpl.newInstance0(Native Method)
> at sun.reflect.NativeConstructorAccessorImpl.newInstance(NativeConstructorAccessorImpl.java:39)
> at sun.reflect.DelegatingConstructorAccessorImpl.newInstance(DelegatingConstructorAccessorImpl.java:27)
> at java.lang.reflect.Constructor.newInstance(Constructor.java:274)
> at org.apache.ws.security.components.crypto.CryptoFactory.loadClass(CryptoFactory.java:117)
> at org.apache.ws.security.components.crypto.CryptoFactory.getInstance(CryptoFactory.java:101)
> at org.apache.ws.axis.security.WSDoAllSender.loadSignatureCrypto(WSDoAllSender.java:579)
> at org.apache.ws.axis.security.WSDoAllSender.invoke(WSDoAllSender.java:244)
> at org.apache.axis.strategies.InvocationStrategy.visit(InvocationStrategy.java:32)
> at org.apache.axis.SimpleChain.doVisiting(SimpleChain.java:118)
> at org.apache.axis.SimpleChain.invoke(SimpleChain.java:83)
> at org.apache.axis.client.AxisClient.invoke(AxisClient.java:128)
> at org.apache.axis.client.Call.invokeEngine(Call.java:2735)
> at org.apache.axis.client.Call.invoke(Call.java:2718)
> at org.apache.axis.client.Call.invoke(Call.java:2394)
> at org.apache.axis.client.Call.invoke(Call.java:2317)
> at org.apache.axis.client.Call.invoke(Call.java:1774)
> at org.apache.ws.axis.oasis.ping.PingBindingStub.ping(PingBindingStub.java:137)
> at org.apache.ws.axis.oasis.Scenario7.main(Scenario7.java:86)
> at interop.TestScenario7.testScenario7(TestScenario7.java:63)
> at sun.reflect.NativeMethodAccessorImpl.invoke0(Native Method)
> at sun.reflect.NativeMethodAccessorImpl.invoke(NativeMethodAccessorImpl.java:39)
> at sun.reflect.DelegatingMethodAccessorImpl.invoke(DelegatingMethodAccessorImpl.java:25)
> at java.lang.reflect.Method.invoke(Method.java:324)
> at junit.framework.TestCase.runTest(TestCase.java:154)
> at junit.framework.TestCase.runBare(TestCase.java:127)
> at junit.framework.TestResult$1.protect(TestResult.java:106)
> at junit.framework.TestResult.runProtected(TestResult.java:124)
> at junit.framework.TestResult.run(TestResult.java:109)
> at junit.framework.TestCase.run(TestCase.java:118)
> at junit.framework.TestSuite.runTest(TestSuite.java:208)
> at junit.framework.TestSuite.run(TestSuite.java:203)
> at junit.framework.TestSuite.runTest(TestSuite.java:208)
> at junit.framework.TestSuite.run(TestSuite.java:203)
> at org.apache.tools.ant.taskdefs.optional.junit.JUnitTestRunner.run(JUnitTestRunner.java:289)
> at org.apache.tools.ant.taskdefs.optional.junit.JUnitTestRunner.main(JUnitTestRunner.java:523)
> Caused by: java.io.IOException: java.io.IOException: Host portion is not a valid DNS name, IPv4 address, or IPv6 address
> at sun.security.x509.CertificateExtensions.parseExtension(CertificateExtensions.java:111)
> at sun.security.x509.CertificateExtensions.init(CertificateExtensions.java:78)
> at sun.security.x509.CertificateExtensions.<init>(CertificateExtensions.java:57)
> at sun.security.x509.X509CertInfo.parse(X509CertInfo.java:731)
> at sun.security.x509.X509CertInfo.<init>(X509CertInfo.java:155)
> ... 44 more
> Caused by: java.io.IOException: Host portion is not a valid DNS name, IPv4 address, or IPv6 address
> at sun.security.x509.URIName.parseName(URIName.java:205)
> at sun.security.x509.URIName.<init>(URIName.java:85)
> at sun.security.x509.GeneralName.<init>(GeneralName.java:94)
> at sun.security.x509.GeneralNames.<init>(GeneralNames.java:51)
> at sun.security.x509.DistributionPoint.<init>(DistributionPoint.java:193)
> at sun.security.x509.CRLDistributionPointsExtension.<init>(CRLDistributionPointsExtension.java:126)
> at sun.reflect.NativeConstructorAccessorImpl.newInstance0(Native Method)
> at sun.reflect.NativeConstructorAccessorImpl.newInstance(NativeConstructorAccessorImpl.java:39)
> at sun.reflect.DelegatingConstructorAccessorImpl.newInstance(DelegatingConstructorAccessorImpl.java:27)
> at java.lang.reflect.Constructor.newInstance(Constructor.java:274)
> at sun.security.x509.CertificateExtensions.parseExtension(CertificateExtensions.java:105)
> ... 48 more
> java.lang.reflect.InvocationTargetException
> at sun.reflect.NativeConstructorAccessorImpl.newInstance0(Native Method)
> at sun.reflect.NativeConstructorAccessorImpl.newInstance(NativeConstructorAccessorImpl.java:39)
> at sun.reflect.DelegatingConstructorAccessorImpl.newInstance(DelegatingConstructorAccessorImpl.java:27)
> at java.lang.reflect.Constructor.newInstance(Constructor.java:274)
> at org.apache.ws.security.components.crypto.CryptoFactory.loadClass(CryptoFactory.java:117)
> at org.apache.ws.security.components.crypto.CryptoFactory.getInstance(CryptoFactory.java:101)
> at org.apache.ws.axis.security.WSDoAllSender.loadSignatureCrypto(WSDoAllSender.java:579)
> at org.apache.ws.axis.security.WSDoAllSender.invoke(WSDoAllSender.java:244)
> at org.apache.axis.strategies.InvocationStrategy.visit(InvocationStrategy.java:32)
> at org.apache.axis.SimpleChain.doVisiting(SimpleChain.java:118)
> at org.apache.axis.SimpleChain.invoke(SimpleChain.java:83)
> at org.apache.axis.client.AxisClient.invoke(AxisClient.java:128)
> at org.apache.axis.client.Call.invokeEngine(Call.java:2735)
> at org.apache.axis.client.Call.invoke(Call.java:2718)
> at org.apache.axis.client.Call.invoke(Call.java:2394)
> at org.apache.axis.client.Call.invoke(Call.java:2317)
> at org.apache.axis.client.Call.invoke(Call.java:1774)
> at org.apache.ws.axis.oasis.ping.PingBindingStub.ping(PingBindingStub.java:137)
> at org.apache.ws.axis.oasis.Scenario7.main(Scenario7.java:86)
> at interop.TestScenario7.testScenario7(TestScenario7.java:63)
> at sun.reflect.NativeMethodAccessorImpl.invoke0(Native Method)
> at sun.reflect.NativeMethodAccessorImpl.invoke(NativeMethodAccessorImpl.java:39)
> at sun.reflect.DelegatingMethodAccessorImpl.invoke(DelegatingMethodAccessorImpl.java:25)
> at java.lang.reflect.Method.invoke(Method.java:324)
> at junit.framework.TestCase.runTest(TestCase.java:154)
> at junit.framework.TestCase.runBare(TestCase.java:127)
> at junit.framework.TestResult$1.protect(TestResult.java:106)
> at junit.framework.TestResult.runProtected(TestResult.java:124)
> at junit.framework.TestResult.run(TestResult.java:109)
> at junit.framework.TestCase.run(TestCase.java:118)
> at junit.framework.TestSuite.runTest(TestSuite.java:208)
> at junit.framework.TestSuite.run(TestSuite.java:203)
> at junit.framework.TestSuite.runTest(TestSuite.java:208)
> at junit.framework.TestSuite.run(TestSuite.java:203)
> at org.apache.tools.ant.taskdefs.optional.junit.JUnitTestRunner.run(JUnitTestRunner.java:289)
> at org.apache.tools.ant.taskdefs.optional.junit.JUnitTestRunner.main(JUnitTestRunner.java:523)
> Caused by: org.apache.ws.security.components.crypto.CredentialException: Failed to load credentials. Inner Exception: [java.io.IOException: java.io.IOException: Host portion is not a valid DNS name, IPv4 address, or IPv6 address]
> at org.apache.ws.security.components.crypto.Merlin.load(Merlin.java:513)
> at org.apache.ws.security.components.crypto.Merlin.<init>(Merlin.java:114)
> ... 36 more
> java.lang.InstantiationException: org.apache.ws.security.components.crypto.Merlin
> at java.lang.Class.newInstance0(Class.java:293)
> at java.lang.Class.newInstance(Class.java:261)
> at org.apache.ws.security.components.crypto.CryptoFactory.loadClass(CryptoFactory.java:125)
> at org.apache.ws.security.components.crypto.CryptoFactory.getInstance(CryptoFactory.java:101)
> at org.apache.ws.axis.security.WSDoAllSender.loadSignatureCrypto(WSDoAllSender.java:579)
> at org.apache.ws.axis.security.WSDoAllSender.invoke(WSDoAllSender.java:244)
> at org.apache.axis.strategies.InvocationStrategy.visit(InvocationStrategy.java:32)
> at org.apache.axis.SimpleChain.doVisiting(SimpleChain.java:118)
> at org.apache.axis.SimpleChain.invoke(SimpleChain.java:83)
> at org.apache.axis.client.AxisClient.invoke(AxisClient.java:128)
> at org.apache.axis.client.Call.invokeEngine(Call.java:2735)
> at org.apache.axis.client.Call.invoke(Call.java:2718)
> at org.apache.axis.client.Call.invoke(Call.java:2394)
> at org.apache.axis.client.Call.invoke(Call.java:2317)
> at org.apache.axis.client.Call.invoke(Call.java:1774)
> at org.apache.ws.axis.oasis.ping.PingBindingStub.ping(PingBindingStub.java:137)
> at org.apache.ws.axis.oasis.Scenario7.main(Scenario7.java:86)
> at interop.TestScenario7.testScenario7(TestScenario7.java:63)
> at sun.reflect.NativeMethodAccessorImpl.invoke0(Native Method)
> at sun.reflect.NativeMethodAccessorImpl.invoke(NativeMethodAccessorImpl.java:39)
> at sun.reflect.DelegatingMethodAccessorImpl.invoke(DelegatingMethodAccessorImpl.java:25)
> at java.lang.reflect.Method.invoke(Method.java:324)
> at junit.framework.TestCase.runTest(TestCase.java:154)
> at junit.framework.TestCase.runBare(TestCase.java:127)
> at junit.framework.TestResult$1.protect(TestResult.java:106)
> at junit.framework.TestResult.runProtected(TestResult.java:124)
> at junit.framework.TestResult.run(TestResult.java:109)
> at junit.framework.TestCase.run(TestCase.java:118)
> at junit.framework.TestSuite.runTest(TestSuite.java:208)
> at junit.framework.TestSuite.run(TestSuite.java:203)
> at junit.framework.TestSuite.runTest(TestSuite.java:208)
> at junit.framework.TestSuite.run(TestSuite.java:203)
> at org.apache.tools.ant.taskdefs.optional.junit.JUnitTestRunner.run(JUnitTestRunner.java:289)
> at org.apache.tools.ant.taskdefs.optional.junit.JUnitTestRunner.main(JUnitTestRunner.java:523)
> ]]></system-err>
> </testsuite>