You are viewing a plain text version of this content. The canonical link for it is here.
Posted to dev@lucene.apache.org by je...@sd-datasolutions.de on 2012/06/04 11:10:11 UTC

[JENKINS] Lucene-Solr-trunk-Windows-Java7-64 - Build # 226 - Failure!

Build: http://jenkins.sd-datasolutions.de/job/Lucene-Solr-trunk-Windows-Java7-64/226/

1 tests failed.
REGRESSION:  org.apache.solr.handler.TestReplicationHandler.test

Error Message:
expected:<498> but was:<0>

Stack Trace:
java.lang.AssertionError: expected:<498> but was:<0>
	at __randomizedtesting.SeedInfo.seed([708ABF32C38CBB4B:F8DE80E86D70D6B3]:0)
	at org.junit.Assert.fail(Assert.java:93)
	at org.junit.Assert.failNotEquals(Assert.java:647)
	at org.junit.Assert.assertEquals(Assert.java:128)
	at org.junit.Assert.assertEquals(Assert.java:472)
	at org.junit.Assert.assertEquals(Assert.java:456)
	at org.apache.solr.handler.TestReplicationHandler.doTestIndexAndConfigReplication(TestReplicationHandler.java:391)
	at org.apache.solr.handler.TestReplicationHandler.test(TestReplicationHandler.java:250)
	at sun.reflect.NativeMethodAccessorImpl.invoke0(Native Method)
	at sun.reflect.NativeMethodAccessorImpl.invoke(NativeMethodAccessorImpl.java:57)
	at sun.reflect.DelegatingMethodAccessorImpl.invoke(DelegatingMethodAccessorImpl.java:43)
	at java.lang.reflect.Method.invoke(Method.java:601)
	at com.carrotsearch.randomizedtesting.RandomizedRunner.invoke(RandomizedRunner.java:1969)
	at com.carrotsearch.randomizedtesting.RandomizedRunner.access$1100(RandomizedRunner.java:132)
	at com.carrotsearch.randomizedtesting.RandomizedRunner$6.evaluate(RandomizedRunner.java:814)
	at com.carrotsearch.randomizedtesting.RandomizedRunner$7.evaluate(RandomizedRunner.java:875)
	at com.carrotsearch.randomizedtesting.RandomizedRunner$8.evaluate(RandomizedRunner.java:889)
	at com.carrotsearch.randomizedtesting.rules.SystemPropertiesRestoreRule$1.evaluate(SystemPropertiesRestoreRule.java:53)
	at org.apache.lucene.util.TestRuleSetupTeardownChained$1.evaluate(TestRuleSetupTeardownChained.java:50)
	at org.apache.lucene.util.TestRuleFieldCacheSanity$1.evaluate(TestRuleFieldCacheSanity.java:32)
	at org.apache.lucene.util.AbstractBeforeAfterRule$1.evaluate(AbstractBeforeAfterRule.java:45)
	at com.carrotsearch.randomizedtesting.rules.SystemPropertiesInvariantRule$1.evaluate(SystemPropertiesInvariantRule.java:55)
	at org.apache.lucene.util.TestRuleReportUncaughtExceptions$1.evaluate(TestRuleReportUncaughtExceptions.java:68)
	at org.apache.lucene.util.TestRuleThreadAndTestName$1.evaluate(TestRuleThreadAndTestName.java:48)
	at org.apache.lucene.util.TestRuleMarkFailure$1.evaluate(TestRuleMarkFailure.java:48)
	at com.carrotsearch.randomizedtesting.RandomizedRunner.runSingleTest(RandomizedRunner.java:821)
	at com.carrotsearch.randomizedtesting.RandomizedRunner.access$700(RandomizedRunner.java:132)
	at com.carrotsearch.randomizedtesting.RandomizedRunner$3$1.run(RandomizedRunner.java:669)
	at com.carrotsearch.randomizedtesting.RandomizedRunner$3.evaluate(RandomizedRunner.java:695)
	at com.carrotsearch.randomizedtesting.RandomizedRunner$4.evaluate(RandomizedRunner.java:734)
	at com.carrotsearch.randomizedtesting.RandomizedRunner$5.evaluate(RandomizedRunner.java:745)
	at com.carrotsearch.randomizedtesting.rules.SystemPropertiesRestoreRule$1.evaluate(SystemPropertiesRestoreRule.java:53)
	at org.apache.lucene.util.AbstractBeforeAfterRule$1.evaluate(AbstractBeforeAfterRule.java:45)
	at org.apache.lucene.util.TestRuleReportUncaughtExceptions$1.evaluate(TestRuleReportUncaughtExceptions.java:68)
	at org.apache.lucene.util.TestRuleStoreClassName$1.evaluate(TestRuleStoreClassName.java:38)
	at org.apache.lucene.util.TestRuleIcuHack$1.evaluate(TestRuleIcuHack.java:51)
	at com.carrotsearch.randomizedtesting.rules.SystemPropertiesInvariantRule$1.evaluate(SystemPropertiesInvariantRule.java:55)
	at org.apache.lucene.util.TestRuleNoInstanceHooksOverrides$1.evaluate(TestRuleNoInstanceHooksOverrides.java:53)
	at org.apache.lucene.util.TestRuleNoStaticHooksShadowing$1.evaluate(TestRuleNoStaticHooksShadowing.java:52)
	at org.apache.lucene.util.TestRuleAssertionsRequired$1.evaluate(TestRuleAssertionsRequired.java:36)
	at org.apache.lucene.util.TestRuleMarkFailure$1.evaluate(TestRuleMarkFailure.java:48)
	at org.apache.lucene.util.TestRuleIgnoreTestSuites$1.evaluate(TestRuleIgnoreTestSuites.java:56)
	at com.carrotsearch.randomizedtesting.RandomizedRunner.runSuite(RandomizedRunner.java:605)
	at com.carrotsearch.randomizedtesting.RandomizedRunner.access$400(RandomizedRunner.java:132)
	at com.carrotsearch.randomizedtesting.RandomizedRunner$2.run(RandomizedRunner.java:551)




Build Log:
[...truncated 13855 lines...]
   [junit4]   2> 31549 T2403 oash.SnapPuller.fetchLatestIndex Starting replication process
   [junit4]   2> 31552 T2386 C113 REQ [collection1] webapp=/solr path=/replication params={command=filelist&wt=javabin&generation=7} status=0 QTime=1 
   [junit4]   2> 31552 T2403 oash.SnapPuller.fetchLatestIndex Number of files in latest index in master: 10
   [junit4]   2> 31556 T2386 C113 REQ [collection1] webapp=/solr path=/replication params={command=filecontent&checksum=true&generation=7&wt=filestream&file=_3_nrm.cfe} status=0 QTime=0 
   [junit4]   2> 31560 T2386 C113 REQ [collection1] webapp=/solr path=/replication params={command=filecontent&checksum=true&generation=7&wt=filestream&file=_3.fdx} status=0 QTime=0 
   [junit4]   2> 31565 T2386 C113 REQ [collection1] webapp=/solr path=/replication params={command=filecontent&checksum=true&generation=7&wt=filestream&file=_3_nrm.cfs} status=0 QTime=0 
   [junit4]   2> 31569 T2386 C113 REQ [collection1] webapp=/solr path=/replication params={command=filecontent&checksum=true&generation=7&wt=filestream&file=_3_Lucene40_0.tip} status=0 QTime=0 
   [junit4]   2> 31575 T2386 C113 REQ [collection1] webapp=/solr path=/replication params={command=filecontent&checksum=true&generation=7&wt=filestream&file=segments_7} status=0 QTime=0 
   [junit4]   2> 31579 T2386 C113 REQ [collection1] webapp=/solr path=/replication params={command=filecontent&checksum=true&generation=7&wt=filestream&file=_3_Lucene40_0.tim} status=0 QTime=0 
   [junit4]   2> 31583 T2386 C113 REQ [collection1] webapp=/solr path=/replication params={command=filecontent&checksum=true&generation=7&wt=filestream&file=_3_Lucene40_0.frq} status=0 QTime=0 
   [junit4]   2> 31587 T2386 C113 REQ [collection1] webapp=/solr path=/replication params={command=filecontent&checksum=true&generation=7&wt=filestream&file=_3.si} status=0 QTime=0 
   [junit4]   2> 31591 T2386 C113 REQ [collection1] webapp=/solr path=/replication params={command=filecontent&checksum=true&generation=7&wt=filestream&file=_3.fnm} status=0 QTime=0 
   [junit4]   2> 31595 T2386 C113 REQ [collection1] webapp=/solr path=/replication params={command=filecontent&checksum=true&generation=7&wt=filestream&file=_3.fdt} status=0 QTime=0 
   [junit4]   2> 31597 T2403 oash.SnapPuller.fetchLatestIndex Total time taken for download : 0 secs
   [junit4]   2> 31599 T2403 oash.SnapPuller.copyAFile SEVERE Unable to move index file from: .\org.apache.solr.handler.TestReplicationHandler$SolrInstance-1338800603636\slave\data\index.20120604120355\_3_nrm.cfe to: C:\Jenkins\workspace\Lucene-Solr-trunk-Windows-Java7-64\solr\build\solr-core\test\J0\org.apache.solr.handler.TestReplicationHandler$SolrInstance-1338800603636\slave\data\index.20120604120328\_3_nrm.cfe Trying to do a copy
   [junit4]   2> 31599 T2403 oash.SnapPuller.copyAFile SEVERE Unable to copy index file from: .\org.apache.solr.handler.TestReplicationHandler$SolrInstance-1338800603636\slave\data\index.20120604120355\_3_nrm.cfe to: C:\Jenkins\workspace\Lucene-Solr-trunk-Windows-Java7-64\solr\build\solr-core\test\J0\org.apache.solr.handler.TestReplicationHandler$SolrInstance-1338800603636\slave\data\index.20120604120328\_3_nrm.cfe java.io.FileNotFoundException: C:\Jenkins\workspace\Lucene-Solr-trunk-Windows-Java7-64\solr\build\solr-core\test\J0\org.apache.solr.handler.TestReplicationHandler$SolrInstance-1338800603636\slave\data\index.20120604120328\_3_nrm.cfe (The system cannot find the path specified)
   [junit4]   2> 	at java.io.FileOutputStream.open(Native Method)
   [junit4]   2> 	at java.io.FileOutputStream.<init>(FileOutputStream.java:212)
   [junit4]   2> 	at java.io.FileOutputStream.<init>(FileOutputStream.java:165)
   [junit4]   2> 	at org.apache.solr.util.FileUtils.copyFile(FileUtils.java:48)
   [junit4]   2> 	at org.apache.solr.handler.SnapPuller.copyAFile(SnapPuller.java:654)
   [junit4]   2> 	at org.apache.solr.handler.SnapPuller.copyIndexFiles(SnapPuller.java:691)
   [junit4]   2> 	at org.apache.solr.handler.SnapPuller.fetchLatestIndex(SnapPuller.java:371)
   [junit4]   2> 	at org.apache.solr.handler.ReplicationHandler.doFetch(ReplicationHandler.java:298)
   [junit4]   2> 	at org.apache.solr.handler.SnapPuller$1.run(SnapPuller.java:169)
   [junit4]   2> 	at java.util.concurrent.Executors$RunnableAdapter.call(Executors.java:471)
   [junit4]   2> 	at java.util.concurrent.FutureTask$Sync.innerRunAndReset(FutureTask.java:351)
   [junit4]   2> 	at java.util.concurrent.FutureTask.runAndReset(FutureTask.java:178)
   [junit4]   2> 	at java.util.concurrent.ScheduledThreadPoolExecutor$ScheduledFutureTask.access$301(ScheduledThreadPoolExecutor.java:178)
   [junit4]   2> 	at java.util.concurrent.ScheduledThreadPoolExecutor$ScheduledFutureTask.run(ScheduledThreadPoolExecutor.java:293)
   [junit4]   2> 	at java.util.concurrent.ThreadPoolExecutor.runWorker(ThreadPoolExecutor.java:1110)
   [junit4]   2> 	at java.util.concurrent.ThreadPoolExecutor$Worker.run(ThreadPoolExecutor.java:603)
   [junit4]   2> 	at java.lang.Thread.run(Thread.java:722)
   [junit4]   2> 
   [junit4]   2> 31620 T2395 C114 REQ [collection1] webapp=/solr path=/select params={wt=javabin&q=*:*&version=2} hits=0 status=0 QTime=0 
   [junit4]   2> 31718 T2395 C114 REQ [collection1] webapp=/solr path=/select params={wt=javabin&q=*:*&version=2} hits=0 status=0 QTime=0 
   [junit4]   2> 31816 T2395 C114 REQ [collection1] webapp=/solr path=/select params={wt=javabin&q=*:*&version=2} hits=0 status=0 QTime=0 
   [junit4]   2> 31914 T2395 C114 REQ [collection1] webapp=/solr path=/select params={wt=javabin&q=*:*&version=2} hits=0 status=0 QTime=0 
   [junit4]   2> 32012 T2395 C114 REQ [collection1] webapp=/solr path=/select params={wt=javabin&q=*:*&version=2} hits=0 status=0 QTime=0 
   [junit4]   2> 32110 T2395 C114 REQ [collection1] webapp=/solr path=/select params={wt=javabin&q=*:*&version=2} hits=0 status=0 QTime=0 
   [junit4]   2> 32208 T2395 C114 REQ [collection1] webapp=/solr path=/select params={wt=javabin&q=*:*&version=2} hits=0 status=0 QTime=0 
   [junit4]   2> 32306 T2395 C114 REQ [collection1] webapp=/solr path=/select params={wt=javabin&q=*:*&version=2} hits=0 status=0 QTime=0 
   [junit4]   2> 32404 T2395 C114 REQ [collection1] webapp=/solr path=/select params={wt=javabin&q=*:*&version=2} hits=0 status=0 QTime=0 
   [junit4]   2> 32492 T2386 C113 REQ [collection1] webapp=/solr path=/replication params={command=indexversion&wt=javabin} status=0 QTime=0 
   [junit4]   2> 32493 T2403 oash.SnapPuller.fetchLatestIndex Master's generation: 7
   [junit4]   2> 32493 T2403 oash.SnapPuller.fetchLatestIndex Slave's generation: 6
   [junit4]   2> 32493 T2403 oash.SnapPuller.fetchLatestIndex Starting replication process
   [junit4]   2> 32495 T2386 C113 REQ [collection1] webapp=/solr path=/replication params={command=filelist&wt=javabin&generation=7} status=0 QTime=1 
   [junit4]   2> 32496 T2403 oash.SnapPuller.fetchLatestIndex Number of files in latest index in master: 10
   [junit4]   2> 32499 T2386 C113 REQ [collection1] webapp=/solr path=/replication params={command=filecontent&checksum=true&generation=7&wt=filestream&file=_3_nrm.cfe} status=0 QTime=0 
   [junit4]   2> 32502 T2395 C114 REQ [collection1] webapp=/solr path=/select params={wt=javabin&q=*:*&version=2} hits=0 status=0 QTime=0 
   [junit4]   2> 32503 T2386 C113 REQ [collection1] webapp=/solr path=/replication params={command=filecontent&checksum=true&generation=7&wt=filestream&file=_3.fdx} status=0 QTime=0 
   [junit4]   2> 32506 T2386 C113 REQ [collection1] webapp=/solr path=/replication params={command=filecontent&checksum=true&generation=7&wt=filestream&file=_3_nrm.cfs} status=0 QTime=0 
   [junit4]   2> 32510 T2386 C113 REQ [collection1] webapp=/solr path=/replication params={command=filecontent&checksum=true&generation=7&wt=filestream&file=_3_Lucene40_0.tip} status=0 QTime=0 
   [junit4]   2> 32515 T2386 C113 REQ [collection1] webapp=/solr path=/replication params={command=filecontent&checksum=true&generation=7&wt=filestream&file=segments_7} status=0 QTime=0 
   [junit4]   2> 32519 T2386 C113 REQ [collection1] webapp=/solr path=/replication params={command=filecontent&checksum=true&generation=7&wt=filestream&file=_3_Lucene40_0.tim} status=0 QTime=0 
   [junit4]   2> 32523 T2386 C113 REQ [collection1] webapp=/solr path=/replication params={command=filecontent&checksum=true&generation=7&wt=filestream&file=_3_Lucene40_0.frq} status=0 QTime=0 
   [junit4]   2> 32526 T2386 C113 REQ [collection1] webapp=/solr path=/replication params={command=filecontent&checksum=true&generation=7&wt=filestream&file=_3.si} status=0 QTime=0 
   [junit4]   2> 32530 T2386 C113 REQ [collection1] webapp=/solr path=/replication params={command=filecontent&checksum=true&generation=7&wt=filestream&file=_3.fnm} status=0 QTime=0 
   [junit4]   2> 32532 T2386 C113 REQ [collection1] webapp=/solr path=/replication params={command=filecontent&checksum=true&generation=7&wt=filestream&file=_3.fdt} status=0 QTime=0 
   [junit4]   2> 32533 T2403 oash.SnapPuller.fetchLatestIndex Total time taken for download : 0 secs
   [junit4]   2> 32535 T2403 oash.SnapPuller.copyAFile SEVERE Unable to move index file from: .\org.apache.solr.handler.TestReplicationHandler$SolrInstance-1338800603636\slave\data\index.20120604120355\_3_nrm.cfe to: C:\Jenkins\workspace\Lucene-Solr-trunk-Windows-Java7-64\solr\build\solr-core\test\J0\org.apache.solr.handler.TestReplicationHandler$SolrInstance-1338800603636\slave\data\index.20120604120328\_3_nrm.cfe Trying to do a copy
   [junit4]   2> 32535 T2403 oash.SnapPuller.copyAFile SEVERE Unable to copy index file from: .\org.apache.solr.handler.TestReplicationHandler$SolrInstance-1338800603636\slave\data\index.20120604120355\_3_nrm.cfe to: C:\Jenkins\workspace\Lucene-Solr-trunk-Windows-Java7-64\solr\build\solr-core\test\J0\org.apache.solr.handler.TestReplicationHandler$SolrInstance-1338800603636\slave\data\index.20120604120328\_3_nrm.cfe java.io.FileNotFoundException: C:\Jenkins\workspace\Lucene-Solr-trunk-Windows-Java7-64\solr\build\solr-core\test\J0\org.apache.solr.handler.TestReplicationHandler$SolrInstance-1338800603636\slave\data\index.20120604120328\_3_nrm.cfe (The system cannot find the path specified)
   [junit4]   2> 	at java.io.FileOutputStream.open(Native Method)
   [junit4]   2> 	at java.io.FileOutputStream.<init>(FileOutputStream.java:212)
   [junit4]   2> 	at java.io.FileOutputStream.<init>(FileOutputStream.java:165)
   [junit4]   2> 	at org.apache.solr.util.FileUtils.copyFile(FileUtils.java:48)
   [junit4]   2> 	at org.apache.solr.handler.SnapPuller.copyAFile(SnapPuller.java:654)
   [junit4]   2> 	at org.apache.solr.handler.SnapPuller.copyIndexFiles(SnapPuller.java:691)
   [junit4]   2> 	at org.apache.solr.handler.SnapPuller.fetchLatestIndex(SnapPuller.java:371)
   [junit4]   2> 	at org.apache.solr.handler.ReplicationHandler.doFetch(ReplicationHandler.java:298)
   [junit4]   2> 	at org.apache.solr.handler.SnapPuller$1.run(SnapPuller.java:169)
   [junit4]   2> 	at java.util.concurrent.Executors$RunnableAdapter.call(Executors.java:471)
   [junit4]   2> 	at java.util.concurrent.FutureTask$Sync.innerRunAndReset(FutureTask.java:351)
   [junit4]   2> 	at java.util.concurrent.FutureTask.runAndReset(FutureTask.java:178)
   [junit4]   2> 	at java.util.concurrent.ScheduledThreadPoolExecutor$ScheduledFutureTask.access$301(ScheduledThreadPoolExecutor.java:178)
   [junit4]   2> 	at java.util.concurrent.ScheduledThreadPoolExecutor$ScheduledFutureTask.run(ScheduledThreadPoolExecutor.java:293)
   [junit4]   2> 	at java.util.concurrent.ThreadPoolExecutor.runWorker(ThreadPoolExecutor.java:1110)
   [junit4]   2> 	at java.util.concurrent.ThreadPoolExecutor$Worker.run(ThreadPoolExecutor.java:603)
   [junit4]   2> 	at java.lang.Thread.run(Thread.java:722)
   [junit4]   2> 
   [junit4]   2> 32598 T2335 oas.SolrTestCaseJ4.tearDown ###Ending test
   [junit4]   2> NOTE: reproduce with: ant test  -Dtestcase=TestReplicationHandler -Dtests.method=test -Dtests.seed=708ABF32C38CBB4B -Dtests.locale=ca_ES -Dtests.timezone=Africa/Addis_Ababa -Dargs="-Dfile.encoding=Cp1252"
   [junit4]   2>
   [junit4]    > (@AfterClass output)
   [junit4]   2> 32623 T2335 oasc.CoreContainer.shutdown Shutting down CoreContainer instance=1132591351
   [junit4]   2> 32624 T2335 oasc.SolrCore.close [collection1]  CLOSING SolrCore org.apache.solr.core.SolrCore@4ba55e51
   [junit4]   2> 32624 T2335 oasc.SolrCore.closeSearcher [collection1] Closing main searcher on request.
   [junit4]   2> 32625 T2335 oasu.DirectUpdateHandler2.close closing DirectUpdateHandler2{commits=4,autocommits=0,soft autocommits=0,optimizes=0,rollbacks=0,expungeDeletes=0,docsPending=0,adds=0,deletesById=0,deletesByQuery=0,errors=0,cumulative_adds=997,cumulative_deletesById=0,cumulative_deletesByQuery=2,cumulative_errors=0}
   [junit4]   2> 32627 T2335 oejsh.ContextHandler.doStop stopped o.e.j.s.ServletContextHandler{/solr,null}
   [junit4]   2> 32679 T2335 oasc.CoreContainer.shutdown Shutting down CoreContainer instance=149892085
   [junit4]   2> 32680 T2335 oasc.SolrCore.close [collection1]  CLOSING SolrCore org.apache.solr.core.SolrCore@178332fb
   [junit4]   2> 32680 T2335 oasc.SolrCore.closeSearcher [collection1] Closing main searcher on request.
   [junit4]   2> 32681 T2335 oasu.DirectUpdateHandler2.close closing DirectUpdateHandler2{commits=8,autocommits=0,soft autocommits=0,optimizes=0,rollbacks=0,expungeDeletes=0,docsPending=0,adds=0,deletesById=0,deletesByQuery=0,errors=0,cumulative_adds=5,cumulative_deletesById=0,cumulative_deletesByQuery=0,cumulative_errors=0}
   [junit4]   2> 32683 T2335 oejsh.ContextHandler.doStop stopped o.e.j.s.ServletContextHandler{/solr,null}
   [junit4]   2> 32753 T2335 oas.SolrTestCaseJ4.deleteCore ###deleteCore
   [junit4]   2> NOTE: test params are: codec=Lucene40: {}, sim=DefaultSimilarity, locale=ca_ES, timezone=Africa/Addis_Ababa
   [junit4]   2> NOTE: Windows 7 6.1 amd64/Oracle Corporation 1.7.0_04 (64-bit)/cpus=2,threads=1,free=58644976,total=259915776
   [junit4]   2> NOTE: All tests run in this JVM: [TestWriterPerf, TestFaceting, TestLMJelinekMercerSimilarityFactory, TestRealTimeGet, SolrCoreCheckLockOnStartupTest, TestSwedishLightStemFilterFactory, TestJmxIntegration, UpdateRequestProcessorFactoryTest, SpellCheckComponentTest, ZkNodePropsTest, TestSort, TestWordDelimiterFilterFactory, FullSolrCloudDistribCmdsTest, JsonLoaderTest, BadIndexSchemaTest, DoubleMetaphoneFilterFactoryTest, TestJapaneseTokenizerFactory, TestFiltering, TestTrie, SpellCheckCollatorTest, ZkSolrClientTest, CurrencyFieldTest, DirectUpdateHandlerTest, OverseerTest, TestShingleFilterFactory, TestIBSimilarityFactory, TestFoldingMultitermQuery, TestNorwegianLightStemFilterFactory, TestPluginEnable, LeaderElectionTest, MultiTermTest, FileBasedSpellCheckerTest, NotRequiredUniqueKeyTest, MinimalSchemaTest, SnowballPorterFilterFactoryTest, TestNorwegianMinimalStemFilterFactory, TestLFUCache, ReturnFieldsTest, IndexSchemaRuntimeFieldTest, SolrCmdDistributorTest, IndexBasedSpellCheckerTest, TestSurroundQueryParser, LukeRequestHandlerTest, LegacyHTMLStripCharFilterTest, DocumentAnalysisRequestHandlerTest, TestKStemFilterFactory, TestRecovery, TestPatternTokenizerFactory, TestItalianLightStemFilterFactory, SolrCoreTest, SolrRequestParserTest, TestRandomFaceting, TestWikipediaTokenizerFactory, CSVRequestHandlerTest, TestPatternReplaceFilterFactory, DirectSolrSpellCheckerTest, SolrInfoMBeanTest, TestSolrXMLSerializer, SignatureUpdateProcessorFactoryTest, StandardRequestHandlerTest, TestEnglishMinimalStemFilterFactory, TestFinnishLightStemFilterFactory, TestSolrCoreProperties, TestCoreContainer, TestIndonesianStemFilterFactory, TestGermanLightStemFilterFactory, SpellingQueryConverterTest, TestUAX29URLEmailTokenizerFactory, TestJmxMonitoredMap, TestGroupingSearch, DebugComponentTest, XsltUpdateRequestHandlerTest, TestNGramFilters, TestStandardFactories, DistributedSpellCheckComponentTest, TestTurkishLowerCaseFilterFactory, PluginInfoTest, TestBinaryResponseWriter, TestDictionaryCompoundWordTokenFilterFactory, TestMultiCoreConfBootstrap, PingRequestHandlerTest, NoCacheHeaderTest, TestPerFieldSimilarity, PeerSyncTest, TestSearchPerf, DateMathParserTest, TestDistributedSearch, TestJapanesePartOfSpeechStopFilterFactory, TestGreekLowerCaseFilterFactory, BasicFunctionalityTest, SOLR749Test, TestIndexSearcher, TestBadConfig, TestQueryTypes, TestPHPSerializedResponseWriter, TestGalicianMinimalStemFilterFactory, MBeansHandlerTest, TestTrimFilterFactory, TestBrazilianStemFilterFactory, SpatialFilterTest, TestCzechStemFilterFactory, TestGermanMinimalStemFilterFactory, TestHashPartitioner, TestFrenchMinimalStemFilterFactory, TestDistributedGrouping, HighlighterTest, BadComponentTest, TestExtendedDismaxParser, TestSpanishLightStemFilterFactory, DisMaxRequestHandlerTest, TestLatvianStemFilterFactory, TestLuceneMatchVersion, SearchHandlerTest, TestReversedWildcardFilterFactory, CommonGramsQueryFilterFactoryTest, OutputWriterTest, SortByFunctionTest, TestPortugueseLightStemFilterFactory, TestConfig, TestBeiderMorseFilterFactory, PrimUtilsTest, TestFunctionQuery, EchoParamsTest, ZkControllerTest, FileUtilsTest, TestMultiWordSynonyms, OpenExchangeRatesOrgProviderTest, UpdateParamsTest, TestFastLRUCache, NodeStateWatcherTest, DistributedQueryElevationComponentTest, TestCJKBigramFilterFactory, TestIndexingPerformance, UUIDFieldTest, TestFrenchLightStemFilterFactory, TestReplicationHandler]
   [junit4]   2> 
   [junit4] Completed in 32.76s, 1 test, 1 failure <<< FAILURES!
[...truncated 690 lines...]

[...truncated 14646 lines...]

[...truncated 14646 lines...]

[...truncated 14646 lines...]