You are viewing a plain text version of this content. The canonical link for it is here.
Posted to commits@karaf.apache.org by Apache Jenkins Server <je...@builds.apache.org> on 2015/05/28 19:02:43 UTC
Build failed in Jenkins: karaf-master » Apache Karaf :: Assemblies :: Minimal Distribution #3390
See <https://builds.apache.org/job/karaf-master/org.apache.karaf$apache-karaf-minimal/3390/>
------------------------------------------
[INFO]
[INFO] ------------------------------------------------------------------------
[INFO] Building Apache Karaf :: Assemblies :: Minimal Distribution 4.0.0-SNAPSHOT
[INFO] ------------------------------------------------------------------------
[INFO]
[INFO] --- maven-clean-plugin:2.5:clean (default-clean) @ apache-karaf-minimal ---
[INFO] Deleting <https://builds.apache.org/job/karaf-master/org.apache.karaf$apache-karaf-minimal/ws/target>
[INFO]
[INFO] --- maven-enforcer-plugin:1.3.1:enforce (enforce-maven) @ apache-karaf-minimal ---
[INFO]
[INFO] --- maven-bundle-plugin:2.5.4:cleanVersions (cleanVersions) @ apache-karaf-minimal ---
[INFO]
[INFO] --- maven-remote-resources-plugin:1.5:process (default) @ apache-karaf-minimal ---
[INFO]
[INFO] --- maven-resources-plugin:2.6:resources (process-resources) @ apache-karaf-minimal ---
[INFO] Using 'UTF-8' encoding to copy filtered resources.
[INFO] Copying 4 resources
[INFO]
[INFO] --- karaf-maven-plugin:4.0.0-SNAPSHOT:assembly (process-resources) @ apache-karaf-minimal ---
[INFO] Creating work directory
[INFO] Loading kar and features repositories dependencies
[INFO] Generating karaf assembly: <https://builds.apache.org/job/karaf-master/org.apache.karaf$apache-karaf-minimal/ws/target/assembly>
[INFO] Unzipping kars
[WARNING] Error resolving artifactorg.apache.karaf.features:framework:kar:4.0.0-SNAPSHOT:Could not find artifact org.apache.karaf.features:framework:kar:4.0.0-SNAPSHOT
shaded.org.eclipse.aether.resolution.ArtifactResolutionException: Could not find artifact org.apache.karaf.features:framework:kar:4.0.0-SNAPSHOT
at shaded.org.eclipse.aether.internal.impl.DefaultArtifactResolver.resolve(DefaultArtifactResolver.java:444)
at shaded.org.eclipse.aether.internal.impl.DefaultArtifactResolver.resolveArtifacts(DefaultArtifactResolver.java:246)
at shaded.org.eclipse.aether.internal.impl.DefaultArtifactResolver.resolveArtifact(DefaultArtifactResolver.java:223)
at shaded.org.eclipse.aether.internal.impl.DefaultRepositorySystem.resolveArtifact(DefaultRepositorySystem.java:294)
at org.ops4j.pax.url.mvn.internal.AetherBasedResolver.resolve(AetherBasedResolver.java:573)
at org.ops4j.pax.url.mvn.internal.AetherBasedResolver.resolve(AetherBasedResolver.java:528)
at org.ops4j.pax.url.mvn.internal.AetherBasedResolver.resolve(AetherBasedResolver.java:506)
at org.ops4j.pax.url.mvn.internal.AetherBasedResolver.resolve(AetherBasedResolver.java:481)
at org.apache.karaf.features.internal.download.impl.MavenDownloadTask.download(MavenDownloadTask.java:34)
at org.apache.karaf.features.internal.download.impl.AbstractRetryableDownloadTask.run(AbstractRetryableDownloadTask.java:58)
at java.util.concurrent.Executors$RunnableAdapter.call(Executors.java:471)
at java.util.concurrent.FutureTask$Sync.innerRun(FutureTask.java:334)
at java.util.concurrent.FutureTask.run(FutureTask.java:166)
at java.util.concurrent.ScheduledThreadPoolExecutor$ScheduledFutureTask.access$201(ScheduledThreadPoolExecutor.java:178)
at java.util.concurrent.ScheduledThreadPoolExecutor$ScheduledFutureTask.run(ScheduledThreadPoolExecutor.java:292)
at java.util.concurrent.ThreadPoolExecutor.runWorker(ThreadPoolExecutor.java:1145)
at java.util.concurrent.ThreadPoolExecutor$Worker.run(ThreadPoolExecutor.java:615)
at java.lang.Thread.run(Thread.java:724)
Caused by: shaded.org.eclipse.aether.transfer.ArtifactNotFoundException: Could not find artifact org.apache.karaf.features:framework:kar:4.0.0-SNAPSHOT
at shaded.org.eclipse.aether.internal.impl.DefaultArtifactResolver.resolve(DefaultArtifactResolver.java:434)
... 17 more
Build failed in Jenkins: karaf-master » Apache Karaf :: Assemblies :: Minimal Distribution #3400
Posted by Apache Jenkins Server <je...@builds.apache.org>.
See <https://builds.apache.org/job/karaf-master/org.apache.karaf$apache-karaf-minimal/3400/>
------------------------------------------
[INFO]
[INFO] ------------------------------------------------------------------------
[INFO] Building Apache Karaf :: Assemblies :: Minimal Distribution 4.0.0-SNAPSHOT
[INFO] ------------------------------------------------------------------------
[INFO]
[INFO] --- maven-clean-plugin:2.5:clean (default-clean) @ apache-karaf-minimal ---
[INFO] Deleting <https://builds.apache.org/job/karaf-master/org.apache.karaf$apache-karaf-minimal/ws/target>
[INFO]
[INFO] --- maven-enforcer-plugin:1.3.1:enforce (enforce-maven) @ apache-karaf-minimal ---
[INFO]
[INFO] --- maven-bundle-plugin:2.5.4:cleanVersions (cleanVersions) @ apache-karaf-minimal ---
[INFO]
[INFO] --- maven-remote-resources-plugin:1.5:process (default) @ apache-karaf-minimal ---
[INFO]
[INFO] --- maven-resources-plugin:2.6:resources (process-resources) @ apache-karaf-minimal ---
[INFO] Using 'UTF-8' encoding to copy filtered resources.
[INFO] Copying 4 resources
[INFO]
[INFO] --- karaf-maven-plugin:4.0.0-SNAPSHOT:assembly (process-resources) @ apache-karaf-minimal ---
[INFO] Creating work directory
[INFO] Loading kar and features repositories dependencies
[INFO] Generating karaf assembly: <https://builds.apache.org/job/karaf-master/org.apache.karaf$apache-karaf-minimal/ws/target/assembly>
[INFO] Unzipping kars
[WARNING] Error resolving artifactorg.apache.karaf.features:framework:kar:4.0.0-SNAPSHOT:Could not find artifact org.apache.karaf.features:framework:kar:4.0.0-SNAPSHOT
shaded.org.eclipse.aether.resolution.ArtifactResolutionException: Could not find artifact org.apache.karaf.features:framework:kar:4.0.0-SNAPSHOT
at shaded.org.eclipse.aether.internal.impl.DefaultArtifactResolver.resolve(DefaultArtifactResolver.java:444)
at shaded.org.eclipse.aether.internal.impl.DefaultArtifactResolver.resolveArtifacts(DefaultArtifactResolver.java:246)
at shaded.org.eclipse.aether.internal.impl.DefaultArtifactResolver.resolveArtifact(DefaultArtifactResolver.java:223)
at shaded.org.eclipse.aether.internal.impl.DefaultRepositorySystem.resolveArtifact(DefaultRepositorySystem.java:294)
at org.ops4j.pax.url.mvn.internal.AetherBasedResolver.resolve(AetherBasedResolver.java:573)
at org.ops4j.pax.url.mvn.internal.AetherBasedResolver.resolve(AetherBasedResolver.java:528)
at org.ops4j.pax.url.mvn.internal.AetherBasedResolver.resolve(AetherBasedResolver.java:506)
at org.ops4j.pax.url.mvn.internal.AetherBasedResolver.resolve(AetherBasedResolver.java:481)
at org.apache.karaf.features.internal.download.impl.MavenDownloadTask.download(MavenDownloadTask.java:34)
at org.apache.karaf.features.internal.download.impl.AbstractRetryableDownloadTask.run(AbstractRetryableDownloadTask.java:58)
at java.util.concurrent.Executors$RunnableAdapter.call(Executors.java:471)
at java.util.concurrent.FutureTask$Sync.innerRun(FutureTask.java:334)
at java.util.concurrent.FutureTask.run(FutureTask.java:166)
at java.util.concurrent.ScheduledThreadPoolExecutor$ScheduledFutureTask.access$201(ScheduledThreadPoolExecutor.java:178)
at java.util.concurrent.ScheduledThreadPoolExecutor$ScheduledFutureTask.run(ScheduledThreadPoolExecutor.java:292)
at java.util.concurrent.ThreadPoolExecutor.runWorker(ThreadPoolExecutor.java:1145)
at java.util.concurrent.ThreadPoolExecutor$Worker.run(ThreadPoolExecutor.java:615)
at java.lang.Thread.run(Thread.java:724)
Caused by: shaded.org.eclipse.aether.transfer.ArtifactNotFoundException: Could not find artifact org.apache.karaf.features:framework:kar:4.0.0-SNAPSHOT
at shaded.org.eclipse.aether.internal.impl.DefaultArtifactResolver.resolve(DefaultArtifactResolver.java:434)
... 17 more
Build failed in Jenkins: karaf-master » Apache Karaf :: Assemblies :: Minimal Distribution #3399
Posted by Apache Jenkins Server <je...@builds.apache.org>.
See <https://builds.apache.org/job/karaf-master/org.apache.karaf$apache-karaf-minimal/3399/>
------------------------------------------
[INFO]
[INFO] ------------------------------------------------------------------------
[INFO] Building Apache Karaf :: Assemblies :: Minimal Distribution 4.0.0-SNAPSHOT
[INFO] ------------------------------------------------------------------------
[INFO]
[INFO] --- maven-clean-plugin:2.5:clean (default-clean) @ apache-karaf-minimal ---
[INFO] Deleting <https://builds.apache.org/job/karaf-master/org.apache.karaf$apache-karaf-minimal/ws/target>
[INFO]
[INFO] --- maven-enforcer-plugin:1.3.1:enforce (enforce-maven) @ apache-karaf-minimal ---
[INFO]
[INFO] --- maven-bundle-plugin:2.5.4:cleanVersions (cleanVersions) @ apache-karaf-minimal ---
[INFO]
[INFO] --- maven-remote-resources-plugin:1.5:process (default) @ apache-karaf-minimal ---
[INFO]
[INFO] --- maven-resources-plugin:2.6:resources (process-resources) @ apache-karaf-minimal ---
[INFO] Using 'UTF-8' encoding to copy filtered resources.
[INFO] Copying 4 resources
[INFO]
[INFO] --- karaf-maven-plugin:4.0.0-SNAPSHOT:assembly (process-resources) @ apache-karaf-minimal ---
[INFO] Creating work directory
[INFO] Loading kar and features repositories dependencies
[INFO] Generating karaf assembly: <https://builds.apache.org/job/karaf-master/org.apache.karaf$apache-karaf-minimal/ws/target/assembly>
[INFO] Unzipping kars
[WARNING] Error resolving artifactorg.apache.karaf.features:framework:kar:4.0.0-SNAPSHOT:Could not find artifact org.apache.karaf.features:framework:kar:4.0.0-SNAPSHOT
shaded.org.eclipse.aether.resolution.ArtifactResolutionException: Could not find artifact org.apache.karaf.features:framework:kar:4.0.0-SNAPSHOT
at shaded.org.eclipse.aether.internal.impl.DefaultArtifactResolver.resolve(DefaultArtifactResolver.java:444)
at shaded.org.eclipse.aether.internal.impl.DefaultArtifactResolver.resolveArtifacts(DefaultArtifactResolver.java:246)
at shaded.org.eclipse.aether.internal.impl.DefaultArtifactResolver.resolveArtifact(DefaultArtifactResolver.java:223)
at shaded.org.eclipse.aether.internal.impl.DefaultRepositorySystem.resolveArtifact(DefaultRepositorySystem.java:294)
at org.ops4j.pax.url.mvn.internal.AetherBasedResolver.resolve(AetherBasedResolver.java:573)
at org.ops4j.pax.url.mvn.internal.AetherBasedResolver.resolve(AetherBasedResolver.java:528)
at org.ops4j.pax.url.mvn.internal.AetherBasedResolver.resolve(AetherBasedResolver.java:506)
at org.ops4j.pax.url.mvn.internal.AetherBasedResolver.resolve(AetherBasedResolver.java:481)
at org.apache.karaf.features.internal.download.impl.MavenDownloadTask.download(MavenDownloadTask.java:34)
at org.apache.karaf.features.internal.download.impl.AbstractRetryableDownloadTask.run(AbstractRetryableDownloadTask.java:58)
at java.util.concurrent.Executors$RunnableAdapter.call(Executors.java:471)
at java.util.concurrent.FutureTask$Sync.innerRun(FutureTask.java:334)
at java.util.concurrent.FutureTask.run(FutureTask.java:166)
at java.util.concurrent.ScheduledThreadPoolExecutor$ScheduledFutureTask.access$201(ScheduledThreadPoolExecutor.java:178)
at java.util.concurrent.ScheduledThreadPoolExecutor$ScheduledFutureTask.run(ScheduledThreadPoolExecutor.java:292)
at java.util.concurrent.ThreadPoolExecutor.runWorker(ThreadPoolExecutor.java:1145)
at java.util.concurrent.ThreadPoolExecutor$Worker.run(ThreadPoolExecutor.java:615)
at java.lang.Thread.run(Thread.java:724)
Caused by: shaded.org.eclipse.aether.transfer.ArtifactNotFoundException: Could not find artifact org.apache.karaf.features:framework:kar:4.0.0-SNAPSHOT
at shaded.org.eclipse.aether.internal.impl.DefaultArtifactResolver.resolve(DefaultArtifactResolver.java:434)
... 17 more
Build failed in Jenkins: karaf-master » Apache Karaf :: Assemblies :: Minimal Distribution #3398
Posted by Apache Jenkins Server <je...@builds.apache.org>.
See <https://builds.apache.org/job/karaf-master/org.apache.karaf$apache-karaf-minimal/3398/>
------------------------------------------
[INFO]
[INFO] ------------------------------------------------------------------------
[INFO] Building Apache Karaf :: Assemblies :: Minimal Distribution 4.0.0-SNAPSHOT
[INFO] ------------------------------------------------------------------------
[INFO]
[INFO] --- maven-clean-plugin:2.5:clean (default-clean) @ apache-karaf-minimal ---
[INFO] Deleting <https://builds.apache.org/job/karaf-master/org.apache.karaf$apache-karaf-minimal/ws/target>
[INFO]
[INFO] --- maven-enforcer-plugin:1.3.1:enforce (enforce-maven) @ apache-karaf-minimal ---
[INFO]
[INFO] --- maven-bundle-plugin:2.5.4:cleanVersions (cleanVersions) @ apache-karaf-minimal ---
[INFO]
[INFO] --- maven-remote-resources-plugin:1.5:process (default) @ apache-karaf-minimal ---
[INFO]
[INFO] --- maven-resources-plugin:2.6:resources (process-resources) @ apache-karaf-minimal ---
[INFO] Using 'UTF-8' encoding to copy filtered resources.
[INFO] Copying 4 resources
[INFO]
[INFO] --- karaf-maven-plugin:4.0.0-SNAPSHOT:assembly (process-resources) @ apache-karaf-minimal ---
[INFO] Creating work directory
[INFO] Loading kar and features repositories dependencies
[INFO] Generating karaf assembly: <https://builds.apache.org/job/karaf-master/org.apache.karaf$apache-karaf-minimal/ws/target/assembly>
[INFO] Unzipping kars
[WARNING] Error resolving artifactorg.apache.karaf.features:framework:kar:4.0.0-SNAPSHOT:Could not find artifact org.apache.karaf.features:framework:kar:4.0.0-SNAPSHOT
shaded.org.eclipse.aether.resolution.ArtifactResolutionException: Could not find artifact org.apache.karaf.features:framework:kar:4.0.0-SNAPSHOT
at shaded.org.eclipse.aether.internal.impl.DefaultArtifactResolver.resolve(DefaultArtifactResolver.java:444)
at shaded.org.eclipse.aether.internal.impl.DefaultArtifactResolver.resolveArtifacts(DefaultArtifactResolver.java:246)
at shaded.org.eclipse.aether.internal.impl.DefaultArtifactResolver.resolveArtifact(DefaultArtifactResolver.java:223)
at shaded.org.eclipse.aether.internal.impl.DefaultRepositorySystem.resolveArtifact(DefaultRepositorySystem.java:294)
at org.ops4j.pax.url.mvn.internal.AetherBasedResolver.resolve(AetherBasedResolver.java:573)
at org.ops4j.pax.url.mvn.internal.AetherBasedResolver.resolve(AetherBasedResolver.java:528)
at org.ops4j.pax.url.mvn.internal.AetherBasedResolver.resolve(AetherBasedResolver.java:506)
at org.ops4j.pax.url.mvn.internal.AetherBasedResolver.resolve(AetherBasedResolver.java:481)
at org.apache.karaf.features.internal.download.impl.MavenDownloadTask.download(MavenDownloadTask.java:34)
at org.apache.karaf.features.internal.download.impl.AbstractRetryableDownloadTask.run(AbstractRetryableDownloadTask.java:58)
at java.util.concurrent.Executors$RunnableAdapter.call(Executors.java:471)
at java.util.concurrent.FutureTask$Sync.innerRun(FutureTask.java:334)
at java.util.concurrent.FutureTask.run(FutureTask.java:166)
at java.util.concurrent.ScheduledThreadPoolExecutor$ScheduledFutureTask.access$201(ScheduledThreadPoolExecutor.java:178)
at java.util.concurrent.ScheduledThreadPoolExecutor$ScheduledFutureTask.run(ScheduledThreadPoolExecutor.java:292)
at java.util.concurrent.ThreadPoolExecutor.runWorker(ThreadPoolExecutor.java:1145)
at java.util.concurrent.ThreadPoolExecutor$Worker.run(ThreadPoolExecutor.java:615)
at java.lang.Thread.run(Thread.java:724)
Caused by: shaded.org.eclipse.aether.transfer.ArtifactNotFoundException: Could not find artifact org.apache.karaf.features:framework:kar:4.0.0-SNAPSHOT
at shaded.org.eclipse.aether.internal.impl.DefaultArtifactResolver.resolve(DefaultArtifactResolver.java:434)
... 17 more
Build failed in Jenkins: karaf-master » Apache Karaf :: Assemblies :: Minimal Distribution #3397
Posted by Apache Jenkins Server <je...@builds.apache.org>.
See <https://builds.apache.org/job/karaf-master/org.apache.karaf$apache-karaf-minimal/3397/>
------------------------------------------
[INFO]
[INFO] ------------------------------------------------------------------------
[INFO] Building Apache Karaf :: Assemblies :: Minimal Distribution 4.0.0-SNAPSHOT
[INFO] ------------------------------------------------------------------------
[INFO]
[INFO] --- maven-clean-plugin:2.5:clean (default-clean) @ apache-karaf-minimal ---
[INFO] Deleting <https://builds.apache.org/job/karaf-master/org.apache.karaf$apache-karaf-minimal/ws/target>
[INFO]
[INFO] --- maven-enforcer-plugin:1.3.1:enforce (enforce-maven) @ apache-karaf-minimal ---
[INFO]
[INFO] --- maven-bundle-plugin:2.5.4:cleanVersions (cleanVersions) @ apache-karaf-minimal ---
[INFO]
[INFO] --- maven-remote-resources-plugin:1.5:process (default) @ apache-karaf-minimal ---
[INFO]
[INFO] --- maven-resources-plugin:2.6:resources (process-resources) @ apache-karaf-minimal ---
[INFO] Using 'UTF-8' encoding to copy filtered resources.
[INFO] Copying 4 resources
[INFO]
[INFO] --- karaf-maven-plugin:4.0.0-SNAPSHOT:assembly (process-resources) @ apache-karaf-minimal ---
[INFO] Creating work directory
[INFO] Loading kar and features repositories dependencies
[INFO] Generating karaf assembly: <https://builds.apache.org/job/karaf-master/org.apache.karaf$apache-karaf-minimal/ws/target/assembly>
[INFO] Unzipping kars
[WARNING] Error resolving artifactorg.apache.karaf.features:framework:kar:4.0.0-SNAPSHOT:Could not find artifact org.apache.karaf.features:framework:kar:4.0.0-SNAPSHOT
shaded.org.eclipse.aether.resolution.ArtifactResolutionException: Could not find artifact org.apache.karaf.features:framework:kar:4.0.0-SNAPSHOT
at shaded.org.eclipse.aether.internal.impl.DefaultArtifactResolver.resolve(DefaultArtifactResolver.java:444)
at shaded.org.eclipse.aether.internal.impl.DefaultArtifactResolver.resolveArtifacts(DefaultArtifactResolver.java:246)
at shaded.org.eclipse.aether.internal.impl.DefaultArtifactResolver.resolveArtifact(DefaultArtifactResolver.java:223)
at shaded.org.eclipse.aether.internal.impl.DefaultRepositorySystem.resolveArtifact(DefaultRepositorySystem.java:294)
at org.ops4j.pax.url.mvn.internal.AetherBasedResolver.resolve(AetherBasedResolver.java:573)
at org.ops4j.pax.url.mvn.internal.AetherBasedResolver.resolve(AetherBasedResolver.java:528)
at org.ops4j.pax.url.mvn.internal.AetherBasedResolver.resolve(AetherBasedResolver.java:506)
at org.ops4j.pax.url.mvn.internal.AetherBasedResolver.resolve(AetherBasedResolver.java:481)
at org.apache.karaf.features.internal.download.impl.MavenDownloadTask.download(MavenDownloadTask.java:34)
at org.apache.karaf.features.internal.download.impl.AbstractRetryableDownloadTask.run(AbstractRetryableDownloadTask.java:58)
at java.util.concurrent.Executors$RunnableAdapter.call(Executors.java:471)
at java.util.concurrent.FutureTask$Sync.innerRun(FutureTask.java:334)
at java.util.concurrent.FutureTask.run(FutureTask.java:166)
at java.util.concurrent.ScheduledThreadPoolExecutor$ScheduledFutureTask.access$201(ScheduledThreadPoolExecutor.java:178)
at java.util.concurrent.ScheduledThreadPoolExecutor$ScheduledFutureTask.run(ScheduledThreadPoolExecutor.java:292)
at java.util.concurrent.ThreadPoolExecutor.runWorker(ThreadPoolExecutor.java:1145)
at java.util.concurrent.ThreadPoolExecutor$Worker.run(ThreadPoolExecutor.java:615)
at java.lang.Thread.run(Thread.java:724)
Caused by: shaded.org.eclipse.aether.transfer.ArtifactNotFoundException: Could not find artifact org.apache.karaf.features:framework:kar:4.0.0-SNAPSHOT
at shaded.org.eclipse.aether.internal.impl.DefaultArtifactResolver.resolve(DefaultArtifactResolver.java:434)
... 17 more
Build failed in Jenkins: karaf-master » Apache Karaf :: Assemblies :: Minimal Distribution #3396
Posted by Apache Jenkins Server <je...@builds.apache.org>.
See <https://builds.apache.org/job/karaf-master/org.apache.karaf$apache-karaf-minimal/3396/>
------------------------------------------
[INFO]
[INFO] ------------------------------------------------------------------------
[INFO] Building Apache Karaf :: Assemblies :: Minimal Distribution 4.0.0-SNAPSHOT
[INFO] ------------------------------------------------------------------------
[INFO]
[INFO] --- maven-clean-plugin:2.5:clean (default-clean) @ apache-karaf-minimal ---
[INFO] Deleting <https://builds.apache.org/job/karaf-master/org.apache.karaf$apache-karaf-minimal/ws/target>
[INFO]
[INFO] --- maven-enforcer-plugin:1.3.1:enforce (enforce-maven) @ apache-karaf-minimal ---
[INFO]
[INFO] --- maven-bundle-plugin:2.5.4:cleanVersions (cleanVersions) @ apache-karaf-minimal ---
[INFO]
[INFO] --- maven-remote-resources-plugin:1.5:process (default) @ apache-karaf-minimal ---
[INFO]
[INFO] --- maven-resources-plugin:2.6:resources (process-resources) @ apache-karaf-minimal ---
[INFO] Using 'UTF-8' encoding to copy filtered resources.
[INFO] Copying 4 resources
[INFO]
[INFO] --- karaf-maven-plugin:4.0.0-SNAPSHOT:assembly (process-resources) @ apache-karaf-minimal ---
[INFO] Creating work directory
[INFO] Loading kar and features repositories dependencies
[INFO] Generating karaf assembly: <https://builds.apache.org/job/karaf-master/org.apache.karaf$apache-karaf-minimal/ws/target/assembly>
[INFO] Unzipping kars
[WARNING] Error resolving artifactorg.apache.karaf.features:framework:kar:4.0.0-SNAPSHOT:Could not find artifact org.apache.karaf.features:framework:kar:4.0.0-SNAPSHOT
shaded.org.eclipse.aether.resolution.ArtifactResolutionException: Could not find artifact org.apache.karaf.features:framework:kar:4.0.0-SNAPSHOT
at shaded.org.eclipse.aether.internal.impl.DefaultArtifactResolver.resolve(DefaultArtifactResolver.java:444)
at shaded.org.eclipse.aether.internal.impl.DefaultArtifactResolver.resolveArtifacts(DefaultArtifactResolver.java:246)
at shaded.org.eclipse.aether.internal.impl.DefaultArtifactResolver.resolveArtifact(DefaultArtifactResolver.java:223)
at shaded.org.eclipse.aether.internal.impl.DefaultRepositorySystem.resolveArtifact(DefaultRepositorySystem.java:294)
at org.ops4j.pax.url.mvn.internal.AetherBasedResolver.resolve(AetherBasedResolver.java:573)
at org.ops4j.pax.url.mvn.internal.AetherBasedResolver.resolve(AetherBasedResolver.java:528)
at org.ops4j.pax.url.mvn.internal.AetherBasedResolver.resolve(AetherBasedResolver.java:506)
at org.ops4j.pax.url.mvn.internal.AetherBasedResolver.resolve(AetherBasedResolver.java:481)
at org.apache.karaf.features.internal.download.impl.MavenDownloadTask.download(MavenDownloadTask.java:34)
at org.apache.karaf.features.internal.download.impl.AbstractRetryableDownloadTask.run(AbstractRetryableDownloadTask.java:58)
at java.util.concurrent.Executors$RunnableAdapter.call(Executors.java:471)
at java.util.concurrent.FutureTask$Sync.innerRun(FutureTask.java:334)
at java.util.concurrent.FutureTask.run(FutureTask.java:166)
at java.util.concurrent.ScheduledThreadPoolExecutor$ScheduledFutureTask.access$201(ScheduledThreadPoolExecutor.java:178)
at java.util.concurrent.ScheduledThreadPoolExecutor$ScheduledFutureTask.run(ScheduledThreadPoolExecutor.java:292)
at java.util.concurrent.ThreadPoolExecutor.runWorker(ThreadPoolExecutor.java:1145)
at java.util.concurrent.ThreadPoolExecutor$Worker.run(ThreadPoolExecutor.java:615)
at java.lang.Thread.run(Thread.java:724)
Caused by: shaded.org.eclipse.aether.transfer.ArtifactNotFoundException: Could not find artifact org.apache.karaf.features:framework:kar:4.0.0-SNAPSHOT
at shaded.org.eclipse.aether.internal.impl.DefaultArtifactResolver.resolve(DefaultArtifactResolver.java:434)
... 17 more
Build failed in Jenkins: karaf-master » Apache Karaf :: Assemblies :: Minimal Distribution #3395
Posted by Apache Jenkins Server <je...@builds.apache.org>.
See <https://builds.apache.org/job/karaf-master/org.apache.karaf$apache-karaf-minimal/3395/>
------------------------------------------
[INFO]
[INFO] ------------------------------------------------------------------------
[INFO] Building Apache Karaf :: Assemblies :: Minimal Distribution 4.0.0-SNAPSHOT
[INFO] ------------------------------------------------------------------------
[INFO]
[INFO] --- maven-clean-plugin:2.5:clean (default-clean) @ apache-karaf-minimal ---
[INFO] Deleting <https://builds.apache.org/job/karaf-master/org.apache.karaf$apache-karaf-minimal/ws/target>
[INFO]
[INFO] --- maven-enforcer-plugin:1.3.1:enforce (enforce-maven) @ apache-karaf-minimal ---
[INFO]
[INFO] --- maven-bundle-plugin:2.5.4:cleanVersions (cleanVersions) @ apache-karaf-minimal ---
[INFO]
[INFO] --- maven-remote-resources-plugin:1.5:process (default) @ apache-karaf-minimal ---
[INFO]
[INFO] --- maven-resources-plugin:2.6:resources (process-resources) @ apache-karaf-minimal ---
[INFO] Using 'UTF-8' encoding to copy filtered resources.
[INFO] Copying 4 resources
[INFO]
[INFO] --- karaf-maven-plugin:4.0.0-SNAPSHOT:assembly (process-resources) @ apache-karaf-minimal ---
[INFO] Creating work directory
[INFO] Loading kar and features repositories dependencies
[INFO] Generating karaf assembly: <https://builds.apache.org/job/karaf-master/org.apache.karaf$apache-karaf-minimal/ws/target/assembly>
[INFO] Unzipping kars
[WARNING] Error resolving artifactorg.apache.karaf.features:framework:kar:4.0.0-SNAPSHOT:Could not find artifact org.apache.karaf.features:framework:kar:4.0.0-SNAPSHOT
shaded.org.eclipse.aether.resolution.ArtifactResolutionException: Could not find artifact org.apache.karaf.features:framework:kar:4.0.0-SNAPSHOT
at shaded.org.eclipse.aether.internal.impl.DefaultArtifactResolver.resolve(DefaultArtifactResolver.java:444)
at shaded.org.eclipse.aether.internal.impl.DefaultArtifactResolver.resolveArtifacts(DefaultArtifactResolver.java:246)
at shaded.org.eclipse.aether.internal.impl.DefaultArtifactResolver.resolveArtifact(DefaultArtifactResolver.java:223)
at shaded.org.eclipse.aether.internal.impl.DefaultRepositorySystem.resolveArtifact(DefaultRepositorySystem.java:294)
at org.ops4j.pax.url.mvn.internal.AetherBasedResolver.resolve(AetherBasedResolver.java:573)
at org.ops4j.pax.url.mvn.internal.AetherBasedResolver.resolve(AetherBasedResolver.java:528)
at org.ops4j.pax.url.mvn.internal.AetherBasedResolver.resolve(AetherBasedResolver.java:506)
at org.ops4j.pax.url.mvn.internal.AetherBasedResolver.resolve(AetherBasedResolver.java:481)
at org.apache.karaf.features.internal.download.impl.MavenDownloadTask.download(MavenDownloadTask.java:34)
at org.apache.karaf.features.internal.download.impl.AbstractRetryableDownloadTask.run(AbstractRetryableDownloadTask.java:58)
at java.util.concurrent.Executors$RunnableAdapter.call(Executors.java:471)
at java.util.concurrent.FutureTask$Sync.innerRun(FutureTask.java:334)
at java.util.concurrent.FutureTask.run(FutureTask.java:166)
at java.util.concurrent.ScheduledThreadPoolExecutor$ScheduledFutureTask.access$201(ScheduledThreadPoolExecutor.java:178)
at java.util.concurrent.ScheduledThreadPoolExecutor$ScheduledFutureTask.run(ScheduledThreadPoolExecutor.java:292)
at java.util.concurrent.ThreadPoolExecutor.runWorker(ThreadPoolExecutor.java:1145)
at java.util.concurrent.ThreadPoolExecutor$Worker.run(ThreadPoolExecutor.java:615)
at java.lang.Thread.run(Thread.java:724)
Caused by: shaded.org.eclipse.aether.transfer.ArtifactNotFoundException: Could not find artifact org.apache.karaf.features:framework:kar:4.0.0-SNAPSHOT
at shaded.org.eclipse.aether.internal.impl.DefaultArtifactResolver.resolve(DefaultArtifactResolver.java:434)
... 17 more
Build failed in Jenkins: karaf-master » Apache Karaf :: Assemblies :: Minimal Distribution #3394
Posted by Apache Jenkins Server <je...@builds.apache.org>.
See <https://builds.apache.org/job/karaf-master/org.apache.karaf$apache-karaf-minimal/3394/>
------------------------------------------
[INFO]
[INFO] ------------------------------------------------------------------------
[INFO] Building Apache Karaf :: Assemblies :: Minimal Distribution 4.0.0-SNAPSHOT
[INFO] ------------------------------------------------------------------------
[INFO]
[INFO] --- maven-clean-plugin:2.5:clean (default-clean) @ apache-karaf-minimal ---
[INFO] Deleting <https://builds.apache.org/job/karaf-master/org.apache.karaf$apache-karaf-minimal/ws/target>
[INFO]
[INFO] --- maven-enforcer-plugin:1.3.1:enforce (enforce-maven) @ apache-karaf-minimal ---
[INFO]
[INFO] --- maven-bundle-plugin:2.5.4:cleanVersions (cleanVersions) @ apache-karaf-minimal ---
[INFO]
[INFO] --- maven-remote-resources-plugin:1.5:process (default) @ apache-karaf-minimal ---
[INFO]
[INFO] --- maven-resources-plugin:2.6:resources (process-resources) @ apache-karaf-minimal ---
[INFO] Using 'UTF-8' encoding to copy filtered resources.
[INFO] Copying 4 resources
[INFO]
[INFO] --- karaf-maven-plugin:4.0.0-SNAPSHOT:assembly (process-resources) @ apache-karaf-minimal ---
[INFO] Creating work directory
[INFO] Loading kar and features repositories dependencies
[INFO] Generating karaf assembly: <https://builds.apache.org/job/karaf-master/org.apache.karaf$apache-karaf-minimal/ws/target/assembly>
[INFO] Unzipping kars
[WARNING] Error resolving artifactorg.apache.karaf.features:framework:kar:4.0.0-SNAPSHOT:Could not find artifact org.apache.karaf.features:framework:kar:4.0.0-SNAPSHOT
shaded.org.eclipse.aether.resolution.ArtifactResolutionException: Could not find artifact org.apache.karaf.features:framework:kar:4.0.0-SNAPSHOT
at shaded.org.eclipse.aether.internal.impl.DefaultArtifactResolver.resolve(DefaultArtifactResolver.java:444)
at shaded.org.eclipse.aether.internal.impl.DefaultArtifactResolver.resolveArtifacts(DefaultArtifactResolver.java:246)
at shaded.org.eclipse.aether.internal.impl.DefaultArtifactResolver.resolveArtifact(DefaultArtifactResolver.java:223)
at shaded.org.eclipse.aether.internal.impl.DefaultRepositorySystem.resolveArtifact(DefaultRepositorySystem.java:294)
at org.ops4j.pax.url.mvn.internal.AetherBasedResolver.resolve(AetherBasedResolver.java:573)
at org.ops4j.pax.url.mvn.internal.AetherBasedResolver.resolve(AetherBasedResolver.java:528)
at org.ops4j.pax.url.mvn.internal.AetherBasedResolver.resolve(AetherBasedResolver.java:506)
at org.ops4j.pax.url.mvn.internal.AetherBasedResolver.resolve(AetherBasedResolver.java:481)
at org.apache.karaf.features.internal.download.impl.MavenDownloadTask.download(MavenDownloadTask.java:34)
at org.apache.karaf.features.internal.download.impl.AbstractRetryableDownloadTask.run(AbstractRetryableDownloadTask.java:58)
at java.util.concurrent.Executors$RunnableAdapter.call(Executors.java:471)
at java.util.concurrent.FutureTask$Sync.innerRun(FutureTask.java:334)
at java.util.concurrent.FutureTask.run(FutureTask.java:166)
at java.util.concurrent.ScheduledThreadPoolExecutor$ScheduledFutureTask.access$201(ScheduledThreadPoolExecutor.java:178)
at java.util.concurrent.ScheduledThreadPoolExecutor$ScheduledFutureTask.run(ScheduledThreadPoolExecutor.java:292)
at java.util.concurrent.ThreadPoolExecutor.runWorker(ThreadPoolExecutor.java:1145)
at java.util.concurrent.ThreadPoolExecutor$Worker.run(ThreadPoolExecutor.java:615)
at java.lang.Thread.run(Thread.java:724)
Caused by: shaded.org.eclipse.aether.transfer.ArtifactNotFoundException: Could not find artifact org.apache.karaf.features:framework:kar:4.0.0-SNAPSHOT
at shaded.org.eclipse.aether.internal.impl.DefaultArtifactResolver.resolve(DefaultArtifactResolver.java:434)
... 17 more
Build failed in Jenkins: karaf-master » Apache Karaf :: Assemblies :: Minimal Distribution #3393
Posted by Apache Jenkins Server <je...@builds.apache.org>.
See <https://builds.apache.org/job/karaf-master/org.apache.karaf$apache-karaf-minimal/3393/>
------------------------------------------
[INFO]
[INFO] ------------------------------------------------------------------------
[INFO] Building Apache Karaf :: Assemblies :: Minimal Distribution 4.0.0-SNAPSHOT
[INFO] ------------------------------------------------------------------------
[INFO]
[INFO] --- maven-clean-plugin:2.5:clean (default-clean) @ apache-karaf-minimal ---
[INFO] Deleting <https://builds.apache.org/job/karaf-master/org.apache.karaf$apache-karaf-minimal/ws/target>
[INFO]
[INFO] --- maven-enforcer-plugin:1.3.1:enforce (enforce-maven) @ apache-karaf-minimal ---
[INFO]
[INFO] --- maven-bundle-plugin:2.5.4:cleanVersions (cleanVersions) @ apache-karaf-minimal ---
[INFO]
[INFO] --- maven-remote-resources-plugin:1.5:process (default) @ apache-karaf-minimal ---
[INFO]
[INFO] --- maven-resources-plugin:2.6:resources (process-resources) @ apache-karaf-minimal ---
[INFO] Using 'UTF-8' encoding to copy filtered resources.
[INFO] Copying 4 resources
[INFO]
[INFO] --- karaf-maven-plugin:4.0.0-SNAPSHOT:assembly (process-resources) @ apache-karaf-minimal ---
[INFO] Creating work directory
[INFO] Loading kar and features repositories dependencies
[INFO] Generating karaf assembly: <https://builds.apache.org/job/karaf-master/org.apache.karaf$apache-karaf-minimal/ws/target/assembly>
[INFO] Unzipping kars
[WARNING] Error resolving artifactorg.apache.karaf.features:framework:kar:4.0.0-SNAPSHOT:Could not find artifact org.apache.karaf.features:framework:kar:4.0.0-SNAPSHOT
shaded.org.eclipse.aether.resolution.ArtifactResolutionException: Could not find artifact org.apache.karaf.features:framework:kar:4.0.0-SNAPSHOT
at shaded.org.eclipse.aether.internal.impl.DefaultArtifactResolver.resolve(DefaultArtifactResolver.java:444)
at shaded.org.eclipse.aether.internal.impl.DefaultArtifactResolver.resolveArtifacts(DefaultArtifactResolver.java:246)
at shaded.org.eclipse.aether.internal.impl.DefaultArtifactResolver.resolveArtifact(DefaultArtifactResolver.java:223)
at shaded.org.eclipse.aether.internal.impl.DefaultRepositorySystem.resolveArtifact(DefaultRepositorySystem.java:294)
at org.ops4j.pax.url.mvn.internal.AetherBasedResolver.resolve(AetherBasedResolver.java:573)
at org.ops4j.pax.url.mvn.internal.AetherBasedResolver.resolve(AetherBasedResolver.java:528)
at org.ops4j.pax.url.mvn.internal.AetherBasedResolver.resolve(AetherBasedResolver.java:506)
at org.ops4j.pax.url.mvn.internal.AetherBasedResolver.resolve(AetherBasedResolver.java:481)
at org.apache.karaf.features.internal.download.impl.MavenDownloadTask.download(MavenDownloadTask.java:34)
at org.apache.karaf.features.internal.download.impl.AbstractRetryableDownloadTask.run(AbstractRetryableDownloadTask.java:58)
at java.util.concurrent.Executors$RunnableAdapter.call(Executors.java:471)
at java.util.concurrent.FutureTask$Sync.innerRun(FutureTask.java:334)
at java.util.concurrent.FutureTask.run(FutureTask.java:166)
at java.util.concurrent.ScheduledThreadPoolExecutor$ScheduledFutureTask.access$201(ScheduledThreadPoolExecutor.java:178)
at java.util.concurrent.ScheduledThreadPoolExecutor$ScheduledFutureTask.run(ScheduledThreadPoolExecutor.java:292)
at java.util.concurrent.ThreadPoolExecutor.runWorker(ThreadPoolExecutor.java:1145)
at java.util.concurrent.ThreadPoolExecutor$Worker.run(ThreadPoolExecutor.java:615)
at java.lang.Thread.run(Thread.java:724)
Caused by: shaded.org.eclipse.aether.transfer.ArtifactNotFoundException: Could not find artifact org.apache.karaf.features:framework:kar:4.0.0-SNAPSHOT
at shaded.org.eclipse.aether.internal.impl.DefaultArtifactResolver.resolve(DefaultArtifactResolver.java:434)
... 17 more
Build failed in Jenkins: karaf-master » Apache Karaf :: Assemblies :: Minimal Distribution #3392
Posted by Apache Jenkins Server <je...@builds.apache.org>.
See <https://builds.apache.org/job/karaf-master/org.apache.karaf$apache-karaf-minimal/3392/>
------------------------------------------
[INFO]
[INFO] ------------------------------------------------------------------------
[INFO] Building Apache Karaf :: Assemblies :: Minimal Distribution 4.0.0-SNAPSHOT
[INFO] ------------------------------------------------------------------------
[INFO]
[INFO] --- maven-clean-plugin:2.5:clean (default-clean) @ apache-karaf-minimal ---
[INFO]
[INFO] --- maven-enforcer-plugin:1.3.1:enforce (enforce-maven) @ apache-karaf-minimal ---
[INFO]
[INFO] --- maven-bundle-plugin:2.5.4:cleanVersions (cleanVersions) @ apache-karaf-minimal ---
[INFO]
[INFO] --- maven-remote-resources-plugin:1.5:process (default) @ apache-karaf-minimal ---
[INFO]
[INFO] --- maven-resources-plugin:2.6:resources (process-resources) @ apache-karaf-minimal ---
[INFO] Using 'UTF-8' encoding to copy filtered resources.
[INFO] Copying 4 resources
[INFO]
[INFO] --- karaf-maven-plugin:4.0.0-SNAPSHOT:assembly (process-resources) @ apache-karaf-minimal ---
[INFO] Creating work directory
[INFO] Loading kar and features repositories dependencies
[INFO] Generating karaf assembly: <https://builds.apache.org/job/karaf-master/org.apache.karaf$apache-karaf-minimal/ws/target/assembly>
[INFO] Unzipping kars
[WARNING] Error resolving artifactorg.apache.karaf.features:framework:kar:4.0.0-SNAPSHOT:Could not find artifact org.apache.karaf.features:framework:kar:4.0.0-SNAPSHOT
shaded.org.eclipse.aether.resolution.ArtifactResolutionException: Could not find artifact org.apache.karaf.features:framework:kar:4.0.0-SNAPSHOT
at shaded.org.eclipse.aether.internal.impl.DefaultArtifactResolver.resolve(DefaultArtifactResolver.java:444)
at shaded.org.eclipse.aether.internal.impl.DefaultArtifactResolver.resolveArtifacts(DefaultArtifactResolver.java:246)
at shaded.org.eclipse.aether.internal.impl.DefaultArtifactResolver.resolveArtifact(DefaultArtifactResolver.java:223)
at shaded.org.eclipse.aether.internal.impl.DefaultRepositorySystem.resolveArtifact(DefaultRepositorySystem.java:294)
at org.ops4j.pax.url.mvn.internal.AetherBasedResolver.resolve(AetherBasedResolver.java:573)
at org.ops4j.pax.url.mvn.internal.AetherBasedResolver.resolve(AetherBasedResolver.java:528)
at org.ops4j.pax.url.mvn.internal.AetherBasedResolver.resolve(AetherBasedResolver.java:506)
at org.ops4j.pax.url.mvn.internal.AetherBasedResolver.resolve(AetherBasedResolver.java:481)
at org.apache.karaf.features.internal.download.impl.MavenDownloadTask.download(MavenDownloadTask.java:34)
at org.apache.karaf.features.internal.download.impl.AbstractRetryableDownloadTask.run(AbstractRetryableDownloadTask.java:58)
at java.util.concurrent.Executors$RunnableAdapter.call(Executors.java:471)
at java.util.concurrent.FutureTask$Sync.innerRun(FutureTask.java:334)
at java.util.concurrent.FutureTask.run(FutureTask.java:166)
at java.util.concurrent.ScheduledThreadPoolExecutor$ScheduledFutureTask.access$201(ScheduledThreadPoolExecutor.java:178)
at java.util.concurrent.ScheduledThreadPoolExecutor$ScheduledFutureTask.run(ScheduledThreadPoolExecutor.java:292)
at java.util.concurrent.ThreadPoolExecutor.runWorker(ThreadPoolExecutor.java:1145)
at java.util.concurrent.ThreadPoolExecutor$Worker.run(ThreadPoolExecutor.java:615)
at java.lang.Thread.run(Thread.java:724)
Caused by: shaded.org.eclipse.aether.transfer.ArtifactNotFoundException: Could not find artifact org.apache.karaf.features:framework:kar:4.0.0-SNAPSHOT
at shaded.org.eclipse.aether.internal.impl.DefaultArtifactResolver.resolve(DefaultArtifactResolver.java:434)
... 17 more
Build failed in Jenkins: karaf-master » Apache Karaf :: Assemblies :: Minimal Distribution #3391
Posted by Apache Jenkins Server <je...@builds.apache.org>.
See <https://builds.apache.org/job/karaf-master/org.apache.karaf$apache-karaf-minimal/3391/>
------------------------------------------
[INFO]
[INFO] ------------------------------------------------------------------------
[INFO] Building Apache Karaf :: Assemblies :: Minimal Distribution 4.0.0-SNAPSHOT
[INFO] ------------------------------------------------------------------------
[INFO]
[INFO] --- maven-clean-plugin:2.5:clean (default-clean) @ apache-karaf-minimal ---
[INFO]
[INFO] --- maven-enforcer-plugin:1.3.1:enforce (enforce-maven) @ apache-karaf-minimal ---
[INFO]
[INFO] --- maven-bundle-plugin:2.5.4:cleanVersions (cleanVersions) @ apache-karaf-minimal ---
[INFO]
[INFO] --- maven-remote-resources-plugin:1.5:process (default) @ apache-karaf-minimal ---
[INFO]
[INFO] --- maven-resources-plugin:2.6:resources (process-resources) @ apache-karaf-minimal ---
[INFO] Using 'UTF-8' encoding to copy filtered resources.
[INFO] Copying 4 resources
[INFO]
[INFO] --- karaf-maven-plugin:4.0.0-SNAPSHOT:assembly (process-resources) @ apache-karaf-minimal ---
[INFO] Creating work directory
[INFO] Loading kar and features repositories dependencies
[INFO] Generating karaf assembly: <https://builds.apache.org/job/karaf-master/org.apache.karaf$apache-karaf-minimal/ws/target/assembly>
[INFO] Unzipping kars
[WARNING] Error resolving artifactorg.apache.karaf.features:framework:kar:4.0.0-SNAPSHOT:Could not find artifact org.apache.karaf.features:framework:kar:4.0.0-SNAPSHOT
shaded.org.eclipse.aether.resolution.ArtifactResolutionException: Could not find artifact org.apache.karaf.features:framework:kar:4.0.0-SNAPSHOT
at shaded.org.eclipse.aether.internal.impl.DefaultArtifactResolver.resolve(DefaultArtifactResolver.java:444)
at shaded.org.eclipse.aether.internal.impl.DefaultArtifactResolver.resolveArtifacts(DefaultArtifactResolver.java:246)
at shaded.org.eclipse.aether.internal.impl.DefaultArtifactResolver.resolveArtifact(DefaultArtifactResolver.java:223)
at shaded.org.eclipse.aether.internal.impl.DefaultRepositorySystem.resolveArtifact(DefaultRepositorySystem.java:294)
at org.ops4j.pax.url.mvn.internal.AetherBasedResolver.resolve(AetherBasedResolver.java:573)
at org.ops4j.pax.url.mvn.internal.AetherBasedResolver.resolve(AetherBasedResolver.java:528)
at org.ops4j.pax.url.mvn.internal.AetherBasedResolver.resolve(AetherBasedResolver.java:506)
at org.ops4j.pax.url.mvn.internal.AetherBasedResolver.resolve(AetherBasedResolver.java:481)
at org.apache.karaf.features.internal.download.impl.MavenDownloadTask.download(MavenDownloadTask.java:34)
at org.apache.karaf.features.internal.download.impl.AbstractRetryableDownloadTask.run(AbstractRetryableDownloadTask.java:58)
at java.util.concurrent.Executors$RunnableAdapter.call(Executors.java:471)
at java.util.concurrent.FutureTask$Sync.innerRun(FutureTask.java:334)
at java.util.concurrent.FutureTask.run(FutureTask.java:166)
at java.util.concurrent.ScheduledThreadPoolExecutor$ScheduledFutureTask.access$201(ScheduledThreadPoolExecutor.java:178)
at java.util.concurrent.ScheduledThreadPoolExecutor$ScheduledFutureTask.run(ScheduledThreadPoolExecutor.java:292)
at java.util.concurrent.ThreadPoolExecutor.runWorker(ThreadPoolExecutor.java:1145)
at java.util.concurrent.ThreadPoolExecutor$Worker.run(ThreadPoolExecutor.java:615)
at java.lang.Thread.run(Thread.java:724)
Caused by: shaded.org.eclipse.aether.transfer.ArtifactNotFoundException: Could not find artifact org.apache.karaf.features:framework:kar:4.0.0-SNAPSHOT
at shaded.org.eclipse.aether.internal.impl.DefaultArtifactResolver.resolve(DefaultArtifactResolver.java:434)
... 17 more