You are viewing a plain text version of this content. The canonical link for it is here.
Posted to builds@mesos.apache.org by Apache Jenkins Server <je...@builds.apache.org> on 2019/02/26 04:25:13 UTC
Branch: origin/1.6.x Mesos-Buildbot - Build # 6165 - Still Failing
Branch: origin/1.6.x
The Apache Jenkins build system has built Mesos-Buildbot (build #6165)
Status: Still Failing
Check console output at https://builds.apache.org/job/Mesos-Buildbot/6165/ to view the results.
All tests passed
Branch: origin/master Mesos-Buildbot - Build # 6180 - Still Failing
Posted by Apache Jenkins Server <je...@builds.apache.org>.
Branch: origin/master
The Apache Jenkins build system has built Mesos-Buildbot (build #6180)
Status: Still Failing
Check console output at https://builds.apache.org/job/Mesos-Buildbot/6180/ to view the results.
1 tests failed.
FAILED: StorageLocalResourceProviderTest.RetryOperationStatusUpdateToScheduler
Error Message:
/tmp/SRC/src/tests/storage_local_resource_provider_tests.cpp:4486
Failed to wait 1mins for offers
Stack Trace:
/tmp/SRC/src/tests/storage_local_resource_provider_tests.cpp:4486
Failed to wait 1mins for offers
Branch: origin/master Mesos-Buildbot - Build # 6179 - Still Failing
Posted by Apache Jenkins Server <je...@builds.apache.org>.
Branch: origin/master
The Apache Jenkins build system has built Mesos-Buildbot (build #6179)
Status: Still Failing
Check console output at https://builds.apache.org/job/Mesos-Buildbot/6179/ to view the results.
All tests passed
Branch: origin/master Mesos-Buildbot - Build # 6178 - Still Failing
Posted by Apache Jenkins Server <je...@builds.apache.org>.
Branch: origin/master
The Apache Jenkins build system has built Mesos-Buildbot (build #6178)
Status: Still Failing
Check console output at https://builds.apache.org/job/Mesos-Buildbot/6178/ to view the results.
1 tests failed.
FAILED: ExamplesTest.DynamicReservationFramework
Error Message:
../../src/tests/script.cpp:86
Failed
dynamic_reservation_framework_test.sh terminated with signal Aborted (core dumped)
Stack Trace:
../../src/tests/script.cpp:86
Failed
dynamic_reservation_framework_test.sh terminated with signal Aborted (core dumped)
Branch: origin/master Mesos-Buildbot - Build # 6177 - Still Failing
Posted by Apache Jenkins Server <je...@builds.apache.org>.
Branch: origin/master
The Apache Jenkins build system has built Mesos-Buildbot (build #6177)
Status: Still Failing
Check console output at https://builds.apache.org/job/Mesos-Buildbot/6177/ to view the results.
1 tests failed.
FAILED: ExamplesTest.DynamicReservationFramework
Error Message:
../../../src/tests/script.cpp:86
Failed
dynamic_reservation_framework_test.sh terminated with signal Aborted (core dumped)
Stack Trace:
../../../src/tests/script.cpp:86
Failed
dynamic_reservation_framework_test.sh terminated with signal Aborted (core dumped)
Branch: origin/master Mesos-Buildbot - Build # 6176 - Still Failing
Posted by Apache Jenkins Server <je...@builds.apache.org>.
Branch: origin/master
The Apache Jenkins build system has built Mesos-Buildbot (build #6176)
Status: Still Failing
Check console output at https://builds.apache.org/job/Mesos-Buildbot/6176/ to view the results.
1 tests failed.
FAILED: ExamplesTest.DynamicReservationFramework
Error Message:
/tmp/SRC/src/tests/script.cpp:86
Failed
dynamic_reservation_framework_test.sh terminated with signal Aborted (core dumped)
Stack Trace:
/tmp/SRC/src/tests/script.cpp:86
Failed
dynamic_reservation_framework_test.sh terminated with signal Aborted (core dumped)
Branch: origin/master Mesos-Buildbot - Build # 6174 - Still Failing
Posted by Apache Jenkins Server <je...@builds.apache.org>.
Branch: origin/master
The Apache Jenkins build system has built Mesos-Buildbot (build #6174)
Status: Still Failing
Check console output at https://builds.apache.org/job/Mesos-Buildbot/6174/ to view the results.
1 tests failed.
FAILED: StorageLocalResourceProviderTest.RetryRpcWithExponentialBackoff
Error Message:
/tmp/SRC/src/tests/storage_local_resource_provider_tests.cpp:5027
Failed to wait 1mins for offers
Stack Trace:
/tmp/SRC/src/tests/storage_local_resource_provider_tests.cpp:5027
Failed to wait 1mins for offers
Branch: origin/master Mesos-Buildbot - Build # 6173 - Still Failing
Posted by Apache Jenkins Server <je...@builds.apache.org>.
Branch: origin/master
The Apache Jenkins build system has built Mesos-Buildbot (build #6173)
Status: Still Failing
Check console output at https://builds.apache.org/job/Mesos-Buildbot/6173/ to view the results.
1 tests failed.
FAILED: StorageLocalResourceProviderTest.RetryRpcWithExponentialBackoff
Error Message:
/tmp/SRC/src/tests/storage_local_resource_provider_tests.cpp:5027
Failed to wait 1mins for offers
Stack Trace:
/tmp/SRC/src/tests/storage_local_resource_provider_tests.cpp:5027
Failed to wait 1mins for offers
Branch: origin/master Mesos-Buildbot - Build # 6172 - Still Failing
Posted by Apache Jenkins Server <je...@builds.apache.org>.
Branch: origin/master
The Apache Jenkins build system has built Mesos-Buildbot (build #6172)
Status: Still Failing
Check console output at https://builds.apache.org/job/Mesos-Buildbot/6172/ to view the results.
1 tests failed.
FAILED: ExamplesTest.DynamicReservationFramework
Error Message:
/tmp/SRC/src/tests/script.cpp:86
Failed
dynamic_reservation_framework_test.sh terminated with signal Aborted (core dumped)
Stack Trace:
/tmp/SRC/src/tests/script.cpp:86
Failed
dynamic_reservation_framework_test.sh terminated with signal Aborted (core dumped)
Branch: origin/master Mesos-Buildbot - Build # 6171 - Still Failing
Posted by Apache Jenkins Server <je...@builds.apache.org>.
Branch: origin/master
The Apache Jenkins build system has built Mesos-Buildbot (build #6171)
Status: Still Failing
Check console output at https://builds.apache.org/job/Mesos-Buildbot/6171/ to view the results.
1 tests failed.
FAILED: StorageLocalResourceProviderTest.RetryRpcWithExponentialBackoff
Error Message:
../../src/tests/storage_local_resource_provider_tests.cpp:5027
Failed to wait 1mins for offers
Stack Trace:
../../src/tests/storage_local_resource_provider_tests.cpp:5027
Failed to wait 1mins for offers
Branch: origin/master Mesos-Buildbot - Build # 6170 - Still Failing
Posted by Apache Jenkins Server <je...@builds.apache.org>.
Branch: origin/master
The Apache Jenkins build system has built Mesos-Buildbot (build #6170)
Status: Still Failing
Check console output at https://builds.apache.org/job/Mesos-Buildbot/6170/ to view the results.
2 tests failed.
FAILED: ExamplesTest.DynamicReservationFramework
Error Message:
/tmp/SRC/src/tests/script.cpp:86
Failed
dynamic_reservation_framework_test.sh terminated with signal Aborted (core dumped)
Stack Trace:
/tmp/SRC/src/tests/script.cpp:86
Failed
dynamic_reservation_framework_test.sh terminated with signal Aborted (core dumped)
FAILED: ExamplesTest.DynamicReservationFramework
Error Message:
../../../src/tests/script.cpp:86
Failed
dynamic_reservation_framework_test.sh terminated with signal Aborted (core dumped)
Stack Trace:
../../../src/tests/script.cpp:86
Failed
dynamic_reservation_framework_test.sh terminated with signal Aborted (core dumped)
Branch: origin/master Mesos-Buildbot - Build # 6169 - Still Failing
Posted by Apache Jenkins Server <je...@builds.apache.org>.
Branch: origin/master
The Apache Jenkins build system has built Mesos-Buildbot (build #6169)
Status: Still Failing
Check console output at https://builds.apache.org/job/Mesos-Buildbot/6169/ to view the results.
1 tests failed.
FAILED: CommandExecutorCheckTest.HTTPCheckDelivered
Error Message:
/tmp/SRC/src/tests/check_tests.cpp:1139
Expected: v1::TASK_RUNNING
Which is: TASK_RUNNING
To be equal to: checkResult.state()
Which is: TASK_FAILED
Stack Trace:
/tmp/SRC/src/tests/check_tests.cpp:1139
Expected: v1::TASK_RUNNING
Which is: TASK_RUNNING
To be equal to: checkResult.state()
Which is: TASK_FAILED
Branch: origin/1.7.x Mesos-Buildbot - Build # 6168 - Still Failing
Posted by Apache Jenkins Server <je...@builds.apache.org>.
Branch: origin/1.7.x
The Apache Jenkins build system has built Mesos-Buildbot (build #6168)
Status: Still Failing
Check console output at https://builds.apache.org/job/Mesos-Buildbot/6168/ to view the results.
All tests passed
Branch: origin/1.7.x Mesos-Buildbot - Build # 6167 - Still Failing
Posted by Apache Jenkins Server <je...@builds.apache.org>.
Branch: origin/1.7.x
The Apache Jenkins build system has built Mesos-Buildbot (build #6167)
Status: Still Failing
Check console output at https://builds.apache.org/job/Mesos-Buildbot/6167/ to view the results.
1 tests failed.
FAILED: MasterTest.CreateVolumesV1AuthorizationFailure
Error Message:
../../src/tests/master_tests.cpp:10129
Mock function called more times than expected - returning default value.
Function call: authorized(@0x7fa2b9066108 48-byte object <98-19 47-D1 A2-7F 00-00 00-00 00-00 00-00 00-00 07-00 00-00 00-00 00-00 40-AF 01-78 A2-7F 00-00 40-92 00-78 A2-7F 00-00 04-00 00-00 A2-7F 00-00>)
Returns: Abandoned
Expected: to be called once
Actual: called twice - over-saturated and active
Stack Trace:
../../src/tests/master_tests.cpp:10129
Mock function called more times than expected - returning default value.
Function call: authorized(@0x7fa2b9066108 48-byte object <98-19 47-D1 A2-7F 00-00 00-00 00-00 00-00 00-00 07-00 00-00 00-00 00-00 40-AF 01-78 A2-7F 00-00 40-92 00-78 A2-7F 00-00 04-00 00-00 A2-7F 00-00>)
Returns: Abandoned
Expected: to be called once
Actual: called twice - over-saturated and active
Branch: origin/master Mesos-Buildbot - Build # 6166 - Still Failing
Posted by Apache Jenkins Server <je...@builds.apache.org>.
Branch: origin/master
The Apache Jenkins build system has built Mesos-Buildbot (build #6166)
Status: Still Failing
Check console output at https://builds.apache.org/job/Mesos-Buildbot/6166/ to view the results.
4 tests failed.
FAILED: DiskQuotaTest.SlaveRecovery
Error Message:
/tmp/SRC/src/tests/disk_quota_tests.cpp:746
Value of: usage->has_disk_limit_bytes()
Actual: false
Expected: true
Stack Trace:
/tmp/SRC/src/tests/disk_quota_tests.cpp:746
Value of: usage->has_disk_limit_bytes()
Actual: false
Expected: true
FAILED: ExamplesTest.DynamicReservationFramework
Error Message:
/tmp/SRC/src/tests/script.cpp:86
Failed
dynamic_reservation_framework_test.sh terminated with signal Aborted (core dumped)
Stack Trace:
/tmp/SRC/src/tests/script.cpp:86
Failed
dynamic_reservation_framework_test.sh terminated with signal Aborted (core dumped)
FAILED: ExamplesTest.DynamicReservationFramework
Error Message:
../../src/tests/script.cpp:86
Failed
dynamic_reservation_framework_test.sh terminated with signal Aborted (core dumped)
Stack Trace:
../../src/tests/script.cpp:86
Failed
dynamic_reservation_framework_test.sh terminated with signal Aborted (core dumped)
FAILED: ExamplesTest.DynamicReservationFramework
Error Message:
/tmp/SRC/src/tests/script.cpp:86
Failed
dynamic_reservation_framework_test.sh terminated with signal Aborted (core dumped)
Stack Trace:
/tmp/SRC/src/tests/script.cpp:86
Failed
dynamic_reservation_framework_test.sh terminated with signal Aborted (core dumped)