You are viewing a plain text version of this content. The canonical link for it is here.
Posted to notifications@qpid.apache.org by Apache Jenkins Server <je...@builds.apache.org> on 2012/03/12 02:09:37 UTC

Build failed in Jenkins: Qpid-Java-Java-TestMatrix » JDK 1.6 (latest),Ubuntu,java-mms.0-10 #488

See <https://builds.apache.org/job/Qpid-Java-Java-TestMatrix/./jdk=JDK%201.6%20(latest),label=Ubuntu,profile=java-mms.0-10/488/>

------------------------------------------
[...truncated 2208 lines...]
    [junit]     <property name="broker.libs" value="lib/commons-cli-1.0.jar lib/commons-logging-1.0.4.jar lib/log4j-1.2.12.jar lib/slf4j-log4j12-1.6.1.jar lib/xalan-2.7.0.jar lib/org.apache.felix.main-2.0.5.jar lib/derby-10.6.1.0.jar lib/commons-beanutils-core-1.8.0.jar lib/commons-digester-1.8.1.jar lib/commons-codec-1.3.jar lib/commons-lang-2.2.jar lib/commons-collections-3.2.jar lib/commons-configuration-1.6.jar" />
    [junit]     <property name="preload.broker.command" value="build/bin/qpid-server -p @PORT -m @MPORT -c @CONFIG_FILE -l test-profiles/log4j-test.xml" />
    [junit]     <property name="broker.existing.qpid.work" value="" />
    [junit]     <property name="ecl-swt-win32-win32-x86" value="lib/org.eclipse.swt.win32.win32.x86_3.4.1.v3449c.jar" />
    [junit]     <property name="user.language" value="en" />
    [junit]     <property name="module.libs" value="lib/slf4j-log4j12-1.6.1.jar lib/log4j-1.2.12.jar lib/junit-3.8.1.jar lib/slf4j-api-1.6.1.jar" />
    [junit]     <property name="build.findbugs" value="<https://builds.apache.org/job/Qpid-Java-Java-TestMatrix/./jdk=JDK%201.6%20(latest),label=Ubuntu,profile=java-mms.0-10/ws/trunk/qpid/java/build/findbugs"> />
    [junit]     <property name="preload.include" value="" />
    [junit]     <property name="module.test.depends" value="" />
    [junit]     <property name="ant.project.invoked-targets" value="test" />
    [junit]     <property name="ecl-core-runtime-compat-registry" value="lib/org.eclipse.core.runtime.compatibility.registry_3.2.200.v20080610/**" />
    [junit]     <property name="ecl-core-databinding" value="lib/org.eclipse.core.databinding_1.1.1.M20080827-0800b.jar" />
    [junit]     <property name="ecl-swt-linux-gtk-x86" value="lib/org.eclipse.swt.gtk.linux.x86_3.4.1.v3449c.jar" />
    [junit]     <property name="java.class.version" value="50.0" />
    [junit]     <property name="cobertura.temp.dir" value="<https://builds.apache.org/job/Qpid-Java-Java-TestMatrix/./jdk=JDK%201.6%20(latest),label=Ubuntu,profile=java-mms.0-10/ws/trunk/qpid/java/lib/cobertura"> />
    [junit]     <property name="ant.file.type.AMQ Java" value="file" />
    [junit]     <property name="profile.clustered" value="false" />
    [junit]     <property name="broker.persistent" value="false" />
    [junit]     <property name="ant.file.AMQ Java" value="<https://builds.apache.org/job/Qpid-Java-Java-TestMatrix/./jdk=JDK%201.6%20(latest),label=Ubuntu,profile=java-mms.0-10/ws/trunk/qpid/java/build.xml"> />
    [junit]     <property name="broker.log.prefix" value="BROKER: " />
    [junit]     <property name="module.test.libs.includes" value="${systests.test.libs}" />
    [junit]     <property name="maven.snapshot" value="true" />
    [junit]     <property name="commons-codec" value="lib/commons-codec-1.3.jar" />
    [junit]     <property name="project.version" value="0.17" />
    [junit]     <property name="file.encoding.pkg" value="sun.io" />
    [junit]     <property name="sun.cpu.endian" value="little" />
    [junit]     <property name="cobertura.download.url" value="http://downloads.sourceforge.net/project/cobertura/cobertura/1.9.4.1/cobertura-1.9.4.1-bin.zip" />
    [junit]     <property name="module.test.src.exists" value="true" />
    [junit]     <property name="ecl-equinox-launcher-solaris-gtk-sparc" value="lib/org.eclipse.equinox.launcher.gtk.solaris.sparc_1.0.101.R34x_v20080731/**" />
    [junit]     <property name="commons-lang" value="lib/commons-lang-2.2.jar" />
    [junit]     <property name="management-eclipse-plugin-macosx.libs" value="lib/com.ibm.icu_3.8.1.v20080530.jar lib/org.eclipse.jface_3.4.1.M20080827-2000.jar lib/org.eclipse.jface.databinding_1.2.1.M20080827-0800a.jar lib/org.eclipse.core.commands_3.4.0.I20080509-2000.jar lib/org.eclipse.core.contenttype_3.3.0.v20080604-1400.jar lib/org.eclipse.core.databinding_1.1.1.M20080827-0800b.jar lib/org.eclipse.core.expressions_3.4.0.v20080603-2000.jar lib/org.eclipse.core.jobs_3.4.0.v20080512.jar lib/org.eclipse.core.runtime_3.4.0.v20080512.jar lib/org.eclipse.equinox.app_1.1.0.v20080421-2006.jar lib/org.eclipse.equinox.common_3.4.0.v20080421-2006.jar lib/org.eclipse.equinox.launcher_1.0.101.R34x_v20080819.jar lib/org.eclipse.equinox.preferences_3.2.201.R34x_v20080709.jar lib/org.eclipse.equinox.registry_3.4.0.v20080516-0950.jar lib/org.eclipse.help_3.3.101.v20080702_34x.jar lib/org.eclipse.osgi_3.4.2.R34x_v20080826-1230.jar lib/org.eclipse.swt_3.4.1.v3449c.jar lib/org.eclipse.ui_3.4.1.M20080910-0800.jar lib/org.eclipse.ui.forms_3.3.101.v20080708_34x.jar lib/org.eclipse.ui.workbench_3.4.1.M20080827-0800a.jar lib/org.apache.commons.codec_1.3.0.v20080530-1600.jar lib/org.eclipse.swt.carbon.macosx_3.4.1.v3449c.jar lib/org.eclipse.equinox.launcher.carbon.macosx_1.0.101.R34x_v20080731/** lib/org.eclipse.core.runtime.compatibility.registry_3.2.200.v20080610/**" />
    [junit]     <property name="management-eclipse-plugin-linux-gtk-x86.libs" value="lib/com.ibm.icu_3.8.1.v20080530.jar lib/org.eclipse.jface_3.4.1.M20080827-2000.jar lib/org.eclipse.jface.databinding_1.2.1.M20080827-0800a.jar lib/org.eclipse.core.commands_3.4.0.I20080509-2000.jar lib/org.eclipse.core.contenttype_3.3.0.v20080604-1400.jar lib/org.eclipse.core.databinding_1.1.1.M20080827-0800b.jar lib/org.eclipse.core.expressions_3.4.0.v20080603-2000.jar lib/org.eclipse.core.jobs_3.4.0.v20080512.jar lib/org.eclipse.core.runtime_3.4.0.v20080512.jar lib/org.eclipse.equinox.app_1.1.0.v20080421-2006.jar lib/org.eclipse.equinox.common_3.4.0.v20080421-2006.jar lib/org.eclipse.equinox.launcher_1.0.101.R34x_v20080819.jar lib/org.eclipse.equinox.preferences_3.2.201.R34x_v20080709.jar lib/org.eclipse.equinox.registry_3.4.0.v20080516-0950.jar lib/org.eclipse.help_3.3.101.v20080702_34x.jar lib/org.eclipse.osgi_3.4.2.R34x_v20080826-1230.jar lib/org.eclipse.swt_3.4.1.v3449c.jar lib/org.eclipse.ui_3.4.1.M20080910-0800.jar lib/org.eclipse.ui.forms_3.3.101.v20080708_34x.jar lib/org.eclipse.ui.workbench_3.4.1.M20080827-0800a.jar lib/org.apache.commons.codec_1.3.0.v20080530-1600.jar lib/org.eclipse.swt.gtk.linux.x86_3.4.1.v3449c.jar lib/org.eclipse.equinox.launcher.gtk.linux.x86_1.0.101.R34x_v20080805/** lib/org.eclipse.core.runtime.compatibility.registry_3.2.200.v20080610/**" />
    [junit]     <property name="ecl-equinox-launcher-macosx-carbon" value="lib/org.eclipse.equinox.launcher.carbon.macosx_1.0.101.R34x_v20080731/**" />
    [junit]     <property name="tasks.classes" value="<https://builds.apache.org/job/Qpid-Java-Java-TestMatrix/./jdk=JDK%201.6%20(latest),label=Ubuntu,profile=java-mms.0-10/ws/trunk/qpid/java/tasks/classes"> />
    [junit]     <property name="java.home" value="/home/jenkins/tools/java/jdk1.6.0_27-32/jre" />
    [junit]     <property name="management-eclipse-plugin-solaris-gtk-sparc.libs" value="lib/com.ibm.icu_3.8.1.v20080530.jar lib/org.eclipse.jface_3.4.1.M20080827-2000.jar lib/org.eclipse.jface.databinding_1.2.1.M20080827-0800a.jar lib/org.eclipse.core.commands_3.4.0.I20080509-2000.jar lib/org.eclipse.core.contenttype_3.3.0.v20080604-1400.jar lib/org.eclipse.core.databinding_1.1.1.M20080827-0800b.jar lib/org.eclipse.core.expressions_3.4.0.v20080603-2000.jar lib/org.eclipse.core.jobs_3.4.0.v20080512.jar lib/org.eclipse.core.runtime_3.4.0.v20080512.jar lib/org.eclipse.equinox.app_1.1.0.v20080421-2006.jar lib/org.eclipse.equinox.common_3.4.0.v20080421-2006.jar lib/org.eclipse.equinox.launcher_1.0.101.R34x_v20080819.jar lib/org.eclipse.equinox.preferences_3.2.201.R34x_v20080709.jar lib/org.eclipse.equinox.registry_3.4.0.v20080516-0950.jar lib/org.eclipse.help_3.3.101.v20080702_34x.jar lib/org.eclipse.osgi_3.4.2.R34x_v20080826-1230.jar lib/org.eclipse.swt_3.4.1.v3449c.jar lib/org.eclipse.ui_3.4.1.M20080910-0800.jar lib/org.eclipse.ui.forms_3.3.101.v20080708_34x.jar lib/org.eclipse.ui.workbench_3.4.1.M20080827-0800a.jar lib/org.apache.commons.codec_1.3.0.v20080530-1600.jar lib/org.eclipse.swt.gtk.solaris.sparc_3.4.1.v3449c.jar lib/org.eclipse.equinox.launcher.gtk.solaris.sparc_1.0.101.R34x_v20080731/** lib/org.eclipse.core.runtime.compatibility.registry_3.2.200.v20080610/**" />
    [junit]     <property name="module.depends.path" value="<https://builds.apache.org/job/Qpid-Java-Java-TestMatrix/./jdk=JDK%201.6%20(latest),label=Ubuntu,profile=java-mms.0-10/ws/trunk/qpid/java/build/scratch/client/classes>:<https://builds.apache.org/job/Qpid-Java-Java-TestMatrix/./jdk=JDK%201.6%20(latest),label=Ubuntu,profile=java-mms.0-10/ws/trunk/qpid/java/build/scratch/management/common/classes>:<https://builds.apache.org/job/Qpid-Java-Java-TestMatrix/./jdk=JDK%201.6%20(latest),label=Ubuntu,profile=java-mms.0-10/ws/trunk/qpid/java/build/scratch/broker/classes>:<https://builds.apache.org/job/Qpid-Java-Java-TestMatrix/./jdk=JDK%201.6%20(latest),label=Ubuntu,profile=java-mms.0-10/ws/trunk/qpid/java/build/scratch/broker/test/classes>:<https://builds.apache.org/job/Qpid-Java-Java-TestMatrix/./jdk=JDK%201.6%20(latest),label=Ubuntu,profile=java-mms.0-10/ws/trunk/qpid/java/build/scratch/common/classes>:<https://builds.apache.org/job/Qpid-Java-Java-TestMatrix/./jdk=JDK%201.6%20(latest),label=Ubuntu,profile=java-mms.0-10/ws/trunk/qpid/java/build/scratch/common/test/classes>:<https://builds.apache.org/job/Qpid-Java-Java-TestMatrix/./jdk=JDK%201.6%20(latest),label=Ubuntu,profile=java-mms.0-10/ws/trunk/qpid/java/build/scratch/junit-toolkit/classes>:<https://builds.apache.org/job/Qpid-Java-Java-TestMatrix/./jdk=JDK%201.6%20(latest),label=Ubuntu,profile=java-mms.0-10/ws/trunk/qpid/java/build/scratch/jca/classes"> />
    [junit]     <property name="module.coverage" value="<https://builds.apache.org/job/Qpid-Java-Java-TestMatrix/./jdk=JDK%201.6%20(latest),label=Ubuntu,profile=java-mms.0-10/ws/trunk/qpid/java/build/scratch/systests/coverage"> />
    [junit]     <property name="module.test.api" value="<https://builds.apache.org/job/Qpid-Java-Java-TestMatrix/./jdk=JDK%201.6%20(latest),label=Ubuntu,profile=java-mms.0-10/ws/trunk/qpid/java/build/test-api/systests"> />
    [junit]     <property name="ecl-help" value="lib/org.eclipse.help_3.3.101.v20080702_34x.jar" />
    [junit]     <property name="module.release.zip" value="<https://builds.apache.org/job/Qpid-Java-Java-TestMatrix/./jdk=JDK%201.6%20(latest),label=Ubuntu,profile=java-mms.0-10/ws/trunk/qpid/java/systests/release/qpid-systests-0.17.zip"> />
    [junit]     <property name="ant.project.default-target" value="build" />
    [junit]     <property name="build.test.api" value="<https://builds.apache.org/job/Qpid-Java-Java-TestMatrix/./jdk=JDK%201.6%20(latest),label=Ubuntu,profile=java-mms.0-10/ws/trunk/qpid/java/build/test-api"> />
    [junit]     <property name="amqj.server.logging.level" value="debug" />
    [junit]     <property name="build.api" value="<https://builds.apache.org/job/Qpid-Java-Java-TestMatrix/./jdk=JDK%201.6%20(latest),label=Ubuntu,profile=java-mms.0-10/ws/trunk/qpid/java/build/api"> />
    [junit]     <property name="cobertura.zip.filename" value="cobertura-1.9.4.1-bin.zip" />
    [junit]     <property name="geronimo-jms" value="lib/geronimo-jms_1.1_spec-1.0.jar" />
    [junit]     <property name="build.results" value="<https://builds.apache.org/job/Qpid-Java-Java-TestMatrix/./jdk=JDK%201.6%20(latest),label=Ubuntu,profile=java-mms.0-10/ws/trunk/qpid/java/build/results"> />
    [junit]     <property name="management-eclipse-plugin-linux-gtk-x86_64.libs" value="lib/com.ibm.icu_3.8.1.v20080530.jar lib/org.eclipse.jface_3.4.1.M20080827-2000.jar lib/org.eclipse.jface.databinding_1.2.1.M20080827-0800a.jar lib/org.eclipse.core.commands_3.4.0.I20080509-2000.jar lib/org.eclipse.core.contenttype_3.3.0.v20080604-1400.jar lib/org.eclipse.core.databinding_1.1.1.M20080827-0800b.jar lib/org.eclipse.core.expressions_3.4.0.v20080603-2000.jar lib/org.eclipse.core.jobs_3.4.0.v20080512.jar lib/org.eclipse.core.runtime_3.4.0.v20080512.jar lib/org.eclipse.equinox.app_1.1.0.v20080421-2006.jar lib/org.eclipse.equinox.common_3.4.0.v20080421-2006.jar lib/org.eclipse.equinox.launcher_1.0.101.R34x_v20080819.jar lib/org.eclipse.equinox.preferences_3.2.201.R34x_v20080709.jar lib/org.eclipse.equinox.registry_3.4.0.v20080516-0950.jar lib/org.eclipse.help_3.3.101.v20080702_34x.jar lib/org.eclipse.osgi_3.4.2.R34x_v20080826-1230.jar lib/org.eclipse.swt_3.4.1.v3449c.jar lib/org.eclipse.ui_3.4.1.M20080910-0800.jar lib/org.eclipse.ui.forms_3.3.101.v20080708_34x.jar lib/org.eclipse.ui.workbench_3.4.1.M20080827-0800a.jar lib/org.apache.commons.codec_1.3.0.v20080530-1600.jar lib/org.eclipse.swt.gtk.linux.x86_64_3.4.1.v3449c.jar lib/org.eclipse.equinox.launcher.gtk.linux.x86_64_1.0.101.R34x_v20080731/** lib/org.eclipse.core.runtime.compatibility.registry_3.2.200.v20080610/**" />
    [junit]     <property name="eclipse.updatealways" value="false" />
    [junit]     <property name="jca.libs" value="lib/geronimo-j2ee-connector_1.5_spec-2.0.0.jar lib/geronimo-jta_1.1_spec-1.1.1.jar lib/geronimo-jms_1.1_spec-1.0.jar lib/slf4j-log4j12-1.6.1.jar lib/log4j-1.2.12.jar lib/junit-3.8.1.jar lib/slf4j-api-1.6.1.jar lib/geronimo-kernel-2.2.1.jar lib/geronimo-ejb_3.0_spec-1.0.1.jar" />
    [junit]     <property name="build.bin" value="<https://builds.apache.org/job/Qpid-Java-Java-TestMatrix/./jdk=JDK%201.6%20(latest),label=Ubuntu,profile=java-mms.0-10/ws/trunk/qpid/java/build/bin"> />
    [junit]     <property name="module.etc" value="<https://builds.apache.org/job/Qpid-Java-Java-TestMatrix/./jdk=JDK%201.6%20(latest),label=Ubuntu,profile=java-mms.0-10/ws/trunk/qpid/java/systests/etc"> />
    [junit]     <property name="ant.file.type.System Tests" value="file" />
    [junit]     <property name="test.excludefiles" value="<https://builds.apache.org/job/Qpid-Java-Java-TestMatrix/./jdk=JDK%201.6%20(latest),label=Ubuntu,profile=java-mms.0-10/ws/trunk/qpid/java/test-profiles/Excludes;> <https://builds.apache.org/job/Qpid-Java-Java-TestMatrix/./jdk=JDK%201.6%20(latest),label=Ubuntu,profile=java-mms.0-10/ws/trunk/qpid/java/test-profiles/JavaExcludes;> <https://builds.apache.org/job/Qpid-Java-Java-TestMatrix/./jdk=JDK%201.6%20(latest),label=Ubuntu,profile=java-mms.0-10/ws/trunk/qpid/java/test-profiles/java-mms.0-10.excludes;> <https://builds.apache.org/job/Qpid-Java-Java-TestMatrix/./jdk=JDK%201.6%20(latest),label=Ubuntu,profile=java-mms.0-10/ws/trunk/qpid/java/test-profiles/JavaTransientExcludes;> <https://builds.apache.org/job/Qpid-Java-Java-TestMatrix/./jdk=JDK%201.6%20(latest),label=Ubuntu,profile=java-mms.0-10/ws/trunk/qpid/java/test-profiles/Java010Excludes;"> />
    [junit]     <property name="amqj.logging.level" value="debug" />
    [junit]     <property name="module.depends.libs" value="lib/geronimo-jms_1.1_spec-1.0.jar  lib/commons-cli-1.0.jar lib/commons-logging-1.0.4.jar lib/log4j-1.2.12.jar lib/slf4j-log4j12-1.6.1.jar lib/xalan-2.7.0.jar lib/org.apache.felix.main-2.0.5.jar lib/derby-10.6.1.0.jar lib/commons-beanutils-core-1.8.0.jar lib/commons-digester-1.8.1.jar lib/commons-codec-1.3.jar lib/commons-lang-2.2.jar lib/commons-collections-3.2.jar lib/commons-configuration-1.6.jar null lib/slf4j-api-1.6.1.jar null lib/log4j-1.2.12.jar lib/junit-3.8.1.jar lib/slf4j-api-1.6.1.jar lib/geronimo-j2ee-connector_1.5_spec-2.0.0.jar lib/geronimo-jta_1.1_spec-1.1.1.jar lib/geronimo-jms_1.1_spec-1.0.jar lib/slf4j-log4j12-1.6.1.jar lib/log4j-1.2.12.jar lib/junit-3.8.1.jar lib/slf4j-api-1.6.1.jar lib/geronimo-kernel-2.2.1.jar lib/geronimo-ejb_3.0_spec-1.0.1.jar" />
    [junit]     <property name="ecl-equinox-launcher" value="lib/org.eclipse.equinox.launcher_1.0.101.R34x_v20080819.jar" />
    [junit]     <property name="dontruntest" value="runtest" />
    [junit]     <property name="log4j.debug" value="false" />
    [junit]     <property name="resources" value="<https://builds.apache.org/job/Qpid-Java-Java-TestMatrix/./jdk=JDK%201.6%20(latest),label=Ubuntu,profile=java-mms.0-10/ws/trunk/qpid/java/resources"> />
    [junit]     <property name="sun.management.compiler" value="HotSpot Tiered Compilers" />
    [junit]     <property name="max_prefetch" value="1000" />
    [junit]     <property name="javac.deprecation" value="off" />
    [junit]     <property name="broker.command" value="build/bin/qpid-server -p @PORT -m @MPORT -c @CONFIG_FILE -l test-profiles/log4j-test.xml" />
    [junit]     <property name="management-common.libs" value="" />
    [junit]     <property name="test.failures.ignore" value="true" />
    [junit]     <property name="ant.file" value="<https://builds.apache.org/job/Qpid-Java-Java-TestMatrix/./jdk=JDK%201.6%20(latest),label=Ubuntu,profile=java-mms.0-10/ws/trunk/qpid/java/systests/build.xml"> />
    [junit]     <property name="ecl-equinox-launcher-linux-gtk-x86_64" value="lib/org.eclipse.equinox.launcher.gtk.linux.x86_64_1.0.101.R34x_v20080731/**" />
    [junit]     <property name="tasks.src" value="<https://builds.apache.org/job/Qpid-Java-Java-TestMatrix/./jdk=JDK%201.6%20(latest),label=Ubuntu,profile=java-mms.0-10/ws/trunk/qpid/java/tasks/src"> />
    [junit]     <property name="qpid.home" value="<https://builds.apache.org/job/Qpid-Java-Java-TestMatrix/./jdk=JDK%201.6%20(latest),label=Ubuntu,profile=java-mms.0-10/ws/trunk/qpid/java/build"> />
    [junit]     <property name="module.depends.jars" value="qpid-client-0.17.jar,qpid-management-common-0.17.jar,qpid-broker-0.17.jar,qpid-broker-test-0.17.jar,qpid-common-0.17.jar,qpid-common-test-0.17.jar,qpid-junit-toolkit-0.17.jar,qpid-jca-0.17.jar" />
    [junit]     <property name="java.vm.specification.vendor" value="Sun Microsystems Inc." />
    [junit]     <property name="management-eclipse-plugin.swt-libs" value="lib/org.eclipse.swt.win32.win32.x86_3.4.1.v3449c.jar lib/org.eclipse.swt.gtk.linux.x86_3.4.1.v3449c.jar lib/org.eclipse.swt.carbon.macosx_3.4.1.v3449c.jar lib/org.eclipse.swt.gtk.linux.x86_64_3.4.1.v3449c.jar lib/org.eclipse.swt.gtk.solaris.sparc_3.4.1.v3449c.jar" />
    [junit]     <property name="test.mport" value="18999" />
    [junit]     <property name="slf4j-api" value="lib/slf4j-api-1.6.1.jar" />
    [junit]     <property name="java.vm.name" value="Java HotSpot(TM) Server VM" />
    [junit]     <property name="build.report" value="<https://builds.apache.org/job/Qpid-Java-Java-TestMatrix/./jdk=JDK%201.6%20(latest),label=Ubuntu,profile=java-mms.0-10/ws/trunk/qpid/java/build/report"> />
    [junit]     <property name="management-eclipse-plugin.core-libs" value="lib/com.ibm.icu_3.8.1.v20080530.jar lib/org.eclipse.jface_3.4.1.M20080827-2000.jar lib/org.eclipse.jface.databinding_1.2.1.M20080827-0800a.jar lib/org.eclipse.core.commands_3.4.0.I20080509-2000.jar lib/org.eclipse.core.contenttype_3.3.0.v20080604-1400.jar lib/org.eclipse.core.databinding_1.1.1.M20080827-0800b.jar lib/org.eclipse.core.expressions_3.4.0.v20080603-2000.jar lib/org.eclipse.core.jobs_3.4.0.v20080512.jar lib/org.eclipse.core.runtime_3.4.0.v20080512.jar lib/org.eclipse.equinox.app_1.1.0.v20080421-2006.jar lib/org.eclipse.equinox.common_3.4.0.v20080421-2006.jar lib/org.eclipse.equinox.launcher_1.0.101.R34x_v20080819.jar lib/org.eclipse.equinox.preferences_3.2.201.R34x_v20080709.jar lib/org.eclipse.equinox.registry_3.4.0.v20080516-0950.jar lib/org.eclipse.help_3.3.101.v20080702_34x.jar lib/org.eclipse.osgi_3.4.2.R34x_v20080826-1230.jar lib/org.eclipse.swt_3.4.1.v3449c.jar lib/org.eclipse.ui_3.4.1.M20080910-0800.jar lib/org.eclipse.ui.forms_3.3.101.v20080708_34x.jar lib/org.eclipse.ui.workbench_3.4.1.M20080827-0800a.jar lib/org.apache.commons.codec_1.3.0.v20080530-1600.jar" />
    [junit]     <property name="java.io.tmpdir" value="/tmp" />
    [junit]     <property name="java.vendor.url" value="http://java.sun.com/" />
    [junit]     <property name="module.namever.osgi" value="qpid-systests_0.17.0.osgi" />
    [junit]     <property name="felix-main" value="lib/org.apache.felix.main-2.0.5.jar" />
    [junit]     <property name="sun.boot.library.path" value="/home/jenkins/tools/java/jdk1.6.0_27-32/jre/lib/i386" />
    [junit]     <property name="_profile_files" value="java-mms.0-10.testprofile" />
    [junit]     <property name="module.test.doc.access" value="public" />
    [junit]     <property name="ecl-equinox-launcher-win32-win32-x86" value="lib/org.eclipse.equinox.launcher.win32.win32.x86_1.0.101.R34x_v20080731/**" />
    [junit]     <property name="felix.libs" value="lib/org.apache.felix.main-2.0.5.jar" />
    [junit]     <property name="testprofile.file" value="<https://builds.apache.org/job/Qpid-Java-Java-TestMatrix/./jdk=JDK%201.6%20(latest),label=Ubuntu,profile=java-mms.0-10/ws/trunk/qpid/java/test-profiles/java-mms.0-10.testprofile"> />
    [junit]     <property name="test.mem" value="512M" />
    [junit]     <property name="java.runtime.name" value="Java(TM) SE Runtime Environment" />
    [junit]     <property name="ant.project.name" value="System Tests" />
    [junit]     <property name="build.plugins" value="<https://builds.apache.org/job/Qpid-Java-Java-TestMatrix/./jdk=JDK%201.6%20(latest),label=Ubuntu,profile=java-mms.0-10/ws/trunk/qpid/java/build/lib/plugins"> />
    [junit]     <property name="module.namever" value="qpid-systests-0.17" />
    [junit]     <property name="ra.test.libs" value="lib/slf4j-log4j12-1.6.1.jar lib/log4j-1.2.12.jar lib/junit-3.8.1.jar lib/slf4j-api-1.6.1.jar" />
    [junit]     <property name="ecl-swt" value="lib/org.eclipse.swt_3.4.1.v3449c.jar" />
    [junit]     <property name="modules.opt" value="bdbstore" />
    [junit]     <property name="ecl-core-expressions" value="lib/org.eclipse.core.expressions_3.4.0.v20080603-2000.jar" />
    [junit]     <property name="sun.cpu.isalist" value="" />
    [junit]     <property name="qpid.dest_syntax" value="BURL" />
    [junit]     <property name="tools.libs" value="lib/commons-beanutils-core-1.8.0.jar lib/commons-digester-1.8.1.jar lib/commons-codec-1.3.jar lib/commons-lang-2.2.jar lib/commons-collections-3.2.jar lib/commons-configuration-1.6.jar lib/log4j-1.2.12.jar" />
    [junit]     <property name="user.home" value="/home/jenkins" />
    [junit]     <property name="commons-logging" value="lib/commons-logging-1.0.4.jar" />
    [junit]     <property name="testkit.test.libs" value="lib/slf4j-log4j12-1.6.1.jar lib/log4j-1.2.12.jar lib/junit-3.8.1.jar lib/slf4j-api-1.6.1.jar" />
    [junit]     <property name="module.api" value="<https://builds.apache.org/job/Qpid-Java-Java-TestMatrix/./jdk=JDK%201.6%20(latest),label=Ubuntu,profile=java-mms.0-10/ws/trunk/qpid/java/build/api/systests"> />
    [junit]     <property name="commons-digester" value="lib/commons-digester-1.8.1.jar" />
    [junit]     <property name="module.genpom.args" value="" />
    [junit]     <property name="java.specification.name" value="Java Platform API Specification" />
    [junit]     <property name="ecl-equinox-registry" value="lib/org.eclipse.equinox.registry_3.4.0.v20080516-0950.jar" />
    [junit]     <property name="test.port" value="15672" />
    [junit]     <property name="ant.file.type.common" value="file" />
    [junit]     <property name="module.build" value="<https://builds.apache.org/job/Qpid-Java-Java-TestMatrix/./jdk=JDK%201.6%20(latest),label=Ubuntu,profile=java-mms.0-10/ws/trunk/qpid/java/build/scratch/systests"> />
    [junit]     <property name="java.specification.vendor" value="Sun Microsystems Inc." />
    [junit]     <property name="module.bin" value="<https://builds.apache.org/job/Qpid-Java-Java-TestMatrix/./jdk=JDK%201.6%20(latest),label=Ubuntu,profile=java-mms.0-10/ws/trunk/qpid/java/systests/bin"> />
    [junit]     <property name="java.version" value="1.6.0_27" />
    [junit]     <property name="module.test.libs" value="${systests.test.libs}" />
    [junit]     <property name="broker.config" value="build/etc/config-systests.xml" />
    [junit]     <property name="test.exclude" value="true" />
    [junit]     <property name="client-example.test.libs" value="lib/slf4j-log4j12-1.6.1.jar lib/log4j-1.2.12.jar lib/junit-3.8.1.jar lib/slf4j-api-1.6.1.jar" />
    [junit]     <property name="ecl-equinox-launcher-linux-gtk-x86" value="lib/org.eclipse.equinox.launcher.gtk.linux.x86_1.0.101.R34x_v20080805/**" />
    [junit]     <property name="javac.compiler.args" value="" />
    [junit]     <property name="messagestore.class.name" value="org.apache.qpid.server.store.MemoryMessageStore" />
    [junit]     <property name="module.test.classes" value="<https://builds.apache.org/job/Qpid-Java-Java-TestMatrix/./jdk=JDK%201.6%20(latest),label=Ubuntu,profile=java-mms.0-10/ws/trunk/qpid/java/build/scratch/systests/test/classes"> />
    [junit]     <property name="ibm-icu" value="lib/com.ibm.icu_3.8.1.v20080530.jar" />
    [junit]     <property name="qpid.work" value="<https://builds.apache.org/job/Qpid-Java-Java-TestMatrix/./jdk=JDK%201.6%20(latest),label=Ubuntu,profile=java-mms.0-10/ws/trunk/qpid/java/build/work"> />
    [junit]     <property name="preload.profile.excludes" value="JavaTransientExcludes Java010Excludes" />
    [junit]     <property name="management-eclipse-plugin.libs" value="lib/com.ibm.icu_3.8.1.v20080530.jar lib/org.eclipse.jface_3.4.1.M20080827-2000.jar lib/org.eclipse.jface.databinding_1.2.1.M20080827-0800a.jar lib/org.eclipse.core.commands_3.4.0.I20080509-2000.jar lib/org.eclipse.core.contenttype_3.3.0.v20080604-1400.jar lib/org.eclipse.core.databinding_1.1.1.M20080827-0800b.jar lib/org.eclipse.core.expressions_3.4.0.v20080603-2000.jar lib/org.eclipse.core.jobs_3.4.0.v20080512.jar lib/org.eclipse.core.runtime_3.4.0.v20080512.jar lib/org.eclipse.equinox.app_1.1.0.v20080421-2006.jar lib/org.eclipse.equinox.common_3.4.0.v20080421-2006.jar lib/org.eclipse.equinox.launcher_1.0.101.R34x_v20080819.jar lib/org.eclipse.equinox.preferences_3.2.201.R34x_v20080709.jar lib/org.eclipse.equinox.registry_3.4.0.v20080516-0950.jar lib/org.eclipse.help_3.3.101.v20080702_34x.jar lib/org.eclipse.osgi_3.4.2.R34x_v20080826-1230.jar lib/org.eclipse.swt_3.4.1.v3449c.jar lib/org.eclipse.ui_3.4.1.M20080910-0800.jar lib/org.eclipse.ui.forms_3.3.101.v20080708_34x.jar lib/org.eclipse.ui.workbench_3.4.1.M20080827-0800a.jar lib/org.apache.commons.codec_1.3.0.v20080530-1600.jar lib/org.eclipse.swt.win32.win32.x86_3.4.1.v3449c.jar lib/org.eclipse.swt.gtk.linux.x86_3.4.1.v3449c.jar lib/org.eclipse.swt.carbon.macosx_3.4.1.v3449c.jar lib/org.eclipse.swt.gtk.linux.x86_64_3.4.1.v3449c.jar lib/org.eclipse.swt.gtk.solaris.sparc_3.4.1.v3449c.jar" />
    [junit]     <property name="management-eclipse-plugin-win32-win32-x86.libs" value="lib/com.ibm.icu_3.8.1.v20080530.jar lib/org.eclipse.jface_3.4.1.M20080827-2000.jar lib/org.eclipse.jface.databinding_1.2.1.M20080827-0800a.jar lib/org.eclipse.core.commands_3.4.0.I20080509-2000.jar lib/org.eclipse.core.contenttype_3.3.0.v20080604-1400.jar lib/org.eclipse.core.databinding_1.1.1.M20080827-0800b.jar lib/org.eclipse.core.expressions_3.4.0.v20080603-2000.jar lib/org.eclipse.core.jobs_3.4.0.v20080512.jar lib/org.eclipse.core.runtime_3.4.0.v20080512.jar lib/org.eclipse.equinox.app_1.1.0.v20080421-2006.jar lib/org.eclipse.equinox.common_3.4.0.v20080421-2006.jar lib/org.eclipse.equinox.launcher_1.0.101.R34x_v20080819.jar lib/org.eclipse.equinox.preferences_3.2.201.R34x_v20080709.jar lib/org.eclipse.equinox.registry_3.4.0.v20080516-0950.jar lib/org.eclipse.help_3.3.101.v20080702_34x.jar lib/org.eclipse.osgi_3.4.2.R34x_v20080826-1230.jar lib/org.eclipse.swt_3.4.1.v3449c.jar lib/org.eclipse.ui_3.4.1.M20080910-0800.jar lib/org.eclipse.ui.forms_3.3.101.v20080708_34x.jar lib/org.eclipse.ui.workbench_3.4.1.M20080827-0800a.jar lib/org.apache.commons.codec_1.3.0.v20080530-1600.jar lib/org.eclipse.swt.win32.win32.x86_3.4.1.v3449c.jar lib/org.eclipse.equinox.launcher.win32.win32.x86_1.0.101.R34x_v20080731/** lib/org.eclipse.core.runtime.compatibility.registry_3.2.200.v20080610/**" />
    [junit]     <property name="build.failed" value="<https://builds.apache.org/job/Qpid-Java-Java-TestMatrix/./jdk=JDK%201.6%20(latest),label=Ubuntu,profile=java-mms.0-10/ws/trunk/qpid/java/build/results/FAILED"> />
    [junit]     <property name="maven.version.suffix" value="-SNAPSHOT" />
    [junit]     <property name="broker.protocol.excludes" value="" />
    [junit]     <property name="line.separator" value="&#xa;" />
    [junit]     <property name="java.specification.version" value="1.6" />
    [junit]     <property name="java.vm.info" value="mixed mode" />
    [junit]     <property name="xalan" value="lib/xalan-2.7.0.jar" />
    [junit]     <property name="module.depends" value="client management/common broker broker/test common common/test junit-toolkit jca " />
    [junit]     <property name="module.test.depends.path" value="" />
    [junit]     <property name="module.test.jar" value="<https://builds.apache.org/job/Qpid-Java-Java-TestMatrix/./jdk=JDK%201.6%20(latest),label=Ubuntu,profile=java-mms.0-10/ws/trunk/qpid/java/build/lib/qpid-systests-tests-0.17.jar"> />
    [junit]     <property name="sun.boot.class.path" value="/home/jenkins/tools/java/jdk1.6.0_27-32/jre/lib/resources.jar:/home/jenkins/tools/java/jdk1.6.0_27-32/jre/lib/rt.jar:/home/jenkins/tools/java/jdk1.6.0_27-32/jre/lib/sunrsasign.jar:/home/jenkins/tools/java/jdk1.6.0_27-32/jre/lib/jsse.jar:/home/jenkins/tools/java/jdk1.6.0_27-32/jre/lib/jce.jar:/home/jenkins/tools/java/jdk1.6.0_27-32/jre/lib/charsets.jar:/home/jenkins/tools/java/jdk1.6.0_27-32/jre/lib/modules/jdk.boot.jar:/home/jenkins/tools/java/jdk1.6.0_27-32/jre/classes" />
    [junit]     <property name="project.url" value="http://qpid.apache.org" />
    [junit]     <property name="commons-configuration.libs" value="lib/commons-beanutils-core-1.8.0.jar lib/commons-digester-1.8.1.jar lib/commons-codec-1.3.jar lib/commons-lang-2.2.jar lib/commons-collections-3.2.jar lib/commons-configuration-1.6.jar" />
    [junit]     <property name="gentools.home" value="<https://builds.apache.org/job/Qpid-Java-Java-TestMatrix/./jdk=JDK%201.6%20(latest),label=Ubuntu,profile=java-mms.0-10/ws/trunk/qpid/gentools"> />
    [junit]     <property name="build" value="<https://builds.apache.org/job/Qpid-Java-Java-TestMatrix/./jdk=JDK%201.6%20(latest),label=Ubuntu,profile=java-mms.0-10/ws/trunk/qpid/java/build"> />
    [junit]     <property name="ecl-equinox-prefs" value="lib/org.eclipse.equinox.preferences_3.2.201.R34x_v20080709.jar" />
    [junit]     <property name="module.doc.access" value="package" />
    [junit]     <property name="haltonerror" value="no" />
    [junit]     <property name="velocity.compile.dir" value="<https://builds.apache.org/job/Qpid-Java-Java-TestMatrix/./jdk=JDK%201.6%20(latest),label=Ubuntu,profile=java-mms.0-10/ws/trunk/qpid/java/build/scratch/broker/velocity"> />
    [junit]     <property name="module.test.depends.libs" value="" />
    [junit]     <property name="java.awt.printerjob" value="sun.print.PSPrinterJob" />
    [junit]     <property name="module.test.src" value="<https://builds.apache.org/job/Qpid-Java-Java-TestMatrix/./jdk=JDK%201.6%20(latest),label=Ubuntu,profile=java-mms.0-10/ws/trunk/qpid/java/systests/src/main/java"> />
    [junit]     <property name="common.test.libs" value="lib/slf4j-log4j12-1.6.1.jar lib/log4j-1.2.12.jar lib/junit-3.8.1.jar lib/slf4j-api-1.6.1.jar" />
    [junit]     <property name="sun.jnu.encoding" value="ANSI_X3.4-1968" />
    [junit]     <property name="project.groupid" value="org.apache.qpid" />
    [junit]     <property name="java.runtime.version" value="1.6.0_27-b07" />
    [junit]     <property name="junit-toolkit.libs" value="lib/log4j-1.2.12.jar lib/junit-3.8.1.jar lib/slf4j-api-1.6.1.jar" />
    [junit]     <property name="ra.libs" value="lib/geronimo-j2ee-connector_1.5_spec-2.0.0.jar lib/geronimo-jta_1.1_spec-1.1.1.jar lib/geronimo-jms_1.1_spec-1.0.jar lib/slf4j-log4j12-1.6.1.jar lib/log4j-1.2.12.jar lib/junit-3.8.1.jar lib/slf4j-api-1.6.1.jar lib/geronimo-kernel-2.2.1.jar lib/geronimo-ejb_3.0_spec-1.0.1.jar" />
    [junit]     <property name="log4j.configuration" value="file:///<https://builds.apache.org/job/Qpid-Java-Java-TestMatrix/./jdk=JDK%201.6%20(latest),label=Ubuntu,profile=java-mms.0-10/ws/trunk/qpid/java/test-profiles/log4j-test.xml"> />
    [junit]     <property name="tasks" value="<https://builds.apache.org/job/Qpid-Java-Java-TestMatrix/./jdk=JDK%201.6%20(latest),label=Ubuntu,profile=java-mms.0-10/ws/trunk/qpid/java/tasks"> />
    [junit]     <property name="test.port.alt" value="25672" />
    [junit]     <property name="user.timezone" value="Etc/UTC" />
    [junit]     <property name="module.failed" value="<https://builds.apache.org/job/Qpid-Java-Java-TestMatrix/./jdk=JDK%201.6%20(latest),label=Ubuntu,profile=java-mms.0-10/ws/trunk/qpid/java/build/results/systests/FAILED"> />
    [junit]     <property name="ecl-core-contenttype" value="lib/org.eclipse.core.contenttype_3.3.0.v20080604-1400.jar" />
    [junit]     <property name="apache-commons-codec" value="lib/org.apache.commons.codec_1.3.0.v20080530-1600.jar" />
    [junit]     <property name="profiles" value=" java-mms.0-10" />
    [junit]     <property name="tools.test.libs" value="" />
    [junit]     <property name="testprofile.file.present" value="true" />
    [junit]     <property name="module.release" value="<https://builds.apache.org/job/Qpid-Java-Java-TestMatrix/./jdk=JDK%201.6%20(latest),label=Ubuntu,profile=java-mms.0-10/ws/trunk/qpid/java/systests/release/qpid-systests-0.17"> />
    [junit]     <property name="java.ext.dirs" value="/home/jenkins/tools/java/jdk1.6.0_27-32/jre/lib/ext:/usr/java/packages/lib/ext" />
    [junit]     <property name="commons-beanutils-core" value="lib/commons-beanutils-core-1.8.0.jar" />
    [junit]     <property name="java.class.path" value="/home/hudson/tools/ant/latest/lib/ant-launcher.jar:/home/hudson/tools/ant/latest/lib/ant-junit.jar:/home/hudson/tools/ant/latest/lib/ant-netrexx.jar:/home/hudson/tools/ant/latest/lib/ant-apache-bcel.jar:/home/hudson/tools/ant/latest/lib/ant-apache-xalan2.jar:/home/hudson/tools/ant/latest/lib/ant-javamail.jar:/home/hudson/tools/ant/latest/lib/ant-jdepend.jar:/home/hudson/tools/ant/latest/lib/ant-antlr.jar:/home/hudson/tools/ant/latest/lib/ant-swing.jar:/home/hudson/tools/ant/latest/lib/ant-apache-oro.jar:/home/hudson/tools/ant/latest/lib/ant-jai.jar:/home/hudson/tools/ant/latest/lib/ant-commons-net.jar:/home/hudson/tools/ant/latest/lib/ant-commons-logging.jar:/home/hudson/tools/ant/latest/lib/ant-jsch.jar:/home/hudson/tools/ant/latest/lib/ant-apache-regexp.jar:/home/hudson/tools/ant/latest/lib/ant.jar:/home/hudson/tools/ant/latest/lib/ant-launcher.jar:/home/hudson/tools/ant/latest/lib/ant-junit4.jar:/home/hudson/tools/ant/latest/lib/ant-testutil.jar:/home/hudson/tools/ant/latest/lib/ant-apache-log4j.jar:/home/hudson/tools/ant/latest/lib/ant-apache-bsf.jar:/home/hudson/tools/ant/latest/lib/ant-apache-resolver.jar:/home/hudson/tools/ant/latest/lib/ant-jmf.jar:/home/jenkins/tools/java/jdk1.6.0_27-32/lib/tools.jar" />
    [junit]     <property name="broker.version" value="v0_10" />
    [junit]     <property name="mllib.dir" value="<https://builds.apache.org/job/Qpid-Java-Java-TestMatrix/./jdk=JDK%201.6%20(latest),label=Ubuntu,profile=java-mms.0-10/ws/trunk/qpid/java/../python"> />
    [junit]     <property name="log4j" value="lib/log4j-1.2.12.jar" />
    [junit]     <property name="broker.language" value="java" />
    [junit]     <property name="cobertura.version" value="1.9.4.1" />
    [junit]     <property name="broker.log.interleave" value="true" />
    [junit]     <property name="os.version" value="2.6.32-33-server" />
    [junit]     <property name="module.test.depends.libs.includes" value="__EMPTY__" />
    [junit]     <property name="common.libs" value="lib/slf4j-api-1.6.1.jar" />
    [junit]     <property name="module.release.bz2" value="<https://builds.apache.org/job/Qpid-Java-Java-TestMatrix/./jdk=JDK%201.6%20(latest),label=Ubuntu,profile=java-mms.0-10/ws/trunk/qpid/java/systests/release/qpid-systests-0.17/qpid-systests-0.17.tar.bz2"> />
    [junit]     <property name="geronimo-kernel" value="lib/geronimo-kernel-2.2.1.jar" />
    [junit]     <property name="build.scratch" value="<https://builds.apache.org/job/Qpid-Java-Java-TestMatrix/./jdk=JDK%201.6%20(latest),label=Ubuntu,profile=java-mms.0-10/ws/trunk/qpid/java/build/scratch"> />
    [junit]     <property name="module.release.base" value="<https://builds.apache.org/job/Qpid-Java-Java-TestMatrix/./jdk=JDK%201.6%20(latest),label=Ubuntu,profile=java-mms.0-10/ws/trunk/qpid/java/systests/release"> />
    [junit]     <property name="ant.file.type.module" value="file" />
    [junit]     <property name="test.port.alt.ssl" value="25671" />
    [junit]     <property name="maven.settings.xml" value="<https://builds.apache.org/job/Qpid-Java-Java-TestMatrix/./jdk=JDK%201.6%20(latest),label=Ubuntu,profile=java-mms.0-10/ws/trunk/qpid/java/maven-settings.xml"> />
    [junit]     <property name="client.test.libs" value="lib/slf4j-log4j12-1.6.1.jar lib/log4j-1.2.12.jar lib/junit-3.8.1.jar lib/slf4j-api-1.6.1.jar" />
    [junit]     <property name="geronimo-openejb" value="lib/geronimo-ejb_3.0_spec-1.0.1.jar" />
    [junit]     <property name="java.awt.graphicsenv" value="sun.awt.X11GraphicsEnvironment" />
    [junit]     <property name="java.vm.vendor" value="Sun Microsystems Inc." />
    [junit]     <property name="systests.optional.depends" value="" />
    [junit]     <property name="amqj.protocol.logging.level" value="debug" />
    [junit]     <property name="ecl-swt-linux-gtk-x86_64" value="lib/org.eclipse.swt.gtk.linux.x86_64_3.4.1.v3449c.jar" />
    [junit]     <property name="geronimo-j2ee" value="lib/geronimo-j2ee-connector_1.5_spec-2.0.0.jar" />
    [junit]     <property name="slf4j-log4j" value="lib/slf4j-log4j12-1.6.1.jar" />
    [junit]     <property name="ecl-ui-workbench" value="lib/org.eclipse.ui.workbench_3.4.1.M20080827-0800a.jar" />
    [junit]     <property name="commons-collections" value="lib/commons-collections-3.2.jar" />
    [junit]     <property name="broker-plugins.libs" value="lib/org.apache.felix.main-2.0.5.jar lib/log4j-1.2.12.jar lib/commons-beanutils-core-1.8.0.jar lib/commons-digester-1.8.1.jar lib/commons-codec-1.3.jar lib/commons-lang-2.2.jar lib/commons-collections-3.2.jar lib/commons-configuration-1.6.jar" />
    [junit]     <property name="label" value="Ubuntu" />
    [junit]     <property name="ant.file.type" value="file" />
    [junit]     <property name="ecl-core-jobs" value="lib/org.eclipse.core.jobs_3.4.0.v20080512.jar" />
    [junit]     <property name="module" value="systests" />
    [junit]     <property name="build.lib" value="<https://builds.apache.org/job/Qpid-Java-Java-TestMatrix/./jdk=JDK%201.6%20(latest),label=Ubuntu,profile=java-mms.0-10/ws/trunk/qpid/java/build/lib"> />
    [junit]     <property name="maven.local.repo" value="<https://builds.apache.org/job/Qpid-Java-Java-TestMatrix/./jdk=JDK%201.6%20(latest),label=Ubuntu,profile=java-mms.0-10/ws/trunk/qpid/java/build/scratch/maven-local-repo"> />
    [junit]     <property name="module.jar" value="<https://builds.apache.org/job/Qpid-Java-Java-TestMatrix/./jdk=JDK%201.6%20(latest),label=Ubuntu,profile=java-mms.0-10/ws/trunk/qpid/java/build/lib/qpid-systests-0.17.jar"> />
    [junit]     <property name="test.excludelist" value="org.apache.qpid.test.unit.transacted.TransactionTimeoutTest#* org.apache.qpid.test.unit.transacted.TransactionTimeoutDisabledTest#*" />
    [junit]     <property name="ecl-equinox-app" value="lib/org.eclipse.equinox.app_1.1.0.v20080421-2006.jar" />
    [junit]     <property name="ecl-core-jface-databinding" value="lib/org.eclipse.jface.databinding_1.2.1.M20080827-0800a.jar" />
    [junit]     <property name="ant.version" value="Apache Ant(TM) version 1.8.2 compiled on December 20 2010" />
    [junit]     <property name="file.encoding" value="ANSI_X3.4-1968" />
    [junit]     <property name="ecl-core-commands" value="lib/org.eclipse.core.commands_3.4.0.I20080509-2000.jar" />
    [junit]     <property name="module.instrumented" value="<https://builds.apache.org/job/Qpid-Java-Java-TestMatrix/./jdk=JDK%201.6%20(latest),label=Ubuntu,profile=java-mms.0-10/ws/trunk/qpid/java/build/scratch/systests/classes-instrumented"> />
    [junit]     <property name="project.root" value="<https://builds.apache.org/job/Qpid-Java-Java-TestMatrix/./jdk=JDK%201.6%20(latest),label=Ubuntu,profile=java-mms.0-10/ws/trunk/qpid/java"> />
    [junit]     <property name="preload.broker.version" value="v0_10" />
    [junit]   </properties>
    [junit]   <testcase classname="org.apache.qpid.util.Batch-With-Multiple-Tests" name="Monitor file (<https://builds.apache.org/job/Qpid-Java-Java-TestMatrix/./jdk=JDK%201.6%20(latest),label=Ubuntu,profile=java-mms.0-10/ws/trunk/qpid/java/systests/junitvmwatcher5859274440498208627.properties)> missing, location not writable, testcase not started or mixing ant versions?" time="0.0010">
    [junit]     <error message="Forked Java VM exited abnormally. Please note the time in the report does not reflect the time until the VM exit." type="junit.framework.AssertionFailedError">junit.framework.AssertionFailedError: Forked Java VM exited abnormally. Please note the time in the report does not reflect the time until the VM exit.
    [junit] </error>
    [junit]   </testcase>
    [junit] </testsuite>
    [junit] Running org.apache.qpid.util.Batch-With-Multiple-Tests
    [junit] Tests run: 1, Failures: 0, Errors: 1, Time elapsed: 0 sec

BUILD FAILED
<https://builds.apache.org/job/Qpid-Java-Java-TestMatrix/./jdk=JDK%201.6%20(latest),label=Ubuntu,profile=java-mms.0-10/ws/trunk/qpid/java/build.xml>:86: The following error occurred while executing this line:
<https://builds.apache.org/job/Qpid-Java-Java-TestMatrix/./jdk=JDK%201.6%20(latest),label=Ubuntu,profile=java-mms.0-10/ws/trunk/qpid/java/build.xml>:59: The following error occurred while executing this line:
<https://builds.apache.org/job/Qpid-Java-Java-TestMatrix/./jdk=JDK%201.6%20(latest),label=Ubuntu,profile=java-mms.0-10/ws/trunk/qpid/java/module.xml>:338: Could not delete temporary properties file '<https://builds.apache.org/job/Qpid-Java-Java-TestMatrix/./jdk=JDK%201.6%20(latest),label=Ubuntu,profile=java-mms.0-10/ws/trunk/qpid/java/systests/junit1441945596574814093.properties'.>

Total time: 7 minutes 1 second
Build step 'Invoke Ant' marked build as failure
[locks-and-latches] Releasing all the locks
[locks-and-latches] All the locks released
Recording test results
ERROR: Publisher hudson.tasks.junit.JUnitResultArchiver aborted due to exception
<https://builds.apache.org/job/Qpid-Java-Java-TestMatrix/./jdk=JDK%201.6%20(latest),label=Ubuntu,profile=java-mms.0-10/ws/> does not exist.
	at org.apache.tools.ant.types.AbstractFileSet.getDirectoryScanner(AbstractFileSet.java:474)
	at org.apache.tools.ant.types.AbstractFileSet.getDirectoryScanner(AbstractFileSet.java:451)
	at hudson.tasks.junit.JUnitParser$ParseResultCallable.invoke(JUnitParser.java:105)
	at hudson.tasks.junit.JUnitParser$ParseResultCallable.invoke(JUnitParser.java:87)
	at hudson.FilePath$FileCallableWrapper.call(FilePath.java:2099)
	at hudson.remoting.UserRequest.perform(UserRequest.java:118)
	at hudson.remoting.UserRequest.perform(UserRequest.java:48)
	at hudson.remoting.Request$2.run(Request.java:287)
	at hudson.remoting.InterceptingExecutorService$1.call(InterceptingExecutorService.java:72)
	at java.util.concurrent.FutureTask$Sync.innerRun(FutureTask.java:334)
	at java.util.concurrent.FutureTask.run(FutureTask.java:166)
	at java.util.concurrent.ThreadPoolExecutor.runWorker(ThreadPoolExecutor.java:1110)
	at java.util.concurrent.ThreadPoolExecutor$Worker.run(ThreadPoolExecutor.java:603)
	at java.lang.Thread.run(Thread.java:636)