You are viewing a plain text version of this content. The canonical link for it is here.
Posted to builds@solr.apache.org by Apache Jenkins Server <je...@builds.apache.org> on 2026/01/17 06:57:48 UTC

[JENKINS] Solr » Solr-Test-9.10 - Build # 530 - Still Failing!

Build: https://ci-builds.apache.org/job/Solr/job/Solr-Test-9.10/530/

All tests passed

Build Log:
[...truncated 443 lines...]
BUILD FAILED in 41m 59s
165 actionable tasks: 165 executed

Publishing build scan...
https://develocity.apache.org/s/sghwfwq5lpmf4

Build step 'Invoke Gradle script' changed build result to FAILURE
Build step 'Invoke Gradle script' marked build as failure
Archiving artifacts
Recording test results
[Checks API] No suitable checks publisher found.
Email was triggered for: Failure - Any
Sending email for trigger: Failure - Any

[JENKINS] Solr » Solr-Test-9.10 - Build # 534 - Still Failing!

Posted by Apache Jenkins Server <je...@builds.apache.org>.
Build: https://ci-builds.apache.org/job/Solr/job/Solr-Test-9.10/534/

All tests passed

Build Log:
[...truncated 443 lines...]
BUILD FAILED in 40m 59s
165 actionable tasks: 165 executed

Publishing build scan...
https://develocity.apache.org/s/tzrv5xjesbik2

Build step 'Invoke Gradle script' changed build result to FAILURE
Build step 'Invoke Gradle script' marked build as failure
Archiving artifacts
Recording test results
[Checks API] No suitable checks publisher found.
Email was triggered for: Failure - Any
Sending email for trigger: Failure - Any

[JENKINS] Solr » Solr-Test-9.10 - Build # 533 - Still Failing!

Posted by Apache Jenkins Server <je...@builds.apache.org>.
Build: https://ci-builds.apache.org/job/Solr/job/Solr-Test-9.10/533/

All tests passed

Build Log:
[...truncated 444 lines...]
BUILD FAILED in 40m 5s
165 actionable tasks: 165 executed

Publishing build scan...
https://develocity.apache.org/s/zn4effvomilr6

Build step 'Invoke Gradle script' changed build result to FAILURE
Build step 'Invoke Gradle script' marked build as failure
Archiving artifacts
Recording test results
[Checks API] No suitable checks publisher found.
Email was triggered for: Failure - Any
Sending email for trigger: Failure - Any

[JENKINS] Solr » Solr-Test-9.10 - Build # 532 - Still Failing!

Posted by Apache Jenkins Server <je...@builds.apache.org>.
Build: https://ci-builds.apache.org/job/Solr/job/Solr-Test-9.10/532/

All tests passed

Build Log:
[...truncated 443 lines...]
BUILD FAILED in 40m 45s
165 actionable tasks: 165 executed

Publishing build scan...
https://develocity.apache.org/s/imeszthijyrcm

Build step 'Invoke Gradle script' changed build result to FAILURE
Build step 'Invoke Gradle script' marked build as failure
Archiving artifacts
Recording test results
[Checks API] No suitable checks publisher found.
Email was triggered for: Failure - Any
Sending email for trigger: Failure - Any

[JENKINS] Solr » Solr-Test-9.10 - Build # 531 - Still Failing!

Posted by Apache Jenkins Server <je...@builds.apache.org>.
Build: https://ci-builds.apache.org/job/Solr/job/Solr-Test-9.10/531/

All tests passed

Build Log:
[...truncated 444 lines...]
BUILD FAILED in 41m 53s
165 actionable tasks: 165 executed

Publishing build scan...
https://develocity.apache.org/s/iaqfrkb66fhyq

Build step 'Invoke Gradle script' changed build result to FAILURE
Build step 'Invoke Gradle script' marked build as failure
Archiving artifacts
Recording test results
[Checks API] No suitable checks publisher found.
Email was triggered for: Failure - Any
Sending email for trigger: Failure - Any