You are viewing a plain text version of this content. The canonical link for it is here.
Posted to dev@sling.apache.org by Apache Jenkins Server <je...@builds.apache.org> on 2024/07/01 11:27:03 UTC
[Jenkins] Sling » Modules » sling-org-apache-sling-starter » master #1434 is BROKEN
Please see https://ci-builds.apache.org/job/Sling/job/modules/job/sling-org-apache-sling-starter/job/master/1434/ for details.
No further emails will be sent until the status of the build is changed.
Build log follows below:
[...truncated 13349 lines...]
WARNING: Please consider reporting this to the maintainers of org.apache.sling.commons.threads.impl.ThreadLocalCleaner
WARNING: Use --illegal-access=warn to enable warnings of further illegal reflective access operations
WARNING: All illegal access operations will be denied in a future release
Jul 01, 2024 11:25:47 AM org.apache.aries.spifly.BaseActivator log
INFO: Registered provider org.apache.groovy.json.DefaultFastStringServiceFactory of service org.apache.groovy.json.FastStringServiceFactory in bundle groovy-json
Jul 01, 2024 11:25:47 AM org.apache.aries.spifly.BaseActivator log
INFO: Registered provider org.codehaus.groovy.jsr223.GroovyScriptEngineFactory of service javax.script.ScriptEngineFactory in bundle groovy-jsr223
Jul 01, 2024 11:25:47 AM org.apache.aries.spifly.BaseActivator log
INFO: Registered provider groovy.junit5.plugin.JUnit5Runner of service org.apache.groovy.plugin.GroovyRunner in bundle groovy-test-junit5
Jul 01, 2024 11:25:47 AM org.apache.aries.spifly.BaseActivator log
INFO: Registered provider org.apache.groovy.plugin.testng.TestNgRunner of service org.apache.groovy.plugin.GroovyRunner in bundle groovy-testng
Jul 01, 2024 11:26:10 AM org.apache.aries.spifly.BaseActivator log
INFO: Registered provider org.eclipse.jetty.http.Http1FieldPreEncoder of service org.eclipse.jetty.http.HttpFieldPreEncoder in bundle org.apache.felix.http.jetty
Jul 01, 2024 11:26:10 AM org.apache.aries.spifly.BaseActivator log
INFO: Registered provider org.eclipse.jetty.http2.hpack.HpackFieldPreEncoder of service org.eclipse.jetty.http.HttpFieldPreEncoder in bundle org.apache.felix.http.jetty
Jul 01, 2024 11:26:18 AM org.apache.tika.config.InitializableProblemHandler$3 handleInitializableProblem
WARNING: TIFFImageWriter not loaded. tiff files will not be processed
See https://pdfbox.apache.org/2.0/dependencies.html#jai-image-io
for optional dependencies.
J2KImageReader not loaded. JPEG2000 files will not be processed.
See https://pdfbox.apache.org/2.0/dependencies.html#jai-image-io
for optional dependencies.
Jul 01, 2024 11:26:18 AM org.apache.tika.config.InitializableProblemHandler$3 handleInitializableProblem
WARNING: org.xerial's sqlite-jdbc is not loaded.
Please provide the jar on your classpath to parse sqlite files.
See tika-parsers/pom.xml for the correct version.
Jul 01, 2024 11:26:18 AM org.apache.aries.spifly.BaseActivator log
INFO: Registered provider com.ctc.wstx.stax.WstxEventFactory of service javax.xml.stream.XMLEventFactory in bundle com.fasterxml.woodstox.woodstox-core
Jul 01, 2024 11:26:18 AM org.apache.aries.spifly.BaseActivator log
INFO: Registered provider com.ctc.wstx.stax.WstxInputFactory of service javax.xml.stream.XMLInputFactory in bundle com.fasterxml.woodstox.woodstox-core
Jul 01, 2024 11:26:18 AM org.apache.aries.spifly.BaseActivator log
INFO: Registered provider com.ctc.wstx.dtd.DTDSchemaFactory of service org.codehaus.stax2.validation.XMLValidationSchemaFactory in bundle com.fasterxml.woodstox.woodstox-core
Jul 01, 2024 11:26:18 AM org.apache.aries.spifly.BaseActivator log
INFO: Registered provider com.ctc.wstx.msv.RelaxNGSchemaFactory of service org.codehaus.stax2.validation.XMLValidationSchemaFactory in bundle com.fasterxml.woodstox.woodstox-core
Jul 01, 2024 11:26:18 AM org.apache.aries.spifly.BaseActivator log
INFO: Registered provider com.ctc.wstx.msv.W3CSchemaFactory of service org.codehaus.stax2.validation.XMLValidationSchemaFactory in bundle com.fasterxml.woodstox.woodstox-core
Jul 01, 2024 11:26:18 AM org.apache.aries.spifly.BaseActivator log
INFO: Registered provider com.ctc.wstx.stax.WstxOutputFactory of service javax.xml.stream.XMLOutputFactory in bundle com.fasterxml.woodstox.woodstox-core
[WARNING] Stream closed
java.io.IOException: Stream closed
at java.io.BufferedInputStream.getBufIfOpen (BufferedInputStream.java:176)
at java.io.BufferedInputStream.read1 (BufferedInputStream.java:289)
at java.io.BufferedInputStream.read (BufferedInputStream.java:351)
at sun.nio.cs.StreamDecoder.readBytes (StreamDecoder.java:284)
at sun.nio.cs.StreamDecoder.implRead (StreamDecoder.java:326)
at sun.nio.cs.StreamDecoder.read (StreamDecoder.java:178)
at java.io.InputStreamReader.read (InputStreamReader.java:181)
at java.io.BufferedReader.fill (BufferedReader.java:161)
at java.io.BufferedReader.readLine (BufferedReader.java:326)
at java.io.BufferedReader.readLine (BufferedReader.java:392)
at org.apache.sling.maven.feature.launcher.StartMojo$1.run (StartMojo.java:278)
Jul 01, 2024 11:26:35 AM org.apache.aries.spifly.BaseActivator log
INFO: Registered provider org.apache.groovy.json.DefaultFastStringServiceFactory of service org.apache.groovy.json.FastStringServiceFactory in bundle groovy-json
Jul 01, 2024 11:26:35 AM org.apache.aries.spifly.BaseActivator log
INFO: Registered provider org.codehaus.groovy.jsr223.GroovyScriptEngineFactory of service javax.script.ScriptEngineFactory in bundle groovy-jsr223
Jul 01, 2024 11:26:35 AM org.apache.aries.spifly.BaseActivator log
INFO: Registered provider groovy.junit5.plugin.JUnit5Runner of service org.apache.groovy.plugin.GroovyRunner in bundle groovy-test-junit5
Jul 01, 2024 11:26:35 AM org.apache.aries.spifly.BaseActivator log
INFO: Registered provider org.apache.groovy.plugin.testng.TestNgRunner of service org.apache.groovy.plugin.GroovyRunner in bundle groovy-testng
ESAPI: WARNING: System property [org.owasp.esapi.opsteam] is not set
ESAPI: WARNING: System property [org.owasp.esapi.devteam] is not set
ESAPI: Attempting to load ESAPI.properties via file I/O.
ESAPI: Attempting to load ESAPI.properties as resource file via file I/O.
ESAPI: Not found in 'org.owasp.esapi.resources' directory or file not readable: /home/jenkins/workspace/_org-apache-sling-starter_master/jdk_11_latest/target/launchers/ESAPI.properties
ESAPI: Not found in SystemResource Directory/resourceDirectory: .esapi/ESAPI.properties
ESAPI: Not found in 'user.home' (/home/jenkins) directory: /home/jenkins/esapi/ESAPI.properties
ESAPI: Loading ESAPI.properties via file I/O failed. Exception was: java.io.FileNotFoundException
ESAPI: Attempting to load ESAPI.properties via the classpath.
ESAPI: SUCCESSFULLY LOADED ESAPI.properties via the CLASSPATH from '/ (root)' using class loader for DefaultSecurityConfiguration class!
ESAPI: SecurityConfiguration for Validator.ConfigurationFile.MultiValued not found in ESAPI.properties. Using default: false
ESAPI: Attempting to load validation.properties via file I/O.
ESAPI: Attempting to load validation.properties as resource file via file I/O.
ESAPI: Not found in 'org.owasp.esapi.resources' directory or file not readable: /home/jenkins/workspace/_org-apache-sling-starter_master/jdk_11_latest/target/launchers/validation.properties
ESAPI: Not found in SystemResource Directory/resourceDirectory: .esapi/validation.properties
ESAPI: Not found in 'user.home' (/home/jenkins) directory: /home/jenkins/esapi/validation.properties
ESAPI: Loading validation.properties via file I/O failed.
ESAPI: Attempting to load validation.properties via the classpath.
ESAPI: SUCCESSFULLY LOADED validation.properties via the CLASSPATH from '/ (root)' using class loader for DefaultSecurityConfiguration class!
[INFO] ------------------------------------------------------------------------
[INFO] BUILD FAILURE
[INFO] ------------------------------------------------------------------------
[INFO] Total time: 06:31 min
[INFO] Finished at: 2024-07-01T11:26:39Z
[INFO] ------------------------------------------------------------------------
[INFO] [jenkins-event-spy] Generated /home/jenkins/workspace/_org-apache-sling-starter_master/jdk_11_latest@tmp/withMavenaa7f99cf/maven-spy-20240701-112007-5612450784390281023663.log
[ERROR] Failed to execute goal org.apache.sling:feature-launcher-maven-plugin:0.1.6:start (default) on project org.apache.sling.starter: Launch sling-starter-oak-tar failed to start in 120 seconds. -> [Help 1]
org.apache.maven.lifecycle.LifecycleExecutionException: Failed to execute goal org.apache.sling:feature-launcher-maven-plugin:0.1.6:start (default) on project org.apache.sling.starter: Launch sling-starter-oak-tar failed to start in 120 seconds.
at org.apache.maven.lifecycle.internal.MojoExecutor.doExecute2 (MojoExecutor.java:333)
at org.apache.maven.lifecycle.internal.MojoExecutor.doExecute (MojoExecutor.java:316)
at org.apache.maven.lifecycle.internal.MojoExecutor.execute (MojoExecutor.java:212)
at org.apache.maven.lifecycle.internal.MojoExecutor.execute (MojoExecutor.java:174)
at org.apache.maven.lifecycle.internal.MojoExecutor.access$000 (MojoExecutor.java:75)
at org.apache.maven.lifecycle.internal.MojoExecutor$1.run (MojoExecutor.java:162)
at org.apache.maven.plugin.DefaultMojosExecutionStrategy.execute (DefaultMojosExecutionStrategy.java:39)
at org.apache.maven.lifecycle.internal.MojoExecutor.execute (MojoExecutor.java:159)
at org.apache.maven.lifecycle.internal.LifecycleModuleBuilder.buildProject (LifecycleModuleBuilder.java:105)
at org.apache.maven.lifecycle.internal.LifecycleModuleBuilder.buildProject (LifecycleModuleBuilder.java:73)
at org.apache.maven.lifecycle.internal.builder.singlethreaded.SingleThreadedBuilder.build (SingleThreadedBuilder.java:53)
at org.apache.maven.lifecycle.internal.LifecycleStarter.execute (LifecycleStarter.java:118)
at org.apache.maven.DefaultMaven.doExecute (DefaultMaven.java:261)
at org.apache.maven.DefaultMaven.doExecute (DefaultMaven.java:173)
at org.apache.maven.DefaultMaven.execute (DefaultMaven.java:101)
at org.apache.maven.cli.MavenCli.execute (MavenCli.java:906)
at org.apache.maven.cli.MavenCli.doMain (MavenCli.java:283)
at org.apache.maven.cli.MavenCli.main (MavenCli.java:206)
at jdk.internal.reflect.NativeMethodAccessorImpl.invoke0 (Native Method)
at jdk.internal.reflect.NativeMethodAccessorImpl.invoke (NativeMethodAccessorImpl.java:62)
at jdk.internal.reflect.DelegatingMethodAccessorImpl.invoke (DelegatingMethodAccessorImpl.java:43)
at java.lang.reflect.Method.invoke (Method.java:566)
at org.codehaus.plexus.classworlds.launcher.Launcher.launchEnhanced (Launcher.java:283)
at org.codehaus.plexus.classworlds.launcher.Launcher.launch (Launcher.java:226)
at org.codehaus.plexus.classworlds.launcher.Launcher.mainWithExitCode (Launcher.java:407)
at org.codehaus.plexus.classworlds.launcher.Launcher.main (Launcher.java:348)
Caused by: org.apache.maven.plugin.MojoExecutionException: Launch sling-starter-oak-tar failed to start in 120 seconds.
at org.apache.sling.maven.feature.launcher.StartMojo.execute (StartMojo.java:295)
at org.apache.maven.plugin.DefaultBuildPluginManager.executeMojo (DefaultBuildPluginManager.java:126)
at org.apache.maven.lifecycle.internal.MojoExecutor.doExecute2 (MojoExecutor.java:328)
at org.apache.maven.lifecycle.internal.MojoExecutor.doExecute (MojoExecutor.java:316)
at org.apache.maven.lifecycle.internal.MojoExecutor.execute (MojoExecutor.java:212)
at org.apache.maven.lifecycle.internal.MojoExecutor.execute (MojoExecutor.java:174)
at org.apache.maven.lifecycle.internal.MojoExecutor.access$000 (MojoExecutor.java:75)
at org.apache.maven.lifecycle.internal.MojoExecutor$1.run (MojoExecutor.java:162)
at org.apache.maven.plugin.DefaultMojosExecutionStrategy.execute (DefaultMojosExecutionStrategy.java:39)
at org.apache.maven.lifecycle.internal.MojoExecutor.execute (MojoExecutor.java:159)
at org.apache.maven.lifecycle.internal.LifecycleModuleBuilder.buildProject (LifecycleModuleBuilder.java:105)
at org.apache.maven.lifecycle.internal.LifecycleModuleBuilder.buildProject (LifecycleModuleBuilder.java:73)
at org.apache.maven.lifecycle.internal.builder.singlethreaded.SingleThreadedBuilder.build (SingleThreadedBuilder.java:53)
at org.apache.maven.lifecycle.internal.LifecycleStarter.execute (LifecycleStarter.java:118)
at org.apache.maven.DefaultMaven.doExecute (DefaultMaven.java:261)
at org.apache.maven.DefaultMaven.doExecute (DefaultMaven.java:173)
at org.apache.maven.DefaultMaven.execute (DefaultMaven.java:101)
at org.apache.maven.cli.MavenCli.execute (MavenCli.java:906)
at org.apache.maven.cli.MavenCli.doMain (MavenCli.java:283)
at org.apache.maven.cli.MavenCli.main (MavenCli.java:206)
at jdk.internal.reflect.NativeMethodAccessorImpl.invoke0 (Native Method)
at jdk.internal.reflect.NativeMethodAccessorImpl.invoke (NativeMethodAccessorImpl.java:62)
at jdk.internal.reflect.DelegatingMethodAccessorImpl.invoke (DelegatingMethodAccessorImpl.java:43)
at java.lang.reflect.Method.invoke (Method.java:566)
at org.codehaus.plexus.classworlds.launcher.Launcher.launchEnhanced (Launcher.java:283)
at org.codehaus.plexus.classworlds.launcher.Launcher.launch (Launcher.java:226)
at org.codehaus.plexus.classworlds.launcher.Launcher.mainWithExitCode (Launcher.java:407)
at org.codehaus.plexus.classworlds.launcher.Launcher.main (Launcher.java:348)
[ERROR]
[ERROR] Re-run Maven using the -X switch to enable full debug logging.
[ERROR]
[ERROR] For more information about the errors and possible solutions, please read the following articles:
[ERROR] [Help 1] http://cwiki.apache.org/confluence/display/MAVEN/MojoExecutionException
[Pipeline] }
ESAPI: WARNING: System property [org.owasp.esapi.opsteam] is not set
ESAPI: WARNING: System property [org.owasp.esapi.devteam] is not set
ESAPI: Attempting to load ESAPI.properties via file I/O.
ESAPI: Attempting to load ESAPI.properties as resource file via file I/O.
ESAPI: Not found in 'org.owasp.esapi.resources' directory or file not readable: /home/jenkins/workspace/_org-apache-sling-starter_master/jdk_21_latest/target/launchers/ESAPI.properties
ESAPI: Not found in SystemResource Directory/resourceDirectory: .esapi/ESAPI.properties
ESAPI: Not found in 'user.home' (/home/jenkins) directory: /home/jenkins/esapi/ESAPI.properties
ESAPI: Loading ESAPI.properties via file I/O failed. Exception was: java.io.FileNotFoundException
ESAPI: Attempting to load ESAPI.properties via the classpath.
ESAPI: SUCCESSFULLY LOADED ESAPI.properties via the CLASSPATH from '/ (root)' using class loader for DefaultSecurityConfiguration class!
ESAPI: SecurityConfiguration for Validator.ConfigurationFile.MultiValued not found in ESAPI.properties. Using default: false
ESAPI: Attempting to load validation.properties via file I/O.
ESAPI: Attempting to load validation.properties as resource file via file I/O.
ESAPI: Not found in 'org.owasp.esapi.resources' directory or file not readable: /home/jenkins/workspace/_org-apache-sling-starter_master/jdk_21_latest/target/launchers/validation.properties
ESAPI: Not found in SystemResource Directory/resourceDirectory: .esapi/validation.properties
ESAPI: Not found in 'user.home' (/home/jenkins) directory: /home/jenkins/esapi/validation.properties
ESAPI: Loading validation.properties via file I/O failed.
ESAPI: Attempting to load validation.properties via the classpath.
ESAPI: SUCCESSFULLY LOADED validation.properties via the CLASSPATH from '/ (root)' using class loader for DefaultSecurityConfiguration class!
[withMaven] junitPublisher - Archive test results for Maven artifact org.apache.sling:org.apache.sling.starter:jar:13-SNAPSHOT generated by maven-surefire-plugin:test (default-test): target/surefire-reports/*.xml
[withMaven] junitPublisher - Jenkins JUnit Flaky Test Handler Plugin not found, can't publish JUnit flaky tests reports.
Recording test results
No test report files were found. Configuration error?
[INFO] Framework started
[INFO] Setting environment variable 'MONGODB_PORT' to '44573'
[INFO] Starting launch with id 'sling-starter-oak-mongo', args=[/home/jenkins/tools/java/latest21/bin/java, -jar, /home/jenkins/workspace/_org-apache-sling-starter_master/jdk_21_latest/.repository/org/apache/sling/org.apache.sling.feature.launcher/1.1.4/org.apache.sling.feature.launcher-1.1.4.jar, -f, /home/jenkins/workspace/_org-apache-sling-starter_master/jdk_21_latest/target/slingfeature-tmp/feature-oak_mongo.json, -p, sling-starter-oak-mongo, -D, org.apache.felix.http.jetty.responseBufferSize=5000000, -D, org.osgi.service.http.port=39751]
[INFO] Waiting for sling-starter-oak-mongo to start
Picked up JAVA_TOOL_OPTIONS: -Dmaven.ext.class.path="/home/jenkins/workspace/_org-apache-sling-starter_master/jdk_21_latest@tmp/withMaven01bd02a9/pipeline-maven-spy.jar" -Dorg.jenkinsci.plugins.pipeline.maven.reportsFolder="/home/jenkins/workspace/_org-apache-sling-starter_master/jdk_21_latest@tmp/withMaven01bd02a9"
[INFO]
[INFO] Apache Sling Application Launcher
[INFO] ---------------------------------
[INFO] Initializing...
[INFO] Artifact Repositories: [file:///home/jenkins/.m2/repository, https://repo.maven.apache.org/maven2, https://repository.apache.org/content/groups/snapshots]
[INFO] Assembling provisioning model...
[INFO]
[INFO] Assembling launcher...
[INFO] Using 222 local artifacts, 13 cached artifacts, and 0 downloaded artifacts
[INFO]
[INFO] Starting launcher...
[INFO] Launcher Home: /home/jenkins/workspace/_org-apache-sling-starter_master/jdk_21_latest/target/launchers/sling-starter-oak-mongo
[INFO] Cache Directory: /home/jenkins/workspace/_org-apache-sling-starter_master/jdk_21_latest/target/launchers/launcher/cache
[INFO]
None of the test reports contained any result
[Checks API] No suitable checks publisher found.
[withMaven] Jenkins FindBugs Plugin not found, don't display org.codehaus.mojo:findbugs-maven-plugin:findbugs results in pipeline screen.
[withMaven] jgivenPublisher - Jenkins JGiven Plugin not found, do not archive jgiven reports.
[withMaven] Jenkins JaCoCo Plugin not found, don't display org.jacoco:jacoco-maven-plugin:prepare-agent[-integration] results in pipeline screen.
[withMaven] Jenkins Task Scanner Plugin not found, don't display results of source code scanning for 'TODO' and 'FIXME' in pipeline screen.
[withMaven] Publishers: Pipeline Graph Publisher: 1 ms, Generated Artifacts Publisher: 5280 ms, Junit Publisher: 4009 ms, Dependencies Fingerprint Publisher: 1175 ms, Findbugs Publisher: 1 ms, Jacoco Publisher: 1 ms, Open Task Scanner Publisher: 1 ms
[Pipeline] // withMaven
[Pipeline] }
[Pipeline] // stage
[Pipeline] }
[Pipeline] // timeout
[Pipeline] }
[Pipeline] // dir
[Pipeline] }
[Pipeline] // node
[Pipeline] }
Failed in branch Build (Java 11 on linux)
Sending interrupt signal to process
[ERROR] Error while running launcher: null
java.lang.reflect.InvocationTargetException
at java.base/jdk.internal.reflect.DirectConstructorHandleAccessor.newInstance(DirectConstructorHandleAccessor.java:74)
at java.base/java.lang.reflect.Constructor.newInstanceWithCaller(Constructor.java:502)
at java.base/java.lang.reflect.Constructor.newInstance(Constructor.java:486)
at org.apache.sling.feature.launcher.impl.launchers.FrameworkLauncher.run(FrameworkLauncher.java:98)
at org.apache.sling.feature.launcher.impl.Bootstrap.run(Bootstrap.java:280)
at org.apache.sling.feature.launcher.impl.Bootstrap.run(Bootstrap.java:182)
at org.apache.sling.feature.launcher.impl.Main.main(Main.java:200)
Caused by: org.osgi.framework.BundleException: The framework has been shutdown.
at org.apache.felix.framework.Felix.installBundle(Felix.java:3240)
at org.apache.felix.framework.BundleContextImpl.installBundle(BundleContextImpl.java:147)
at org.apache.sling.feature.launcher.impl.launchers.AbstractRunner.install(AbstractRunner.java:318)
at org.apache.sling.feature.launcher.impl.launchers.AbstractRunner.setupFramework(AbstractRunner.java:222)
at org.apache.sling.feature.launcher.impl.launchers.FrameworkRunner.<init>(FrameworkRunner.java:82)
at java.base/jdk.internal.reflect.DirectConstructorHandleAccessor.newInstance(DirectConstructorHandleAccessor.java:62)
... 6 more
[INFO] Framework stopped
Launch sling-starter-oak-tar was not shut down! Destroying forcibly from shutdown hook..
script returned exit code 143
[Pipeline] }
[withMaven] One or multiple Maven executions have been ignored by the Jenkins Pipeline Maven Plugin because they have been interrupted before completion (1). See Pipeline Maven Plugin FAQ for more details.
[Pipeline] // withMaven
[Pipeline] }
[Pipeline] // stage
[Pipeline] }
[Pipeline] // timeout
[Pipeline] }
[Pipeline] // dir
[Pipeline] }
[Pipeline] // node
[Pipeline] }
Failed in branch Build (Java 21 on linux)
[Pipeline] // parallel
[Pipeline] stage
[Pipeline] { (Notifications)
[Pipeline] echo
Status change is BROKEN, notifications will be sent.
[Pipeline] emailext
[Jenkins] Sling » Modules » sling-org-apache-sling-starter » master #1435 is FIXED
Posted by Apache Jenkins Server <je...@builds.apache.org>.
Please see https://ci-builds.apache.org/job/Sling/job/modules/job/sling-org-apache-sling-starter/job/master/1435/ for details.
No further emails will be sent until the status of the build is changed.