You are viewing a plain text version of this content. The canonical link for it is here.
Posted to builds@solr.apache.org by Policeman Jenkins Server <je...@thetaphi.de> on 2025/09/08 16:04:05 UTC

[JENKINS] Solr-main-Windows (64bit/hotspot/jdk-25-rc+35) - Build # 6936 - Unstable!

Build: https://jenkins.thetaphi.de/job/Solr-main-Windows/6936/
Java: 64bit/hotspot/jdk-25-rc+35 -XX:+UseCompressedOops -XX:+UseParallelGC

1 tests failed.
FAILED:  org.apache.solr.handler.TestSnapshotCoreBackup.testBackupAfterSoftCommit

Error Message:
org.apache.lucene.index.CorruptIndexException: codec mismatch: actual codec=Lucene90NormsMetadata vs expected codec=Lucene90NormsData (resource=MemorySegmentIndexInput(path="C:\Users\jenkins\workspace\Solr-main-Windows\build\tmp\tests-tmp\org.apache.solr.handler.TestSnapshotCoreBackup_A374CBA3E16E472D-001\tempDir-003\snapshot.backup2\_1.nvd"))

Stack Trace:
org.apache.lucene.index.CorruptIndexException: codec mismatch: actual codec=Lucene90NormsMetadata vs expected codec=Lucene90NormsData (resource=MemorySegmentIndexInput(path="C:\Users\jenkins\workspace\Solr-main-Windows\build\tmp\tests-tmp\org.apache.solr.handler.TestSnapshotCoreBackup_A374CBA3E16E472D-001\tempDir-003\snapshot.backup2\_1.nvd"))
	at __randomizedtesting.SeedInfo.seed([A374CBA3E16E472D:D8BC8547308319B1]:0)
	at app//org.apache.lucene.codecs.CodecUtil.checkHeaderNoMagic(CodecUtil.java:205)
	at app//org.apache.lucene.codecs.CodecUtil.checkHeader(CodecUtil.java:194)
	at app//org.apache.lucene.codecs.CodecUtil.checkIndexHeader(CodecUtil.java:254)
	at app//org.apache.lucene.codecs.lucene90.Lucene90NormsProducer.<init>(Lucene90NormsProducer.java:89)
	at app//org.apache.lucene.codecs.lucene90.Lucene90NormsFormat.normsProducer(Lucene90NormsFormat.java:96)
	at app//org.apache.lucene.index.SegmentCoreReaders.<init>(SegmentCoreReaders.java:108)
	at app//org.apache.lucene.index.SegmentReader.<init>(SegmentReader.java:95)
	at app//org.apache.lucene.index.StandardDirectoryReader$1.doBody(StandardDirectoryReader.java:95)
	at app//org.apache.lucene.index.StandardDirectoryReader$1.doBody(StandardDirectoryReader.java:77)
	at app//org.apache.lucene.index.SegmentInfos$FindSegmentsFile.run(SegmentInfos.java:815)
	at app//org.apache.lucene.index.StandardDirectoryReader.open(StandardDirectoryReader.java:110)
	at app//org.apache.lucene.index.StandardDirectoryReader.open(StandardDirectoryReader.java:67)
	at app//org.apache.lucene.index.DirectoryReader.open(DirectoryReader.java:60)
	at app//org.apache.solr.handler.TestSnapshotCoreBackup.simpleBackupCheck(TestSnapshotCoreBackup.java:458)
	at app//org.apache.solr.handler.TestSnapshotCoreBackup.simpleBackupCheck(TestSnapshotCoreBackup.java:436)
	at app//org.apache.solr.handler.TestSnapshotCoreBackup.testBackupAfterSoftCommit(TestSnapshotCoreBackup.java:342)
	at java.base@25/jdk.internal.reflect.DirectMethodHandleAccessor.invoke(DirectMethodHandleAccessor.java:104)
	at java.base@25/java.lang.reflect.Method.invoke(Method.java:565)
	at app//com.carrotsearch.randomizedtesting.RandomizedRunner.invoke(RandomizedRunner.java:1763)
	at app//com.carrotsearch.randomizedtesting.RandomizedRunner$8.evaluate(RandomizedRunner.java:946)
	at app//com.carrotsearch.randomizedtesting.RandomizedRunner$9.evaluate(RandomizedRunner.java:982)
	at app//com.carrotsearch.randomizedtesting.RandomizedRunner$10.evaluate(RandomizedRunner.java:996)
	at app//com.carrotsearch.randomizedtesting.rules.SystemPropertiesRestoreRule$1.evaluate(SystemPropertiesRestoreRule.java:80)
	at app//org.junit.rules.RunRules.evaluate(RunRules.java:20)
	at app//org.apache.lucene.tests.util.TestRuleSetupTeardownChained$1.evaluate(TestRuleSetupTeardownChained.java:48)
	at app//org.apache.lucene.tests.util.AbstractBeforeAfterRule$1.evaluate(AbstractBeforeAfterRule.java:43)
	at app//org.apache.lucene.tests.util.TestRuleThreadAndTestName$1.evaluate(TestRuleThreadAndTestName.java:45)
	at app//org.apache.lucene.tests.util.TestRuleIgnoreAfterMaxFailures$1.evaluate(TestRuleIgnoreAfterMaxFailures.java:60)
	at app//org.apache.lucene.tests.util.TestRuleMarkFailure$1.evaluate(TestRuleMarkFailure.java:44)
	at app//org.junit.rules.RunRules.evaluate(RunRules.java:20)
	at app//com.carrotsearch.randomizedtesting.rules.StatementAdapter.evaluate(StatementAdapter.java:36)
	at app//com.carrotsearch.randomizedtesting.ThreadLeakControl$StatementRunner.run(ThreadLeakControl.java:390)
	at app//com.carrotsearch.randomizedtesting.ThreadLeakControl.forkTimeoutingTask(ThreadLeakControl.java:843)
	at app//com.carrotsearch.randomizedtesting.ThreadLeakControl$3.evaluate(ThreadLeakControl.java:490)
	at app//com.carrotsearch.randomizedtesting.RandomizedRunner.runSingleTest(RandomizedRunner.java:955)
	at app//com.carrotsearch.randomizedtesting.RandomizedRunner$5.evaluate(RandomizedRunner.java:840)
	at app//com.carrotsearch.randomizedtesting.RandomizedRunner$6.evaluate(RandomizedRunner.java:891)
	at app//com.carrotsearch.randomizedtesting.RandomizedRunner$7.evaluate(RandomizedRunner.java:902)
	at app//com.carrotsearch.randomizedtesting.rules.StatementAdapter.evaluate(StatementAdapter.java:36)
	at app//com.carrotsearch.randomizedtesting.rules.StatementAdapter.evaluate(StatementAdapter.java:36)
	at app//org.apache.lucene.tests.util.AbstractBeforeAfterRule$1.evaluate(AbstractBeforeAfterRule.java:43)
	at app//com.carrotsearch.randomizedtesting.rules.SystemPropertiesRestoreRule$1.evaluate(SystemPropertiesRestoreRule.java:80)
	at app//org.junit.rules.RunRules.evaluate(RunRules.java:20)
	at app//org.apache.lucene.tests.util.AbstractBeforeAfterRule$1.evaluate(AbstractBeforeAfterRule.java:43)
	at app//com.carrotsearch.randomizedtesting.rules.StatementAdapter.evaluate(StatementAdapter.java:36)
	at app//org.apache.lucene.tests.util.TestRuleStoreClassName$1.evaluate(TestRuleStoreClassName.java:38)
	at app//com.carrotsearch.randomizedtesting.rules.NoShadowingOrOverridesOnMethodsRule$1.evaluate(NoShadowingOrOverridesOnMethodsRule.java:40)
	at app//com.carrotsearch.randomizedtesting.rules.NoShadowingOrOverridesOnMethodsRule$1.evaluate(NoShadowingOrOverridesOnMethodsRule.java:40)
	at app//com.carrotsearch.randomizedtesting.rules.StatementAdapter.evaluate(StatementAdapter.java:36)
	at app//com.carrotsearch.randomizedtesting.rules.StatementAdapter.evaluate(StatementAdapter.java:36)
	at app//org.apache.lucene.tests.util.TestRuleAssertionsRequired$1.evaluate(TestRuleAssertionsRequired.java:53)
	at app//org.apache.lucene.tests.util.AbstractBeforeAfterRule$1.evaluate(AbstractBeforeAfterRule.java:43)
	at app//org.apache.lucene.tests.util.TestRuleMarkFailure$1.evaluate(TestRuleMarkFailure.java:44)
	at app//org.apache.lucene.tests.util.TestRuleIgnoreAfterMaxFailures$1.evaluate(TestRuleIgnoreAfterMaxFailures.java:60)
	at app//org.apache.lucene.tests.util.TestRuleIgnoreTestSuites$1.evaluate(TestRuleIgnoreTestSuites.java:47)
	at app//org.junit.rules.RunRules.evaluate(RunRules.java:20)
	at app//com.carrotsearch.randomizedtesting.rules.StatementAdapter.evaluate(StatementAdapter.java:36)
	at app//com.carrotsearch.randomizedtesting.ThreadLeakControl$StatementRunner.run(ThreadLeakControl.java:390)
	at app//com.carrotsearch.randomizedtesting.ThreadLeakControl.lambda$forkTimeoutingTask$0(ThreadLeakControl.java:850)
	at java.base@25/java.lang.Thread.run(Thread.java:1474)