You are viewing a plain text version of this content. The canonical link for it is here.
Posted to builds@mesos.apache.org by Apache Jenkins Server <je...@builds.apache.org> on 2017/08/14 21:49:27 UTC

Build failed in Jenkins: Mesos-Buildbot » autotools,gcc,--verbose --enable-libevent --enable-ssl,GLOG_v=1 MESOS_VERBOSE=1,centos:7,(ubuntu)&&(!ubuntu-us1)&&(!ubuntu-eu2) #4106

See <https://builds.apache.org/job/Mesos-Buildbot/BUILDTOOL=autotools,COMPILER=gcc,CONFIGURATION=--verbose%20--enable-libevent%20--enable-ssl,ENVIRONMENT=GLOG_v=1%20MESOS_VERBOSE=1,OS=centos%3A7,label_exp=(ubuntu)&&(!ubuntu-us1)&&(!ubuntu-eu2)/4106/display/redirect?page=changes>

Changes:

[gregorywmann] Stout: Made `Duration::parse()` handle durations out of range.

[gregorywmann] Stout: Made boundary checking in Duration consistent.

[gregorywmann] Prefer leading instead of trailing spaces for allocator log messages.

[gregorywmann] Fixed the default filter used by the allocator.

[gregorywmann] Added MESOS-7660 to the changelog.

------------------------------------------
[...truncated 32.12 MB...]
I0814 21:49:21.258294 30288 slave.cpp:250] Mesos agent started on (803)@172.17.0.3:43610
I0814 21:49:21.258316 30288 slave.cpp:251] Flags at startup: --acls="" --appc_simple_discovery_uri_prefix="http://" --appc_store_dir="/tmp/Endpoint_SlaveEndpointTest_UnauthorizedRequest_0_6lAoSU/store/appc" --authenticate_http_executors="true" --authenticate_http_readonly="true" --authenticate_http_readwrite="true" --authenticatee="crammd5" --authentication_backoff_factor="1secs" --authorizer="local" --cgroups_cpu_enable_pids_and_tids_count="false" --cgroups_enable_cfs="false" --cgroups_hierarchy="/sys/fs/cgroup" --cgroups_limit_swap="false" --cgroups_root="mesos" --container_disk_watch_interval="15secs" --containerizers="mesos" --credential="/tmp/Endpoint_SlaveEndpointTest_UnauthorizedRequest_0_6lAoSU/credential" --default_role="*" --disk_watch_interval="1mins" --docker="docker" --docker_kill_orphans="true" --docker_registry="https://registry-1.docker.io" --docker_remove_delay="6hrs" --docker_socket="/var/run/docker.sock" --docker_stop_timeout="0ns" --docker_store_dir="/tmp/Endpoint_SlaveEndpointTest_UnauthorizedRequest_0_6lAoSU/store/docker" --docker_volume_checkpoint_dir="/var/run/mesos/isolators/docker/volume" --enforce_container_disk_quota="false" --executor_registration_timeout="1mins" --executor_reregistration_timeout="2secs" --executor_secret_key="/tmp/Endpoint_SlaveEndpointTest_UnauthorizedRequest_0_6lAoSU/executor_secret_key" --executor_shutdown_grace_period="5secs" --fetcher_cache_dir="/tmp/Endpoint_SlaveEndpointTest_UnauthorizedRequest_0_6lAoSU/fetch" --fetcher_cache_size="2GB" --frameworks_home="" --gc_delay="1weeks" --gc_disk_headroom="0.1" --hadoop_home="" --help="false" --hostname_lookup="true" --http_command_executor="false" --http_credentials="/tmp/Endpoint_SlaveEndpointTest_UnauthorizedRequest_0_6lAoSU/http_credentials" --http_heartbeat_interval="30secs" --initialize_driver_logging="true" --isolation="posix/cpu,posix/mem" --launcher="posix" --launcher_dir="/mesos/mesos-1.4.0/_build/src" --logbufsecs="0" --logging_level="INFO" --max_completed_executors_per_framework="150" --oversubscribed_resources_interval="15secs" --perf_duration="10secs" --perf_interval="1mins" --port="5051" --qos_correction_interval_min="0ns" --quiet="false" --recover="reconnect" --recovery_timeout="15mins" --registration_backoff_factor="10ms" --resources="cpus:2;gpus:0;mem:1024;disk:1024;ports:[31000-32000]" --revocable_cpu_low_priority="true" --runtime_dir="/tmp/Endpoint_SlaveEndpointTest_UnauthorizedRequest_0_6lAoSU" --sandbox_directory="/mnt/mesos/sandbox" --strict="true" --switch_user="true" --systemd_enable_support="true" --systemd_runtime_directory="/run/systemd/system" --version="false" --work_dir="/tmp/Endpoint_SlaveEndpointTest_UnauthorizedRequest_0_JiOAis"
I0814 21:49:21.258700 30288 credentials.hpp:86] Loading credential for authentication from '/tmp/Endpoint_SlaveEndpointTest_UnauthorizedRequest_0_6lAoSU/credential'
I0814 21:49:21.258854 30288 slave.cpp:283] Agent using credential for: test-principal
I0814 21:49:21.258877 30288 credentials.hpp:37] Loading credentials for authentication from '/tmp/Endpoint_SlaveEndpointTest_UnauthorizedRequest_0_6lAoSU/http_credentials'
I0814 21:49:21.259269 30288 http.cpp:1026] Creating default 'basic' HTTP authenticator for realm 'mesos-agent-executor'
I0814 21:49:21.259395 30288 http.cpp:1047] Creating default 'jwt' HTTP authenticator for realm 'mesos-agent-executor'
I0814 21:49:21.259613 30288 http.cpp:1026] Creating default 'basic' HTTP authenticator for realm 'mesos-agent-readonly'
I0814 21:49:21.259721 30288 http.cpp:1047] Creating default 'jwt' HTTP authenticator for realm 'mesos-agent-readonly'
I0814 21:49:21.259919 30288 http.cpp:1026] Creating default 'basic' HTTP authenticator for realm 'mesos-agent-readwrite'
I0814 21:49:21.260032 30288 http.cpp:1047] Creating default 'jwt' HTTP authenticator for realm 'mesos-agent-readwrite'
I0814 21:49:21.261397 30288 slave.cpp:565] Agent resources: [{"name":"cpus","scalar":{"value":2.0},"type":"SCALAR"},{"name":"mem","scalar":{"value":1024.0},"type":"SCALAR"},{"name":"disk","scalar":{"value":1024.0},"type":"SCALAR"},{"name":"ports","ranges":{"range":[{"begin":31000,"end":32000}]},"type":"RANGES"}]
I0814 21:49:21.261626 30288 slave.cpp:573] Agent attributes: [  ]
I0814 21:49:21.261641 30288 slave.cpp:582] Agent hostname: 231706a5482d
I0814 21:49:21.261785 30291 status_update_manager.cpp:177] Pausing sending status updates
I0814 21:49:21.263427 30287 state.cpp:64] Recovering state from '/tmp/Endpoint_SlaveEndpointTest_UnauthorizedRequest_0_JiOAis/meta'
I0814 21:49:21.263708 30282 status_update_manager.cpp:203] Recovering status update manager
I0814 21:49:21.263909 30289 containerizer.cpp:598] Recovering containerizer
I0814 21:49:21.265161 30286 provisioner.cpp:416] Provisioner recovery complete
I0814 21:49:21.265483 30288 slave.cpp:6210] Finished recovery
I0814 21:49:21.265918 30288 slave.cpp:6392] Querying resource estimator for oversubscribable resources
I0814 21:49:21.266167 30285 slave.cpp:6406] Received oversubscribable resources {} from the resource estimator
I0814 21:49:21.268031 30297 process.cpp:3933] Handling HTTP event for process 'slave(803)' with path: '/slave(803)/monitor/statistics'
I0814 21:49:21.269603 30282 http.cpp:1166] HTTP GET for /slave(803)/monitor/statistics from 172.17.0.3:32810
I0814 21:49:21.269668 30282 http.cpp:957] Authorizing principal 'test-principal' to GET the '/monitor/statistics' endpoint
I0814 21:49:21.271278 30282 slave.cpp:843] Agent terminating
[       OK ] Endpoint/SlaveEndpointTest.UnauthorizedRequest/0 (27 ms)
[ RUN      ] Endpoint/SlaveEndpointTest.UnauthorizedRequest/1
I0814 21:49:21.282454  9447 containerizer.cpp:246] Using isolation: posix/cpu,posix/mem,filesystem/posix,network/cni,environment_secret
W0814 21:49:21.283226  9447 backend.cpp:76] Failed to create 'aufs' backend: AufsBackend requires root privileges
W0814 21:49:21.283406  9447 backend.cpp:76] Failed to create 'bind' backend: BindBackend requires root privileges
I0814 21:49:21.283455  9447 provisioner.cpp:255] Using default backend 'copy'
I0814 21:49:21.288125 30300 slave.cpp:250] Mesos agent started on (804)@172.17.0.3:43610
I0814 21:49:21.288146 30300 slave.cpp:251] Flags at startup: --acls="" --appc_simple_discovery_uri_prefix="http://" --appc_store_dir="/tmp/Endpoint_SlaveEndpointTest_UnauthorizedRequest_1_ItdIpL/store/appc" --authenticate_http_executors="true" --authenticate_http_readonly="true" --authenticate_http_readwrite="true" --authenticatee="crammd5" --authentication_backoff_factor="1secs" --authorizer="local" --cgroups_cpu_enable_pids_and_tids_count="false" --cgroups_enable_cfs="false" --cgroups_hierarchy="/sys/fs/cgroup" --cgroups_limit_swap="false" --cgroups_root="mesos" --container_disk_watch_interval="15secs" --containerizers="mesos" --credential="/tmp/Endpoint_SlaveEndpointTest_UnauthorizedRequest_1_ItdIpL/credential" --default_role="*" --disk_watch_interval="1mins" --docker="docker" --docker_kill_orphans="true" --docker_registry="https://registry-1.docker.io" --docker_remove_delay="6hrs" --docker_socket="/var/run/docker.sock" --docker_stop_timeout="0ns" --docker_store_dir="/tmp/Endpoint_SlaveEndpointTest_UnauthorizedRequest_1_ItdIpL/store/docker" --docker_volume_checkpoint_dir="/var/run/mesos/isolators/docker/volume" --enforce_container_disk_quota="false" --executor_registration_timeout="1mins" --executor_reregistration_timeout="2secs" --executor_secret_key="/tmp/Endpoint_SlaveEndpointTest_UnauthorizedRequest_1_ItdIpL/executor_secret_key" --executor_shutdown_grace_period="5secs" --fetcher_cache_dir="/tmp/Endpoint_SlaveEndpointTest_UnauthorizedRequest_1_ItdIpL/fetch" --fetcher_cache_size="2GB" --frameworks_home="" --gc_delay="1weeks" --gc_disk_headroom="0.1" --hadoop_home="" --help="false" --hostname_lookup="true" --http_command_executor="false" --http_credentials="/tmp/Endpoint_SlaveEndpointTest_UnauthorizedRequest_1_ItdIpL/http_credentials" --http_heartbeat_interval="30secs" --initialize_driver_logging="true" --isolation="posix/cpu,posix/mem" --launcher="posix" --launcher_dir="/mesos/mesos-1.4.0/_build/src" --logbufsecs="0" --logging_level="INFO" --max_completed_executors_per_framework="150" --oversubscribed_resources_interval="15secs" --perf_duration="10secs" --perf_interval="1mins" --port="5051" --qos_correction_interval_min="0ns" --quiet="false" --recover="reconnect" --recovery_timeout="15mins" --registration_backoff_factor="10ms" --resources="cpus:2;gpus:0;mem:1024;disk:1024;ports:[31000-32000]" --revocable_cpu_low_priority="true" --runtime_dir="/tmp/Endpoint_SlaveEndpointTest_UnauthorizedRequest_1_ItdIpL" --sandbox_directory="/mnt/mesos/sandbox" --strict="true" --switch_user="true" --systemd_enable_support="true" --systemd_runtime_directory="/run/systemd/system" --version="false" --work_dir="/tmp/Endpoint_SlaveEndpointTest_UnauthorizedRequest_1_dPHOLi"
I0814 21:49:21.288540 30300 credentials.hpp:86] Loading credential for authentication from '/tmp/Endpoint_SlaveEndpointTest_UnauthorizedRequest_1_ItdIpL/credential'
I0814 21:49:21.288709 30300 slave.cpp:283] Agent using credential for: test-principal
I0814 21:49:21.288733 30300 credentials.hpp:37] Loading credentials for authentication from '/tmp/Endpoint_SlaveEndpointTest_UnauthorizedRequest_1_ItdIpL/http_credentials'
I0814 21:49:21.289036 30300 http.cpp:1026] Creating default 'basic' HTTP authenticator for realm 'mesos-agent-executor'
I0814 21:49:21.289175 30300 http.cpp:1047] Creating default 'jwt' HTTP authenticator for realm 'mesos-agent-executor'
I0814 21:49:21.289397 30300 http.cpp:1026] Creating default 'basic' HTTP authenticator for realm 'mesos-agent-readonly'
I0814 21:49:21.289510 30300 http.cpp:1047] Creating default 'jwt' HTTP authenticator for realm 'mesos-agent-readonly'
I0814 21:49:21.289722 30300 http.cpp:1026] Creating default 'basic' HTTP authenticator for realm 'mesos-agent-readwrite'
I0814 21:49:21.289837 30300 http.cpp:1047] Creating default 'jwt' HTTP authenticator for realm 'mesos-agent-readwrite'
I0814 21:49:21.291245 30300 slave.cpp:565] Agent resources: [{"name":"cpus","scalar":{"value":2.0},"type":"SCALAR"},{"name":"mem","scalar":{"value":1024.0},"type":"SCALAR"},{"name":"disk","scalar":{"value":1024.0},"type":"SCALAR"},{"name":"ports","ranges":{"range":[{"begin":31000,"end":32000}]},"type":"RANGES"}]
I0814 21:49:21.291501 30300 slave.cpp:573] Agent attributes: [  ]
I0814 21:49:21.291517 30300 slave.cpp:582] Agent hostname: 231706a5482d
I0814 21:49:21.291656 30292 status_update_manager.cpp:177] Pausing sending status updates
I0814 21:49:21.293313 30298 state.cpp:64] Recovering state from '/tmp/Endpoint_SlaveEndpointTest_UnauthorizedRequest_1_dPHOLi/meta'
I0814 21:49:21.293617 30298 status_update_manager.cpp:203] Recovering status update manager
I0814 21:49:21.293820 30288 containerizer.cpp:598] Recovering containerizer
I0814 21:49:21.295238 30281 provisioner.cpp:416] Provisioner recovery complete
I0814 21:49:21.295632 30287 slave.cpp:6210] Finished recovery
I0814 21:49:21.296120 30287 slave.cpp:6392] Querying resource estimator for oversubscribable resources
I0814 21:49:21.296388 30283 slave.cpp:6406] Received oversubscribable resources {} from the resource estimator
I0814 21:49:21.298472 30293 process.cpp:3933] Handling HTTP event for process 'slave(804)' with path: '/slave(804)/monitor/statistics.json'
I0814 21:49:21.300246 30282 http.cpp:1166] HTTP GET for /slave(804)/monitor/statistics.json from 172.17.0.3:32814
I0814 21:49:21.300318 30282 http.cpp:957] Authorizing principal 'test-principal' to GET the '/monitor/statistics.json' endpoint
I0814 21:49:21.302428 30291 slave.cpp:843] Agent terminating
[       OK ] Endpoint/SlaveEndpointTest.UnauthorizedRequest/1 (32 ms)
[ RUN      ] Endpoint/SlaveEndpointTest.UnauthorizedRequest/2
I0814 21:49:21.317034  9447 containerizer.cpp:246] Using isolation: posix/cpu,posix/mem,filesystem/posix,network/cni,environment_secret
W0814 21:49:21.317643  9447 backend.cpp:76] Failed to create 'aufs' backend: AufsBackend requires root privileges
W0814 21:49:21.317778  9447 backend.cpp:76] Failed to create 'bind' backend: BindBackend requires root privileges
I0814 21:49:21.317831  9447 provisioner.cpp:255] Using default backend 'copy'
I0814 21:49:21.321728 30297 slave.cpp:250] Mesos agent started on (805)@172.17.0.3:43610
I0814 21:49:21.321751 30297 slave.cpp:251] Flags at startup: --acls="" --appc_simple_discovery_uri_prefix="http://" --appc_store_dir="/tmp/Endpoint_SlaveEndpointTest_UnauthorizedRequest_2_7ylygC/store/appc" --authenticate_http_executors="true" --authenticate_http_readonly="true" --authenticate_http_readwrite="true" --authenticatee="crammd5" --authentication_backoff_factor="1secs" --authorizer="local" --cgroups_cpu_enable_pids_and_tids_count="false" --cgroups_enable_cfs="false" --cgroups_hierarchy="/sys/fs/cgroup" --cgroups_limit_swap="false" --cgroups_root="mesos" --container_disk_watch_interval="15secs" --containerizers="mesos" --credential="/tmp/Endpoint_SlaveEndpointTest_UnauthorizedRequest_2_7ylygC/credential" --default_role="*" --disk_watch_interval="1mins" --docker="docker" --docker_kill_orphans="true" --docker_registry="https://registry-1.docker.io" --docker_remove_delay="6hrs" --docker_socket="/var/run/docker.sock" --docker_stop_timeout="0ns" --docker_store_dir="/tmp/Endpoint_SlaveEndpointTest_UnauthorizedRequest_2_7ylygC/store/docker" --docker_volume_checkpoint_dir="/var/run/mesos/isolators/docker/volume" --enforce_container_disk_quota="false" --executor_registration_timeout="1mins" --executor_reregistration_timeout="2secs" --executor_secret_key="/tmp/Endpoint_SlaveEndpointTest_UnauthorizedRequest_2_7ylygC/executor_secret_key" --executor_shutdown_grace_period="5secs" --fetcher_cache_dir="/tmp/Endpoint_SlaveEndpointTest_UnauthorizedRequest_2_7ylygC/fetch" --fetcher_cache_size="2GB" --frameworks_home="" --gc_delay="1weeks" --gc_disk_headroom="0.1" --hadoop_home="" --help="false" --hostname_lookup="true" --http_command_executor="false" --http_credentials="/tmp/Endpoint_SlaveEndpointTest_UnauthorizedRequest_2_7ylygC/http_credentials" --http_heartbeat_interval="30secs" --initialize_driver_logging="true" --isolation="posix/cpu,posix/mem" --launcher="posix" --launcher_dir="/mesos/mesos-1.4.0/_build/src" --logbufsecs="0" --logging_level="INFO" --max_completed_executors_per_framework="150" --oversubscribed_resources_interval="15secs" --perf_duration="10secs" --perf_interval="1mins" --port="5051" --qos_correction_interval_min="0ns" --quiet="false" --recover="reconnect" --recovery_timeout="15mins" --registration_backoff_factor="10ms" --resources="cpus:2;gpus:0;mem:1024;disk:1024;ports:[31000-32000]" --revocable_cpu_low_priority="true" --runtime_dir="/tmp/Endpoint_SlaveEndpointTest_UnauthorizedRequest_2_7ylygC" --sandbox_directory="/mnt/mesos/sandbox" --strict="true" --switch_user="true" --systemd_enable_support="true" --systemd_runtime_directory="/run/systemd/system" --version="false" --work_dir="/tmp/Endpoint_SlaveEndpointTest_UnauthorizedRequest_2_ILjzx9"
I0814 21:49:21.322232 30297 credentials.hpp:86] Loading credential for authentication from '/tmp/Endpoint_SlaveEndpointTest_UnauthorizedRequest_2_7ylygC/credential'
I0814 21:49:21.322378 30297 slave.cpp:283] Agent using credential for: test-principal
I0814 21:49:21.322402 30297 credentials.hpp:37] Loading credentials for authentication from '/tmp/Endpoint_SlaveEndpointTest_UnauthorizedRequest_2_7ylygC/http_credentials'
I0814 21:49:21.322687 30297 http.cpp:1026] Creating default 'basic' HTTP authenticator for realm 'mesos-agent-executor'
I0814 21:49:21.322808 30297 http.cpp:1047] Creating default 'jwt' HTTP authenticator for realm 'mesos-agent-executor'
I0814 21:49:21.323014 30297 http.cpp:1026] Creating default 'basic' HTTP authenticator for realm 'mesos-agent-readonly'
I0814 21:49:21.323134 30297 http.cpp:1047] Creating default 'jwt' HTTP authenticator for realm 'mesos-agent-readonly'
I0814 21:49:21.323346 30297 http.cpp:1026] Creating default 'basic' HTTP authenticator for realm 'mesos-agent-readwrite'
I0814 21:49:21.323451 30297 http.cpp:1047] Creating default 'jwt' HTTP authenticator for realm 'mesos-agent-readwrite'
I0814 21:49:21.325842 30297 slave.cpp:565] Agent resources: [{"name":"cpus","scalar":{"value":2.0},"type":"SCALAR"},{"name":"mem","scalar":{"value":1024.0},"type":"SCALAR"},{"name":"disk","scalar":{"value":1024.0},"type":"SCALAR"},{"name":"ports","ranges":{"range":[{"begin":31000,"end":32000}]},"type":"RANGES"}]
I0814 21:49:21.326295 30297 slave.cpp:573] Agent attributes: [  ]
I0814 21:49:21.326310 30297 slave.cpp:582] Agent hostname: 231706a5482d
I0814 21:49:21.326524 30296 status_update_manager.cpp:177] Pausing sending status updates
I0814 21:49:21.328307 30287 state.cpp:64] Recovering state from '/tmp/Endpoint_SlaveEndpointTest_UnauthorizedRequest_2_ILjzx9/meta'
I0814 21:49:21.328570 30285 status_update_manager.cpp:203] Recovering status update manager
I0814 21:49:21.328753 30299 containerizer.cpp:598] Recovering containerizer
I0814 21:49:21.330030 30281 provisioner.cpp:416] Provisioner recovery complete
I0814 21:49:21.330348 30297 slave.cpp:6210] Finished recovery
I0814 21:49:21.330790 30297 slave.cpp:6392] Querying resource estimator for oversubscribable resources
I0814 21:49:21.331012 30288 slave.cpp:6406] Received oversubscribable resources {} from the resource estimator
I0814 21:49:21.332940 30296 process.cpp:3933] Handling HTTP event for process 'slave(805)' with path: '/slave(805)/containers'
I0814 21:49:21.334631 30303 http.cpp:1166] HTTP GET for /slave(805)/containers from 172.17.0.3:32822
I0814 21:49:21.334704 30303 http.cpp:957] Authorizing principal 'test-principal' to GET the '/containers' endpoint
I0814 21:49:21.336410 30301 slave.cpp:843] Agent terminating
[       OK ] Endpoint/SlaveEndpointTest.UnauthorizedRequest/2 (32 ms)
[ RUN      ] Endpoint/SlaveEndpointTest.NoAuthorizer/0
I0814 21:49:21.347288  9447 containerizer.cpp:246] Using isolation: posix/cpu,posix/mem,filesystem/posix,network/cni,environment_secret
W0814 21:49:21.347826  9447 backend.cpp:76] Failed to create 'aufs' backend: AufsBackend requires root privileges
W0814 21:49:21.347935  9447 backend.cpp:76] Failed to create 'bind' backend: BindBackend requires root privileges
I0814 21:49:21.347980  9447 provisioner.cpp:255] Using default backend 'copy'
I0814 21:49:21.349781  9447 cluster.cpp:448] Creating default 'local' authorizer
I0814 21:49:21.351660 30285 slave.cpp:250] Mesos agent started on (806)@172.17.0.3:43610
I0814 21:49:21.351680 30285 slave.cpp:251] Flags at startup: --acls="" --appc_simple_discovery_uri_prefix="http://" --appc_store_dir="/tmp/Endpoint_SlaveEndpointTest_NoAuthorizer_0_fipJqt/store/appc" --authenticate_http_executors="true" --authenticate_http_readonly="true" --authenticate_http_readwrite="true" --authenticatee="crammd5" --authentication_backoff_factor="1secs" --authorizer="local" --cgroups_cpu_enable_pids_and_tids_count="false" --cgroups_enable_cfs="false" --cgroups_hierarchy="/sys/fs/cgroup" --cgroups_limit_swap="false" --cgroups_root="mesos" --container_disk_watch_interval="15secs" --containerizers="mesos" --credential="/tmp/Endpoint_SlaveEndpointTest_NoAuthorizer_0_fipJqt/credential" --default_role="*" --disk_watch_interval="1mins" --docker="docker" --docker_kill_orphans="true" --docker_registry="https://registry-1.docker.io" --docker_remove_delay="6hrs" --docker_socket="/var/run/docker.sock" --docker_stop_timeout="0ns" --docker_store_dir="/tmp/Endpoint_SlaveEndpointTest_NoAuthorizer_0_fipJqt/store/docker" --docker_volume_checkpoint_dir="/var/run/mesos/isolators/docker/volume" --enforce_container_disk_quota="false" --executor_registration_timeout="1mins" --executor_reregistration_timeout="2secs" --executor_secret_key="/tmp/Endpoint_SlaveEndpointTest_NoAuthorizer_0_fipJqt/executor_secret_key" --executor_shutdown_grace_period="5secs" --fetcher_cache_dir="/tmp/Endpoint_SlaveEndpointTest_NoAuthorizer_0_fipJqt/fetch" --fetcher_cache_size="2GB" --frameworks_home="" --gc_delay="1weeks" --gc_disk_headroom="0.1" --hadoop_home="" --help="false" --hostname_lookup="true" --http_command_executor="false" --http_credentials="/tmp/Endpoint_SlaveEndpointTest_NoAuthorizer_0_fipJqt/http_credentials" --http_heartbeat_interval="30secs" --initialize_driver_logging="true" --isolation="posix/cpu,posix/mem" --launcher="posix" --launcher_dir="/mesos/mesos-1.4.0/_build/src" --logbufsecs="0" --logging_level="INFO" --max_completed_executors_per_framework="150" --oversubscribed_resources_interval="15secs" --perf_duration="10secs" --perf_interval="1mins" --port="5051" --qos_correction_interval_min="0ns" --quiet="false" --recover="reconnect" --recovery_timeout="15mins" --registration_backoff_factor="10ms" --resources="cpus:2;gpus:0;mem:1024;disk:1024;ports:[31000-32000]" --revocable_cpu_low_priority="true" --runtime_dir="/tmp/Endpoint_SlaveEndpointTest_NoAuthorizer_0_fipJqt" --sandbox_directory="/mnt/mesos/sandbox" --strict="true" --switch_user="true" --systemd_enable_support="true" --systemd_runtime_directory="/run/systemd/system" --version="false" --work_dir="/tmp/Endpoint_SlaveEndpointTest_NoAuthorizer_0_yhq6C0"
I0814 21:49:21.352083 30285 credentials.hpp:86] Loading credential for authentication from '/tmp/Endpoint_SlaveEndpointTest_NoAuthorizer_0_fipJqt/credential'
I0814 21:49:21.352232 30285 slave.cpp:283] Agent using credential for: test-principal
I0814 21:49:21.352260 30285 credentials.hpp:37] Loading credentials for authentication from '/tmp/Endpoint_SlaveEndpointTest_NoAuthorizer_0_fipJqt/http_credentials'
I0814 21:49:21.352604 30285 http.cpp:1026] Creating default 'basic' HTTP authenticator for realm 'mesos-agent-executor'
I0814 21:49:21.352733 30285 http.cpp:1047] Creating default 'jwt' HTTP authenticator for realm 'mesos-agent-executor'
I0814 21:49:21.352983 30285 http.cpp:1026] Creating default 'basic' HTTP authenticator for realm 'mesos-agent-readonly'
I0814 21:49:21.353104 30285 http.cpp:1047] Creating default 'jwt' HTTP authenticator for realm 'mesos-agent-readonly'
I0814 21:49:21.353335 30285 http.cpp:1026] Creating default 'basic' HTTP authenticator for realm 'mesos-agent-readwrite'
I0814 21:49:21.353448 30285 http.cpp:1047] Creating default 'jwt' HTTP authenticator for realm 'mesos-agent-readwrite'
I0814 21:49:21.354888 30285 slave.cpp:565] Agent resources: [{"name":"cpus","scalar":{"value":2.0},"type":"SCALAR"},{"name":"mem","scalar":{"value":1024.0},"type":"SCALAR"},{"name":"disk","scalar":{"value":1024.0},"type":"SCALAR"},{"name":"ports","ranges":{"range":[{"begin":31000,"end":32000}]},"type":"RANGES"}]
I0814 21:49:21.355118 30285 slave.cpp:573] Agent attributes: [  ]
I0814 21:49:21.355132 30285 slave.cpp:582] Agent hostname: 231706a5482d
I0814 21:49:21.355263 30299 status_update_manager.cpp:177] Pausing sending status updates
I0814 21:49:21.356765 30301 state.cpp:64] Recovering state from '/tmp/Endpoint_SlaveEndpointTest_NoAuthorizer_0_yhq6C0/meta'
I0814 21:49:21.357046 30282 status_update_manager.cpp:203] Recovering status update manager
I0814 21:49:21.357228 30296 containerizer.cpp:598] Recovering containerizer
I0814 21:49:21.358474 30303 provisioner.cpp:416] Provisioner recovery complete
I0814 21:49:21.358852 30285 slave.cpp:6210] Finished recovery
I0814 21:49:21.359272 30285 slave.cpp:6392] Querying resource estimator for oversubscribable resources
I0814 21:49:21.359515 30304 slave.cpp:6406] Received oversubscribable resources {} from the resource estimator
I0814 21:49:21.361543 30281 process.cpp:3933] Handling HTTP event for process 'slave(806)' with path: '/slave(806)/monitor/statistics'
I0814 21:49:21.363222 30298 http.cpp:1166] HTTP GET for /slave(806)/monitor/statistics from 172.17.0.3:32824
I0814 21:49:21.363315 30298 http.cpp:957] Authorizing principal 'test-principal' to GET the '/monitor/statistics' endpoint
I0814 21:49:21.366283 30304 slave.cpp:843] Agent terminating
[       OK ] Endpoint/SlaveEndpointTest.NoAuthorizer/0 (29 ms)
[ RUN      ] Endpoint/SlaveEndpointTest.NoAuthorizer/1
I0814 21:49:21.377159  9447 containerizer.cpp:246] Using isolation: posix/cpu,posix/mem,filesystem/posix,network/cni,environment_secret
W0814 21:49:21.377676  9447 backend.cpp:76] Failed to create 'aufs' backend: AufsBackend requires root privileges
W0814 21:49:21.377791  9447 backend.cpp:76] Failed to create 'bind' backend: BindBackend requires root privileges
I0814 21:49:21.377830  9447 provisioner.cpp:255] Using default backend 'copy'
I0814 21:49:21.379626  9447 cluster.cpp:448] Creating default 'local' authorizer
I0814 21:49:21.381392 30287 slave.cpp:250] Mesos agent started on (807)@172.17.0.3:43610
I0814 21:49:21.381412 30287 slave.cpp:251] Flags at startup: --acls="" --appc_simple_discovery_uri_prefix="http://" --appc_store_dir="/tmp/Endpoint_SlaveEndpointTest_NoAuthorizer_1_tOCtSk/store/appc" --authenticate_http_executors="true" --authenticate_http_readonly="true" --authenticate_http_readwrite="true" --authenticatee="crammd5" --authentication_backoff_factor="1secs" --authorizer="local" --cgroups_cpu_enable_pids_and_tids_count="false" --cgroups_enable_cfs="false" --cgroups_hierarchy="/sys/fs/cgroup" --cgroups_limit_swap="false" --cgroups_root="mesos" --container_disk_watch_interval="15secs" --containerizers="mesos" --credential="/tmp/Endpoint_SlaveEndpointTest_NoAuthorizer_1_tOCtSk/credential" --default_role="*" --disk_watch_interval="1mins" --docker="docker" --docker_kill_orphans="true" --docker_registry="https://registry-1.docker.io" --docker_remove_delay="6hrs" --docker_socket="/var/run/docker.sock" --docker_stop_timeout="0ns" --docker_store_dir="/tmp/Endpoint_SlaveEndpointTest_NoAuthorizer_1_tOCtSk/store/docker" --docker_volume_checkpoint_dir="/var/run/mesos/isolators/docker/volume" --enforce_container_disk_quota="false" --executor_registration_timeout="1mins" --executor_reregistration_timeout="2secs" --executor_secret_key="/tmp/Endpoint_SlaveEndpointTest_NoAuthorizer_1_tOCtSk/executor_secret_key" --executor_shutdown_grace_period="5secs" --fetcher_cache_dir="/tmp/Endpoint_SlaveEndpointTest_NoAuthorizer_1_tOCtSk/fetch" --fetcher_cache_size="2GB" --frameworks_home="" --gc_delay="1weeks" --gc_disk_headroom="0.1" --hadoop_home="" --help="false" --hostname_lookup="true" --http_command_executor="false" --http_credentials="/tmp/Endpoint_SlaveEndpointTest_NoAuthorizer_1_tOCtSk/http_credentials" --http_heartbeat_interval="30secs" --initialize_driver_logging="true" --isolation="posix/cpu,posix/mem" --launcher="posix" --launcher_dir="/mesos/mesos-1.4.0/_build/src" --logbufsecs="0" --logging_level="INFO" --max_completed_executors_per_framework="150" --oversubscribed_resources_interval="15secs" --perf_duration="10secs" --perf_interval="1mins" --port="5051" --qos_correction_interval_min="0ns" --quiet="false" --recover="reconnect" --recovery_timeout="15mins" --registration_backoff_factor="10ms" --resources="cpus:2;gpus:0;mem:1024;disk:1024;ports:[31000-32000]" --revocable_cpu_low_priority="true" --runtime_dir="/tmp/Endpoint_SlaveEndpointTest_NoAuthorizer_1_tOCtSk" --sandbox_directory="/mnt/mesos/sandbox" --strict="true" --switch_user="true" --systemd_enable_support="true" --systemd_runtime_directory="/run/systemd/system" --version="false" --work_dir="/tmp/Endpoint_SlaveEndpointTest_NoAuthorizer_1_OA9o0R"
I0814 21:49:21.381783 30287 credentials.hpp:86] Loading credential for authentication from '/tmp/Endpoint_SlaveEndpointTest_NoAuthorizer_1_tOCtSk/credential'
I0814 21:49:21.381925 30287 slave.cpp:283] Agent using credential for: test-principal
I0814 21:49:21.381947 30287 credentials.hpp:37] Loading credentials for authentication from '/tmp/Endpoint_SlaveEndpointTest_NoAuthorizer_1_tOCtSk/http_credentials'
I0814 21:49:21.382226 30287 http.cpp:1026] Creating default 'basic' HTTP authenticator for realm 'mesos-agent-executor'
I0814 21:49:21.382344 30287 http.cpp:1047] Creating default 'jwt' HTTP authenticator for realm 'mesos-agent-executor'
I0814 21:49:21.382541 30287 http.cpp:1026] Creating default 'basic' HTTP authenticator for realm 'mesos-agent-readonly'
I0814 21:49:21.382642 30287 http.cpp:1047] Creating default 'jwt' HTTP authenticator for realm 'mesos-agent-readonly'
I0814 21:49:21.382822 30287 http.cpp:1026] Creating default 'basic' HTTP authenticator for realm 'mesos-agent-readwrite'
I0814 21:49:21.382921 30287 http.cpp:1047] Creating default 'jwt' HTTP authenticator for realm 'mesos-agent-readwrite'
I0814 21:49:21.384275 30287 slave.cpp:565] Agent resources: [{"name":"cpus","scalar":{"value":2.0},"type":"SCALAR"},{"name":"mem","scalar":{"value":1024.0},"type":"SCALAR"},{"name":"disk","scalar":{"value":1024.0},"type":"SCALAR"},{"name":"ports","ranges":{"range":[{"begin":31000,"end":32000}]},"type":"RANGES"}]
I0814 21:49:21.384506 30287 slave.cpp:573] Agent attributes: [  ]
I0814 21:49:21.384521 30287 slave.cpp:582] Agent hostname: 231706a5482d
I0814 21:49:21.384667 30295 status_update_manager.cpp:177] Pausing sending status updates
I0814 21:49:21.386126 30297 state.cpp:64] Recovering state from '/tmp/Endpoint_SlaveEndpointTest_NoAuthorizer_1_OA9o0R/meta'
I0814 21:49:21.386404 30298 status_update_manager.cpp:203] Recovering status update manager
I0814 21:49:21.386590 30304 containerizer.cpp:598] Recovering containerizer
I0814 21:49:21.387996 30302 provisioner.cpp:416] Provisioner recovery complete
I0814 21:49:21.388293 30287 slave.cpp:6210] Finished recovery
I0814 21:49:21.388705 30287 slave.cpp:6392] Querying resource estimator for oversubscribable resources
I0814 21:49:21.388927 30299 slave.cpp:6406] Received oversubscribable resources {} from the resource estimator
I0814 21:49:21.390877 30291 process.cpp:3933] Handling HTTP event for process 'slave(807)' with path: '/slave(807)/monitor/statistics.json'
I0814 21:49:21.392639 30285 http.cpp:1166] HTTP GET for /slave(807)/monitor/statistics.json from 172.17.0.3:32828
I0814 21:49:21.392705 30285 http.cpp:957] Authorizing principal 'test-principal' to GET the '/monitor/statistics.json' endpoint
I0814 21:49:21.395989 30297 slave.cpp:843] Agent terminating
[       OK ] Endpoint/SlaveEndpointTest.NoAuthorizer/1 (29 ms)
[ RUN      ] Endpoint/SlaveEndpointTest.NoAuthorizer/2
I0814 21:49:21.406618  9447 containerizer.cpp:246] Using isolation: posix/cpu,posix/mem,filesystem/posix,network/cni,environment_secret
W0814 21:49:21.407122  9447 backend.cpp:76] Failed to create 'aufs' backend: AufsBackend requires root privileges
W0814 21:49:21.407249  9447 backend.cpp:76] Failed to create 'bind' backend: BindBackend requires root privileges
I0814 21:49:21.407284  9447 provisioner.cpp:255] Using default backend 'copy'
I0814 21:49:21.409006  9447 cluster.cpp:448] Creating default 'local' authorizer
I0814 21:49:21.411415 30289 slave.cpp:250] Mesos agent started on (808)@172.17.0.3:43610
I0814 21:49:21.411437 30289 slave.cpp:251] Flags at startup: --acls="" --appc_simple_discovery_uri_prefix="http://" --appc_store_dir="/tmp/Endpoint_SlaveEndpointTest_NoAuthorizer_2_zf1LBc/store/appc" --authenticate_http_executors="true" --authenticate_http_readonly="true" --authenticate_http_readwrite="true" --authenticatee="crammd5" --authentication_backoff_factor="1secs" --authorizer="local" --cgroups_cpu_enable_pids_and_tids_count="false" --cgroups_enable_cfs="false" --cgroups_hierarchy="/sys/fs/cgroup" --cgroups_limit_swap="false" --cgroups_root="mesos" --container_disk_watch_interval="15secs" --containerizers="mesos" --credential="/tmp/Endpoint_SlaveEndpointTest_NoAuthorizer_2_zf1LBc/credential" --default_role="*" --disk_watch_interval="1mins" --docker="docker" --docker_kill_orphans="true" --docker_registry="https://registry-1.docker.io" --docker_remove_delay="6hrs" --docker_socket="/var/run/docker.sock" --docker_stop_timeout="0ns" --docker_store_dir="/tmp/Endpoint_SlaveEndpointTest_NoAuthorizer_2_zf1LBc/store/docker" --docker_volume_checkpoint_dir="/var/run/mesos/isolators/docker/volume" --enforce_container_disk_quota="false" --executor_registration_timeout="1mins" --executor_reregistration_timeout="2secs" --executor_secret_key="/tmp/Endpoint_SlaveEndpointTest_NoAuthorizer_2_zf1LBc/executor_secret_key" --executor_shutdown_grace_period="5secs" --fetcher_cache_dir="/tmp/Endpoint_SlaveEndpointTest_NoAuthorizer_2_zf1LBc/fetch" --fetcher_cache_size="2GB" --frameworks_home="" --gc_delay="1weeks" --gc_disk_headroom="0.1" --hadoop_home="" --help="false" --hostname_lookup="true" --http_command_executor="false" --http_credentials="/tmp/Endpoint_SlaveEndpointTest_NoAuthorizer_2_zf1LBc/http_credentials" --http_heartbeat_interval="30secs" --initialize_driver_logging="true" --isolation="posix/cpu,posix/mem" --launcher="posix" --launcher_dir="/mesos/mesos-1.4.0/_build/src" --logbufsecs="0" --logging_level="INFO" --max_completed_executors_per_framework="150" --oversubscribed_resources_interval="15secs" --perf_duration="10secs" --perf_interval="1mins" --port="5051" --qos_correction_interval_min="0ns" --quiet="false" --recover="reconnect" --recovery_timeout="15mins" --registration_backoff_factor="10ms" --resources="cpus:2;gpus:0;mem:1024;disk:1024;ports:[31000-32000]" --revocable_cpu_low_priority="true" --runtime_dir="/tmp/Endpoint_SlaveEndpointTest_NoAuthorizer_2_zf1LBc" --sandbox_directory="/mnt/mesos/sandbox" --strict="true" --switch_user="true" --systemd_enable_support="true" --systemd_runtime_directory="/run/systemd/system" --version="false" --work_dir="/tmp/Endpoint_SlaveEndpointTest_NoAuthorizer_2_u8sjFJ"
I0814 21:49:21.411829 30289 credentials.hpp:86] Loading credential for authentication from '/tmp/Endpoint_SlaveEndpointTest_NoAuthorizer_2_zf1LBc/credential'
I0814 21:49:21.411990 30289 slave.cpp:283] Agent using credential for: test-principal
I0814 21:49:21.412014 30289 credentials.hpp:37] Loading credentials for authentication from '/tmp/Endpoint_SlaveEndpointTest_NoAuthorizer_2_zf1LBc/http_credentials'
I0814 21:49:21.412317 30289 http.cpp:1026] Creating default 'basic' HTTP authenticator for realm 'mesos-agent-executor'
I0814 21:49:21.412447 30289 http.cpp:1047] Creating default 'jwt' HTTP authenticator for realm 'mesos-agent-executor'
I0814 21:49:21.412663 30289 http.cpp:1026] Creating default 'basic' HTTP authenticator for realm 'mesos-agent-readonly'
I0814 21:49:21.412777 30289 http.cpp:1047] Creating default 'jwt' HTTP authenticator for realm 'mesos-agent-readonly'
I0814 21:49:21.412993 30289 http.cpp:1026] Creating default 'basic' HTTP authenticator for realm 'mesos-agent-readwrite'
I0814 21:49:21.413106 30289 http.cpp:1047] Creating default 'jwt' HTTP authenticator for realm 'mesos-agent-readwrite'
I0814 21:49:21.414471 30289 slave.cpp:565] Agent resources: [{"name":"cpus","scalar":{"value":2.0},"type":"SCALAR"},{"name":"mem","scalar":{"value":1024.0},"type":"SCALAR"},{"name":"disk","scalar":{"value":1024.0},"type":"SCALAR"},{"name":"ports","ranges":{"range":[{"begin":31000,"end":32000}]},"type":"RANGES"}]
I0814 21:49:21.414702 30289 slave.cpp:573] Agent attributes: [  ]
I0814 21:49:21.414723 30289 slave.cpp:582] Agent hostname: 231706a5482d
I0814 21:49:21.414845 30301 status_update_manager.cpp:177] Pausing sending status updates
I0814 21:49:21.416293 30286 state.cpp:64] Recovering state from '/tmp/Endpoint_SlaveEndpointTest_NoAuthorizer_2_u8sjFJ/meta'
I0814 21:49:21.416529 30296 status_update_manager.cpp:203] Recovering status update manager
I0814 21:49:21.416743 30284 containerizer.cpp:598] Recovering containerizer
I0814 21:49:21.418046 30290 provisioner.cpp:416] Provisioner recovery complete
I0814 21:49:21.418360 30289 slave.cpp:6210] Finished recovery
I0814 21:49:21.418757 30289 slave.cpp:6392] Querying resource estimator for oversubscribable resources
I0814 21:49:21.419001 30304 slave.cpp:6406] Received oversubscribable resources {} from the resource estimator
I0814 21:49:21.420881 30302 process.cpp:3933] Handling HTTP event for process 'slave(808)' with path: '/slave(808)/containers'
I0814 21:49:21.422526 30298 http.cpp:1166] HTTP GET for /slave(808)/containers from 172.17.0.3:32834
I0814 21:49:21.422600 30298 http.cpp:957] Authorizing principal 'test-principal' to GET the '/containers' endpoint
I0814 21:49:21.425914 30300 slave.cpp:843] Agent terminating
[       OK ] Endpoint/SlaveEndpointTest.NoAuthorizer/2 (31 ms)
[----------] 9 tests from Endpoint/SlaveEndpointTest (271 ms total)

[----------] 2 tests from ContainerizerType/DefaultContainerDNSFlagTest
[ RUN      ] ContainerizerType/DefaultContainerDNSFlagTest.ValidateFlag/0
[       OK ] ContainerizerType/DefaultContainerDNSFlagTest.ValidateFlag/0 (13 ms)
[ RUN      ] ContainerizerType/DefaultContainerDNSFlagTest.ValidateFlag/1
[       OK ] ContainerizerType/DefaultContainerDNSFlagTest.ValidateFlag/1 (11 ms)
[----------] 2 tests from ContainerizerType/DefaultContainerDNSFlagTest (25 ms total)

[----------] Global test environment tear-down
[==========] 1660 tests from 184 test cases ran. (593105 ms total)
[  PASSED  ] 1657 tests.
[  FAILED  ] 3 tests, listed below:
[  FAILED  ] CommandExecutorCheckTest.CommandCheckDeliveredAndReconciled
[  FAILED  ] DefaultExecutorCheckTest.CommandCheckDeliveredAndReconciled
[  FAILED  ] DefaultExecutorCheckTest.CommandCheckStatusChange

 3 FAILED TESTS
  YOU HAVE 20 DISABLED TESTS

I0814 21:49:21.519671 30305 process.cpp:1072] Failed to accept socket: future discarded
make[4]: *** [check-local] Error 1
make[4]: Leaving directory `/mesos/mesos-1.4.0/_build/src'
make[3]: *** [check-am] Error 2
make[3]: Leaving directory `/mesos/mesos-1.4.0/_build/src'
make[2]: *** [check] Error 2
make[2]: Leaving directory `/mesos/mesos-1.4.0/_build/src'
make[1]: *** [check-recursive] Error 1
make[1]: Leaving directory `/mesos/mesos-1.4.0/_build'
make: *** [distcheck] Error 1
+ docker rmi mesos-1502744653-8493
Untagged: mesos-1502744653-8493:latest
Deleted: sha256:21a7cea318da4ec2555dc1b5926e14034f83a244b24bc9f516cdf438eb7d2ded
Deleted: sha256:aefea8b7eee532d9056d5af3e7c03d6534c779062c0b66c33ac105a54de41bb9
Deleted: sha256:5b61f694f5cff2c7d182a294889bc98166a101d040642b42ef8d9c21d515c8e4
Deleted: sha256:848e84ba84fdcd6478d7424cd51d8d2bcb06b8d0e53310e2c93d3254e215c299
Deleted: sha256:9654e42b34f37df815eff657dc924df3a32e890f348a4e0bd1ff84697b55cd57
Deleted: sha256:4b0f5bc16a078d395c502ebde346e2c43a8392ea554b2c16f4fc5bf9a45d3509
Deleted: sha256:a5a11123e0342b67d34635bf537288d0f9c17e898e2e9026573478f09721fcee
Deleted: sha256:e74aec87145343fda5527e79fc834ead3d07712bc289eb2c769f3979ba4829fc
Deleted: sha256:e3dfb2d1920342ceb286941fdf6441eee4d1af6a78d413b4f7550500ec722bf1
Deleted: sha256:02c9d2589cb794fc46186b79dcabd2d4a16b5b8d46173376d9ecadf70e95cdb2
Deleted: sha256:85acc2ab8e7c318949cec1b826e7b7795b47a7d2f23a8fd6ecaf8f704ab75921
Deleted: sha256:eca3c53257fe598be6fcd12116e953c9a811597aade7f428e589fe5d3ef7e752
Deleted: sha256:8d787f8a7719b35a0ad49f9d14ea8e34e7ebae4d497e26934f0e20b6a1c9cb9e
Deleted: sha256:5a4438ca44e43bfee1f8115bcb6678fdf2495f1a784680a885ecca733667c8e8
Deleted: sha256:30efb969df7f90e941ab668146aefa01427ef4231f87088dc6d47932dc333941
Deleted: sha256:1e5c9fdffb55ad893a38687341e4ad346873ad14331505d6c0bd896b69c456e4
Deleted: sha256:cb195a53f301f1d8ddaeed2c845747ced4cb08e12ab41aad9f2afd31f61db356
Deleted: sha256:2da9dc592e9e6e8dc1ec6555863435d48390d35d5778f7fee45dd5b83e38dd74
Deleted: sha256:0c7a1c9dc9c41ed493da25ad2aa78acdb91abdaedaddb525857ad8a87db0c0f3
Deleted: sha256:288b7adb5df0ae809f39ab652e0d4234b6d8f81fc85bef2cb4671a87469d52d1
Deleted: sha256:9dfcc6d766a480a0a932b817c94906fda4db56ba60de39f6733f18158f435efd
Deleted: sha256:b7a52005f278d27d6d2c0657795e64b375a5fa27b5ab8acb85b6641f0b9155f5
Deleted: sha256:52c491b0cbac5eb47f609ab01c3b1237a166ad1ab2255ed5361cc2b51152cf96
Deleted: sha256:bd0b1f4ff641e1d366e9fc8d4208ac88aa917cd9ef9b0b715ce99492adbd9790
Deleted: sha256:2962c41aa3190f9b296bc82756870abce1ef083ca0ba5b50f9055d5d1c99e605
Build step 'Execute shell' marked build as failure
Not sending mail to unregistered user gregorywmann@gmail.com

Jenkins build is back to normal : Mesos-Buildbot » autotools,gcc,--verbose --enable-libevent --enable-ssl,GLOG_v=1 MESOS_VERBOSE=1,centos:7,(ubuntu)&&(!ubuntu-us1)&&(!ubuntu-eu2) #4107

Posted by Apache Jenkins Server <je...@builds.apache.org>.
See <https://builds.apache.org/job/Mesos-Buildbot/BUILDTOOL=autotools,COMPILER=gcc,CONFIGURATION=--verbose%20--enable-libevent%20--enable-ssl,ENVIRONMENT=GLOG_v=1%20MESOS_VERBOSE=1,OS=centos%3A7,label_exp=(ubuntu)&&(!ubuntu-us1)&&(!ubuntu-eu2)/4107/display/redirect?page=changes>