You are viewing a plain text version of this content. The canonical link for it is here.
Posted to oak-dev@jackrabbit.apache.org by Apache Jenkins Server <je...@builds.apache.org> on 2020/07/28 17:42:43 UTC

BUILD FAILURE: Jackrabbit Oak - Build # 2836 - Failure

The Apache Jenkins build system has built Jackrabbit Oak (build #2836)

Status: Failure

Check console output at https://builds.apache.org/job/Jackrabbit%20Oak/2836/ to view the results.

Changes:
[mkataria] OAK-9151: Support term suggestion in Oak ES

 

Test results:
8 tests failed.
FAILED:  org.apache.jackrabbit.oak.plugins.index.elastic.ElasticIndexSuggestionCommonTest.suggestNodeName

Error Message:
Condition not satisfied after 9.10 seconds and 78 attempts

Stack Trace:
java.lang.AssertionError: Condition not satisfied after 9.10 seconds and 78 attempts
	at org.apache.jackrabbit.oak.plugins.index.TestUtils.assertEventually(TestUtils.java:43)
	at org.apache.jackrabbit.oak.plugins.index.IndexSuggestionCommonTest.assertEventually(IndexSuggestionCommonTest.java:367)
	at org.apache.jackrabbit.oak.plugins.index.IndexSuggestionCommonTest.suggestNodeName(IndexSuggestionCommonTest.java:196)
	at sun.reflect.NativeMethodAccessorImpl.invoke0(Native Method)
	at sun.reflect.NativeMethodAccessorImpl.invoke(NativeMethodAccessorImpl.java:62)
	at sun.reflect.DelegatingMethodAccessorImpl.invoke(DelegatingMethodAccessorImpl.java:43)
	at java.lang.reflect.Method.invoke(Method.java:498)
	at org.junit.runners.model.FrameworkMethod$1.runReflectiveCall(FrameworkMethod.java:50)
	at org.junit.internal.runners.model.ReflectiveCallable.run(ReflectiveCallable.java:12)
	at org.junit.runners.model.FrameworkMethod.invokeExplosively(FrameworkMethod.java:47)
	at org.junit.internal.runners.statements.InvokeMethod.evaluate(InvokeMethod.java:17)
	at org.junit.internal.runners.statements.RunBefores.evaluate(RunBefores.java:26)
	at org.junit.internal.runners.statements.RunAfters.evaluate(RunAfters.java:27)
	at org.junit.runners.ParentRunner.runLeaf(ParentRunner.java:325)
	at org.junit.runners.BlockJUnit4ClassRunner.runChild(BlockJUnit4ClassRunner.java:78)
	at org.junit.runners.BlockJUnit4ClassRunner.runChild(BlockJUnit4ClassRunner.java:57)
	at org.junit.runners.ParentRunner$3.run(ParentRunner.java:290)
	at org.junit.runners.ParentRunner$1.schedule(ParentRunner.java:71)
	at org.junit.runners.ParentRunner.runChildren(ParentRunner.java:288)
	at org.junit.runners.ParentRunner.access$000(ParentRunner.java:58)
	at org.junit.runners.ParentRunner$2.evaluate(ParentRunner.java:268)
	at org.junit.rules.ExternalResource$1.evaluate(ExternalResource.java:48)
	at org.testcontainers.containers.FailureDetectingExternalResource$1.evaluate(FailureDetectingExternalResource.java:30)
	at org.junit.rules.RunRules.evaluate(RunRules.java:20)
	at org.junit.runners.ParentRunner.run(ParentRunner.java:363)
	at org.apache.maven.surefire.junit4.JUnit4Provider.execute(JUnit4Provider.java:365)
	at org.apache.maven.surefire.junit4.JUnit4Provider.executeWithRerun(JUnit4Provider.java:273)
	at org.apache.maven.surefire.junit4.JUnit4Provider.executeTestSet(JUnit4Provider.java:238)
	at org.apache.maven.surefire.junit4.JUnit4Provider.invoke(JUnit4Provider.java:159)
	at org.apache.maven.surefire.booter.ForkedBooter.invokeProviderInSameClassLoader(ForkedBooter.java:384)
	at org.apache.maven.surefire.booter.ForkedBooter.runSuitesInProcess(ForkedBooter.java:345)
	at org.apache.maven.surefire.booter.ForkedBooter.execute(ForkedBooter.java:126)
	at org.apache.maven.surefire.booter.ForkedBooter.main(ForkedBooter.java:418)
Caused by: java.lang.AssertionError: Node name should be suggested expected:<indexedNode> but was:<null>
	at org.junit.Assert.fail(Assert.java:88)
	at org.junit.Assert.failNotEquals(Assert.java:834)
	at org.junit.Assert.assertEquals(Assert.java:118)
	at org.apache.jackrabbit.oak.plugins.index.IndexSuggestionCommonTest.lambda$suggestNodeName$2(IndexSuggestionCommonTest.java:198)
	at org.apache.jackrabbit.oak.plugins.index.TestUtils.assertEventually(TestUtils.java:35)
	... 32 more


FAILED:  org.apache.jackrabbit.oak.plugins.index.elastic.ElasticIndexSuggestionCommonTest.testMultipleSuggestions

Error Message:
Condition not satisfied after 9.07 seconds and 83 attempts

Stack Trace:
java.lang.AssertionError: Condition not satisfied after 9.07 seconds and 83 attempts
	at org.apache.jackrabbit.oak.plugins.index.TestUtils.assertEventually(TestUtils.java:43)
	at org.apache.jackrabbit.oak.plugins.index.IndexSuggestionCommonTest.assertEventually(IndexSuggestionCommonTest.java:367)
	at org.apache.jackrabbit.oak.plugins.index.IndexSuggestionCommonTest.checkSuggestions(IndexSuggestionCommonTest.java:141)
	at org.apache.jackrabbit.oak.plugins.index.IndexSuggestionCommonTest.checkSuggestions(IndexSuggestionCommonTest.java:102)
	at org.apache.jackrabbit.oak.plugins.index.IndexSuggestionCommonTest.testMultipleSuggestions(IndexSuggestionCommonTest.java:318)
	at sun.reflect.NativeMethodAccessorImpl.invoke0(Native Method)
	at sun.reflect.NativeMethodAccessorImpl.invoke(NativeMethodAccessorImpl.java:62)
	at sun.reflect.DelegatingMethodAccessorImpl.invoke(DelegatingMethodAccessorImpl.java:43)
	at java.lang.reflect.Method.invoke(Method.java:498)
	at org.junit.runners.model.FrameworkMethod$1.runReflectiveCall(FrameworkMethod.java:50)
	at org.junit.internal.runners.model.ReflectiveCallable.run(ReflectiveCallable.java:12)
	at org.junit.runners.model.FrameworkMethod.invokeExplosively(FrameworkMethod.java:47)
	at org.junit.internal.runners.statements.InvokeMethod.evaluate(InvokeMethod.java:17)
	at org.junit.internal.runners.statements.RunBefores.evaluate(RunBefores.java:26)
	at org.junit.internal.runners.statements.RunAfters.evaluate(RunAfters.java:27)
	at org.junit.runners.ParentRunner.runLeaf(ParentRunner.java:325)
	at org.junit.runners.BlockJUnit4ClassRunner.runChild(BlockJUnit4ClassRunner.java:78)
	at org.junit.runners.BlockJUnit4ClassRunner.runChild(BlockJUnit4ClassRunner.java:57)
	at org.junit.runners.ParentRunner$3.run(ParentRunner.java:290)
	at org.junit.runners.ParentRunner$1.schedule(ParentRunner.java:71)
	at org.junit.runners.ParentRunner.runChildren(ParentRunner.java:288)
	at org.junit.runners.ParentRunner.access$000(ParentRunner.java:58)
	at org.junit.runners.ParentRunner$2.evaluate(ParentRunner.java:268)
	at org.junit.rules.ExternalResource$1.evaluate(ExternalResource.java:48)
	at org.testcontainers.containers.FailureDetectingExternalResource$1.evaluate(FailureDetectingExternalResource.java:30)
	at org.junit.rules.RunRules.evaluate(RunRules.java:20)
	at org.junit.runners.ParentRunner.run(ParentRunner.java:363)
	at org.apache.maven.surefire.junit4.JUnit4Provider.execute(JUnit4Provider.java:365)
	at org.apache.maven.surefire.junit4.JUnit4Provider.executeWithRerun(JUnit4Provider.java:273)
	at org.apache.maven.surefire.junit4.JUnit4Provider.executeTestSet(JUnit4Provider.java:238)
	at org.apache.maven.surefire.junit4.JUnit4Provider.invoke(JUnit4Provider.java:159)
	at org.apache.maven.surefire.booter.ForkedBooter.invokeProviderInSameClassLoader(ForkedBooter.java:384)
	at org.apache.maven.surefire.booter.ForkedBooter.runSuitesInProcess(ForkedBooter.java:345)
	at org.apache.maven.surefire.booter.ForkedBooter.execute(ForkedBooter.java:126)
	at org.apache.maven.surefire.booter.ForkedBooter.main(ForkedBooter.java:418)
Caused by: java.lang.AssertionError: There should be some suggestion
	at org.junit.Assert.fail(Assert.java:88)
	at org.junit.Assert.assertTrue(Assert.java:41)
	at org.junit.Assert.assertNotNull(Assert.java:712)
	at org.apache.jackrabbit.oak.plugins.index.IndexSuggestionCommonTest.lambda$checkSuggestions$0(IndexSuggestionCommonTest.java:143)
	at org.apache.jackrabbit.oak.plugins.index.TestUtils.assertEventually(TestUtils.java:35)
	... 34 more


FAILED:  org.apache.jackrabbit.oak.plugins.index.elastic.ElasticIndexSuggestionCommonTest.testSuggestQueryWithUserAccess

Error Message:
Condition not satisfied after 9.02 seconds and 79 attempts

Stack Trace:
java.lang.AssertionError: Condition not satisfied after 9.02 seconds and 79 attempts
	at org.apache.jackrabbit.oak.plugins.index.TestUtils.assertEventually(TestUtils.java:43)
	at org.apache.jackrabbit.oak.plugins.index.IndexSuggestionCommonTest.assertEventually(IndexSuggestionCommonTest.java:367)
	at org.apache.jackrabbit.oak.plugins.index.IndexSuggestionCommonTest.checkSuggestions(IndexSuggestionCommonTest.java:141)
	at org.apache.jackrabbit.oak.plugins.index.IndexSuggestionCommonTest.checkSuggestions(IndexSuggestionCommonTest.java:102)
	at org.apache.jackrabbit.oak.plugins.index.IndexSuggestionCommonTest.testSuggestQueryWithUserAccess(IndexSuggestionCommonTest.java:272)
	at sun.reflect.NativeMethodAccessorImpl.invoke0(Native Method)
	at sun.reflect.NativeMethodAccessorImpl.invoke(NativeMethodAccessorImpl.java:62)
	at sun.reflect.DelegatingMethodAccessorImpl.invoke(DelegatingMethodAccessorImpl.java:43)
	at java.lang.reflect.Method.invoke(Method.java:498)
	at org.junit.runners.model.FrameworkMethod$1.runReflectiveCall(FrameworkMethod.java:50)
	at org.junit.internal.runners.model.ReflectiveCallable.run(ReflectiveCallable.java:12)
	at org.junit.runners.model.FrameworkMethod.invokeExplosively(FrameworkMethod.java:47)
	at org.junit.internal.runners.statements.InvokeMethod.evaluate(InvokeMethod.java:17)
	at org.junit.internal.runners.statements.RunBefores.evaluate(RunBefores.java:26)
	at org.junit.internal.runners.statements.RunAfters.evaluate(RunAfters.java:27)
	at org.junit.runners.ParentRunner.runLeaf(ParentRunner.java:325)
	at org.junit.runners.BlockJUnit4ClassRunner.runChild(BlockJUnit4ClassRunner.java:78)
	at org.junit.runners.BlockJUnit4ClassRunner.runChild(BlockJUnit4ClassRunner.java:57)
	at org.junit.runners.ParentRunner$3.run(ParentRunner.java:290)
	at org.junit.runners.ParentRunner$1.schedule(ParentRunner.java:71)
	at org.junit.runners.ParentRunner.runChildren(ParentRunner.java:288)
	at org.junit.runners.ParentRunner.access$000(ParentRunner.java:58)
	at org.junit.runners.ParentRunner$2.evaluate(ParentRunner.java:268)
	at org.junit.rules.ExternalResource$1.evaluate(ExternalResource.java:48)
	at org.testcontainers.containers.FailureDetectingExternalResource$1.evaluate(FailureDetectingExternalResource.java:30)
	at org.junit.rules.RunRules.evaluate(RunRules.java:20)
	at org.junit.runners.ParentRunner.run(ParentRunner.java:363)
	at org.apache.maven.surefire.junit4.JUnit4Provider.execute(JUnit4Provider.java:365)
	at org.apache.maven.surefire.junit4.JUnit4Provider.executeWithRerun(JUnit4Provider.java:273)
	at org.apache.maven.surefire.junit4.JUnit4Provider.executeTestSet(JUnit4Provider.java:238)
	at org.apache.maven.surefire.junit4.JUnit4Provider.invoke(JUnit4Provider.java:159)
	at org.apache.maven.surefire.booter.ForkedBooter.invokeProviderInSameClassLoader(ForkedBooter.java:384)
	at org.apache.maven.surefire.booter.ForkedBooter.runSuitesInProcess(ForkedBooter.java:345)
	at org.apache.maven.surefire.booter.ForkedBooter.execute(ForkedBooter.java:126)
	at org.apache.maven.surefire.booter.ForkedBooter.main(ForkedBooter.java:418)
Caused by: java.lang.NullPointerException
	at com.google.common.base.Preconditions.checkNotNull(Preconditions.java:192)
	at org.apache.jackrabbit.oak.plugins.memory.StringPropertyState.<init>(StringPropertyState.java:35)
	at org.apache.jackrabbit.oak.plugins.memory.StringPropertyState.stringProperty(StringPropertyState.java:46)
	at org.apache.jackrabbit.oak.plugins.memory.PropertyValues.newString(PropertyValues.java:67)
	at org.apache.jackrabbit.oak.plugins.index.search.spi.query.FulltextIndex$FulltextPathCursor$2.getValue(FulltextIndex.java:478)
	at org.apache.jackrabbit.oak.query.ast.SelectorImpl.currentOakProperty(SelectorImpl.java:791)
	at org.apache.jackrabbit.oak.query.ast.SelectorImpl.currentOakProperty(SelectorImpl.java:765)
	at org.apache.jackrabbit.oak.query.ast.SelectorImpl.currentOakProperty(SelectorImpl.java:696)
	at org.apache.jackrabbit.oak.query.ast.SelectorImpl.currentProperty(SelectorImpl.java:672)
	at org.apache.jackrabbit.oak.query.ast.ColumnImpl.currentProperty(ColumnImpl.java:59)
	at org.apache.jackrabbit.oak.query.QueryImpl.currentRow(QueryImpl.java:939)
	at org.apache.jackrabbit.oak.query.QueryImpl$RowIterator.fetchNext(QueryImpl.java:878)
	at org.apache.jackrabbit.oak.query.QueryImpl$RowIterator.hasNext(QueryImpl.java:903)
	at org.apache.jackrabbit.oak.jcr.query.QueryResultImpl$1.fetch(QueryResultImpl.java:103)
	at org.apache.jackrabbit.oak.jcr.query.QueryResultImpl$1.<init>(QueryResultImpl.java:99)
	at org.apache.jackrabbit.oak.jcr.query.QueryResultImpl.getRows(QueryResultImpl.java:83)
	at org.apache.jackrabbit.oak.plugins.index.IndexSuggestionCommonTest.getResult(IndexSuggestionCommonTest.java:165)
	at org.apache.jackrabbit.oak.plugins.index.IndexSuggestionCommonTest.lambda$checkSuggestions$0(IndexSuggestionCommonTest.java:143)
	at org.apache.jackrabbit.oak.plugins.index.TestUtils.assertEventually(TestUtils.java:35)
	... 34 more


FAILED:  org.apache.jackrabbit.oak.plugins.index.elastic.ElasticIndexSuggestionCommonTest.testSuggestQueryOnNonNtBase

Error Message:
Condition not satisfied after 9.04 seconds and 84 attempts

Stack Trace:
java.lang.AssertionError: Condition not satisfied after 9.04 seconds and 84 attempts
	at org.apache.jackrabbit.oak.plugins.index.TestUtils.assertEventually(TestUtils.java:43)
	at org.apache.jackrabbit.oak.plugins.index.IndexSuggestionCommonTest.assertEventually(IndexSuggestionCommonTest.java:367)
	at org.apache.jackrabbit.oak.plugins.index.IndexSuggestionCommonTest.checkSuggestions(IndexSuggestionCommonTest.java:141)
	at org.apache.jackrabbit.oak.plugins.index.IndexSuggestionCommonTest.checkSuggestions(IndexSuggestionCommonTest.java:102)
	at org.apache.jackrabbit.oak.plugins.index.IndexSuggestionCommonTest.testSuggestQueryOnNonNtBase(IndexSuggestionCommonTest.java:303)
	at sun.reflect.NativeMethodAccessorImpl.invoke0(Native Method)
	at sun.reflect.NativeMethodAccessorImpl.invoke(NativeMethodAccessorImpl.java:62)
	at sun.reflect.DelegatingMethodAccessorImpl.invoke(DelegatingMethodAccessorImpl.java:43)
	at java.lang.reflect.Method.invoke(Method.java:498)
	at org.junit.runners.model.FrameworkMethod$1.runReflectiveCall(FrameworkMethod.java:50)
	at org.junit.internal.runners.model.ReflectiveCallable.run(ReflectiveCallable.java:12)
	at org.junit.runners.model.FrameworkMethod.invokeExplosively(FrameworkMethod.java:47)
	at org.junit.internal.runners.statements.InvokeMethod.evaluate(InvokeMethod.java:17)
	at org.junit.internal.runners.statements.RunBefores.evaluate(RunBefores.java:26)
	at org.junit.internal.runners.statements.RunAfters.evaluate(RunAfters.java:27)
	at org.junit.runners.ParentRunner.runLeaf(ParentRunner.java:325)
	at org.junit.runners.BlockJUnit4ClassRunner.runChild(BlockJUnit4ClassRunner.java:78)
	at org.junit.runners.BlockJUnit4ClassRunner.runChild(BlockJUnit4ClassRunner.java:57)
	at org.junit.runners.ParentRunner$3.run(ParentRunner.java:290)
	at org.junit.runners.ParentRunner$1.schedule(ParentRunner.java:71)
	at org.junit.runners.ParentRunner.runChildren(ParentRunner.java:288)
	at org.junit.runners.ParentRunner.access$000(ParentRunner.java:58)
	at org.junit.runners.ParentRunner$2.evaluate(ParentRunner.java:268)
	at org.junit.rules.ExternalResource$1.evaluate(ExternalResource.java:48)
	at org.testcontainers.containers.FailureDetectingExternalResource$1.evaluate(FailureDetectingExternalResource.java:30)
	at org.junit.rules.RunRules.evaluate(RunRules.java:20)
	at org.junit.runners.ParentRunner.run(ParentRunner.java:363)
	at org.apache.maven.surefire.junit4.JUnit4Provider.execute(JUnit4Provider.java:365)
	at org.apache.maven.surefire.junit4.JUnit4Provider.executeWithRerun(JUnit4Provider.java:273)
	at org.apache.maven.surefire.junit4.JUnit4Provider.executeTestSet(JUnit4Provider.java:238)
	at org.apache.maven.surefire.junit4.JUnit4Provider.invoke(JUnit4Provider.java:159)
	at org.apache.maven.surefire.booter.ForkedBooter.invokeProviderInSameClassLoader(ForkedBooter.java:384)
	at org.apache.maven.surefire.booter.ForkedBooter.runSuitesInProcess(ForkedBooter.java:345)
	at org.apache.maven.surefire.booter.ForkedBooter.execute(ForkedBooter.java:126)
	at org.apache.maven.surefire.booter.ForkedBooter.main(ForkedBooter.java:418)
Caused by: java.lang.AssertionError: There should be some suggestion
	at org.junit.Assert.fail(Assert.java:88)
	at org.junit.Assert.assertTrue(Assert.java:41)
	at org.junit.Assert.assertNotNull(Assert.java:712)
	at org.apache.jackrabbit.oak.plugins.index.IndexSuggestionCommonTest.lambda$checkSuggestions$0(IndexSuggestionCommonTest.java:143)
	at org.apache.jackrabbit.oak.plugins.index.TestUtils.assertEventually(TestUtils.java:35)
	... 34 more


FAILED:  org.apache.jackrabbit.oak.plugins.index.elastic.ElasticIndexSuggestionCommonTest.testSuggestQuery

Error Message:
Condition not satisfied after 9.01 seconds and 84 attempts

Stack Trace:
java.lang.AssertionError: Condition not satisfied after 9.01 seconds and 84 attempts
	at org.apache.jackrabbit.oak.plugins.index.TestUtils.assertEventually(TestUtils.java:43)
	at org.apache.jackrabbit.oak.plugins.index.IndexSuggestionCommonTest.assertEventually(IndexSuggestionCommonTest.java:367)
	at org.apache.jackrabbit.oak.plugins.index.IndexSuggestionCommonTest.checkSuggestions(IndexSuggestionCommonTest.java:141)
	at org.apache.jackrabbit.oak.plugins.index.IndexSuggestionCommonTest.checkSuggestions(IndexSuggestionCommonTest.java:102)
	at org.apache.jackrabbit.oak.plugins.index.IndexSuggestionCommonTest.testSuggestQuery(IndexSuggestionCommonTest.java:214)
	at sun.reflect.NativeMethodAccessorImpl.invoke0(Native Method)
	at sun.reflect.NativeMethodAccessorImpl.invoke(NativeMethodAccessorImpl.java:62)
	at sun.reflect.DelegatingMethodAccessorImpl.invoke(DelegatingMethodAccessorImpl.java:43)
	at java.lang.reflect.Method.invoke(Method.java:498)
	at org.junit.runners.model.FrameworkMethod$1.runReflectiveCall(FrameworkMethod.java:50)
	at org.junit.internal.runners.model.ReflectiveCallable.run(ReflectiveCallable.java:12)
	at org.junit.runners.model.FrameworkMethod.invokeExplosively(FrameworkMethod.java:47)
	at org.junit.internal.runners.statements.InvokeMethod.evaluate(InvokeMethod.java:17)
	at org.junit.internal.runners.statements.RunBefores.evaluate(RunBefores.java:26)
	at org.junit.internal.runners.statements.RunAfters.evaluate(RunAfters.java:27)
	at org.junit.runners.ParentRunner.runLeaf(ParentRunner.java:325)
	at org.junit.runners.BlockJUnit4ClassRunner.runChild(BlockJUnit4ClassRunner.java:78)
	at org.junit.runners.BlockJUnit4ClassRunner.runChild(BlockJUnit4ClassRunner.java:57)
	at org.junit.runners.ParentRunner$3.run(ParentRunner.java:290)
	at org.junit.runners.ParentRunner$1.schedule(ParentRunner.java:71)
	at org.junit.runners.ParentRunner.runChildren(ParentRunner.java:288)
	at org.junit.runners.ParentRunner.access$000(ParentRunner.java:58)
	at org.junit.runners.ParentRunner$2.evaluate(ParentRunner.java:268)
	at org.junit.rules.ExternalResource$1.evaluate(ExternalResource.java:48)
	at org.testcontainers.containers.FailureDetectingExternalResource$1.evaluate(FailureDetectingExternalResource.java:30)
	at org.junit.rules.RunRules.evaluate(RunRules.java:20)
	at org.junit.runners.ParentRunner.run(ParentRunner.java:363)
	at org.apache.maven.surefire.junit4.JUnit4Provider.execute(JUnit4Provider.java:365)
	at org.apache.maven.surefire.junit4.JUnit4Provider.executeWithRerun(JUnit4Provider.java:273)
	at org.apache.maven.surefire.junit4.JUnit4Provider.executeTestSet(JUnit4Provider.java:238)
	at org.apache.maven.surefire.junit4.JUnit4Provider.invoke(JUnit4Provider.java:159)
	at org.apache.maven.surefire.booter.ForkedBooter.invokeProviderInSameClassLoader(ForkedBooter.java:384)
	at org.apache.maven.surefire.booter.ForkedBooter.runSuitesInProcess(ForkedBooter.java:345)
	at org.apache.maven.surefire.booter.ForkedBooter.execute(ForkedBooter.java:126)
	at org.apache.maven.surefire.booter.ForkedBooter.main(ForkedBooter.java:418)
Caused by: java.lang.AssertionError: There should be some suggestion
	at org.junit.Assert.fail(Assert.java:88)
	at org.junit.Assert.assertTrue(Assert.java:41)
	at org.junit.Assert.assertNotNull(Assert.java:712)
	at org.apache.jackrabbit.oak.plugins.index.IndexSuggestionCommonTest.lambda$checkSuggestions$0(IndexSuggestionCommonTest.java:143)
	at org.apache.jackrabbit.oak.plugins.index.TestUtils.assertEventually(TestUtils.java:35)
	... 34 more


FAILED:  org.apache.jackrabbit.oak.plugins.index.elastic.ElasticIndexSuggestionCommonTest.testSuggestQuerySpecialChars

Error Message:
Condition not satisfied after 9.03 seconds and 85 attempts

Stack Trace:
java.lang.AssertionError: Condition not satisfied after 9.03 seconds and 85 attempts
	at org.apache.jackrabbit.oak.plugins.index.TestUtils.assertEventually(TestUtils.java:43)
	at org.apache.jackrabbit.oak.plugins.index.IndexSuggestionCommonTest.assertEventually(IndexSuggestionCommonTest.java:367)
	at org.apache.jackrabbit.oak.plugins.index.IndexSuggestionCommonTest.checkSuggestions(IndexSuggestionCommonTest.java:141)
	at org.apache.jackrabbit.oak.plugins.index.IndexSuggestionCommonTest.checkSuggestions(IndexSuggestionCommonTest.java:102)
	at org.apache.jackrabbit.oak.plugins.index.IndexSuggestionCommonTest.testSuggestQuerySpecialChars(IndexSuggestionCommonTest.java:229)
	at sun.reflect.NativeMethodAccessorImpl.invoke0(Native Method)
	at sun.reflect.NativeMethodAccessorImpl.invoke(NativeMethodAccessorImpl.java:62)
	at sun.reflect.DelegatingMethodAccessorImpl.invoke(DelegatingMethodAccessorImpl.java:43)
	at java.lang.reflect.Method.invoke(Method.java:498)
	at org.junit.runners.model.FrameworkMethod$1.runReflectiveCall(FrameworkMethod.java:50)
	at org.junit.internal.runners.model.ReflectiveCallable.run(ReflectiveCallable.java:12)
	at org.junit.runners.model.FrameworkMethod.invokeExplosively(FrameworkMethod.java:47)
	at org.junit.internal.runners.statements.InvokeMethod.evaluate(InvokeMethod.java:17)
	at org.junit.internal.runners.statements.RunBefores.evaluate(RunBefores.java:26)
	at org.junit.internal.runners.statements.RunAfters.evaluate(RunAfters.java:27)
	at org.junit.runners.ParentRunner.runLeaf(ParentRunner.java:325)
	at org.junit.runners.BlockJUnit4ClassRunner.runChild(BlockJUnit4ClassRunner.java:78)
	at org.junit.runners.BlockJUnit4ClassRunner.runChild(BlockJUnit4ClassRunner.java:57)
	at org.junit.runners.ParentRunner$3.run(ParentRunner.java:290)
	at org.junit.runners.ParentRunner$1.schedule(ParentRunner.java:71)
	at org.junit.runners.ParentRunner.runChildren(ParentRunner.java:288)
	at org.junit.runners.ParentRunner.access$000(ParentRunner.java:58)
	at org.junit.runners.ParentRunner$2.evaluate(ParentRunner.java:268)
	at org.junit.rules.ExternalResource$1.evaluate(ExternalResource.java:48)
	at org.testcontainers.containers.FailureDetectingExternalResource$1.evaluate(FailureDetectingExternalResource.java:30)
	at org.junit.rules.RunRules.evaluate(RunRules.java:20)
	at org.junit.runners.ParentRunner.run(ParentRunner.java:363)
	at org.apache.maven.surefire.junit4.JUnit4Provider.execute(JUnit4Provider.java:365)
	at org.apache.maven.surefire.junit4.JUnit4Provider.executeWithRerun(JUnit4Provider.java:273)
	at org.apache.maven.surefire.junit4.JUnit4Provider.executeTestSet(JUnit4Provider.java:238)
	at org.apache.maven.surefire.junit4.JUnit4Provider.invoke(JUnit4Provider.java:159)
	at org.apache.maven.surefire.booter.ForkedBooter.invokeProviderInSameClassLoader(ForkedBooter.java:384)
	at org.apache.maven.surefire.booter.ForkedBooter.runSuitesInProcess(ForkedBooter.java:345)
	at org.apache.maven.surefire.booter.ForkedBooter.execute(ForkedBooter.java:126)
	at org.apache.maven.surefire.booter.ForkedBooter.main(ForkedBooter.java:418)
Caused by: java.lang.AssertionError: There should be some suggestion
	at org.junit.Assert.fail(Assert.java:88)
	at org.junit.Assert.assertTrue(Assert.java:41)
	at org.junit.Assert.assertNotNull(Assert.java:712)
	at org.apache.jackrabbit.oak.plugins.index.IndexSuggestionCommonTest.lambda$checkSuggestions$0(IndexSuggestionCommonTest.java:143)
	at org.apache.jackrabbit.oak.plugins.index.TestUtils.assertEventually(TestUtils.java:35)
	... 34 more


FAILED:  org.apache.jackrabbit.oak.plugins.index.elastic.ElasticIndexSuggestionCommonTest.testSuggestQueryInfix

Error Message:
Condition not satisfied after 9.06 seconds and 85 attempts

Stack Trace:
java.lang.AssertionError: Condition not satisfied after 9.06 seconds and 85 attempts
	at org.apache.jackrabbit.oak.plugins.index.TestUtils.assertEventually(TestUtils.java:43)
	at org.apache.jackrabbit.oak.plugins.index.IndexSuggestionCommonTest.assertEventually(IndexSuggestionCommonTest.java:367)
	at org.apache.jackrabbit.oak.plugins.index.IndexSuggestionCommonTest.checkSuggestions(IndexSuggestionCommonTest.java:141)
	at org.apache.jackrabbit.oak.plugins.index.IndexSuggestionCommonTest.checkSuggestions(IndexSuggestionCommonTest.java:102)
	at org.apache.jackrabbit.oak.plugins.index.IndexSuggestionCommonTest.testSuggestQueryInfix(IndexSuggestionCommonTest.java:346)
	at sun.reflect.NativeMethodAccessorImpl.invoke0(Native Method)
	at sun.reflect.NativeMethodAccessorImpl.invoke(NativeMethodAccessorImpl.java:62)
	at sun.reflect.DelegatingMethodAccessorImpl.invoke(DelegatingMethodAccessorImpl.java:43)
	at java.lang.reflect.Method.invoke(Method.java:498)
	at org.junit.runners.model.FrameworkMethod$1.runReflectiveCall(FrameworkMethod.java:50)
	at org.junit.internal.runners.model.ReflectiveCallable.run(ReflectiveCallable.java:12)
	at org.junit.runners.model.FrameworkMethod.invokeExplosively(FrameworkMethod.java:47)
	at org.junit.internal.runners.statements.InvokeMethod.evaluate(InvokeMethod.java:17)
	at org.junit.internal.runners.statements.RunBefores.evaluate(RunBefores.java:26)
	at org.junit.internal.runners.statements.RunAfters.evaluate(RunAfters.java:27)
	at org.junit.runners.ParentRunner.runLeaf(ParentRunner.java:325)
	at org.junit.runners.BlockJUnit4ClassRunner.runChild(BlockJUnit4ClassRunner.java:78)
	at org.junit.runners.BlockJUnit4ClassRunner.runChild(BlockJUnit4ClassRunner.java:57)
	at org.junit.runners.ParentRunner$3.run(ParentRunner.java:290)
	at org.junit.runners.ParentRunner$1.schedule(ParentRunner.java:71)
	at org.junit.runners.ParentRunner.runChildren(ParentRunner.java:288)
	at org.junit.runners.ParentRunner.access$000(ParentRunner.java:58)
	at org.junit.runners.ParentRunner$2.evaluate(ParentRunner.java:268)
	at org.junit.rules.ExternalResource$1.evaluate(ExternalResource.java:48)
	at org.testcontainers.containers.FailureDetectingExternalResource$1.evaluate(FailureDetectingExternalResource.java:30)
	at org.junit.rules.RunRules.evaluate(RunRules.java:20)
	at org.junit.runners.ParentRunner.run(ParentRunner.java:363)
	at org.apache.maven.surefire.junit4.JUnit4Provider.execute(JUnit4Provider.java:365)
	at org.apache.maven.surefire.junit4.JUnit4Provider.executeWithRerun(JUnit4Provider.java:273)
	at org.apache.maven.surefire.junit4.JUnit4Provider.executeTestSet(JUnit4Provider.java:238)
	at org.apache.maven.surefire.junit4.JUnit4Provider.invoke(JUnit4Provider.java:159)
	at org.apache.maven.surefire.booter.ForkedBooter.invokeProviderInSameClassLoader(ForkedBooter.java:384)
	at org.apache.maven.surefire.booter.ForkedBooter.runSuitesInProcess(ForkedBooter.java:345)
	at org.apache.maven.surefire.booter.ForkedBooter.execute(ForkedBooter.java:126)
	at org.apache.maven.surefire.booter.ForkedBooter.main(ForkedBooter.java:418)
Caused by: java.lang.AssertionError: There should be some suggestion
	at org.junit.Assert.fail(Assert.java:88)
	at org.junit.Assert.assertTrue(Assert.java:41)
	at org.junit.Assert.assertNotNull(Assert.java:712)
	at org.apache.jackrabbit.oak.plugins.index.IndexSuggestionCommonTest.lambda$checkSuggestions$0(IndexSuggestionCommonTest.java:143)
	at org.apache.jackrabbit.oak.plugins.index.TestUtils.assertEventually(TestUtils.java:35)
	... 34 more


FAILED:  org.apache.jackrabbit.oak.plugins.index.elastic.ElasticIndexSuggestionCommonTest.testSuggestQueryAnalyzed

Error Message:
Condition not satisfied after 9.10 seconds and 86 attempts

Stack Trace:
java.lang.AssertionError: Condition not satisfied after 9.10 seconds and 86 attempts
	at org.apache.jackrabbit.oak.plugins.index.TestUtils.assertEventually(TestUtils.java:43)
	at org.apache.jackrabbit.oak.plugins.index.IndexSuggestionCommonTest.assertEventually(IndexSuggestionCommonTest.java:367)
	at org.apache.jackrabbit.oak.plugins.index.IndexSuggestionCommonTest.checkSuggestions(IndexSuggestionCommonTest.java:141)
	at org.apache.jackrabbit.oak.plugins.index.IndexSuggestionCommonTest.checkSuggestions(IndexSuggestionCommonTest.java:102)
	at org.apache.jackrabbit.oak.plugins.index.IndexSuggestionCommonTest.testSuggestQueryAnalyzed(IndexSuggestionCommonTest.java:332)
	at sun.reflect.NativeMethodAccessorImpl.invoke0(Native Method)
	at sun.reflect.NativeMethodAccessorImpl.invoke(NativeMethodAccessorImpl.java:62)
	at sun.reflect.DelegatingMethodAccessorImpl.invoke(DelegatingMethodAccessorImpl.java:43)
	at java.lang.reflect.Method.invoke(Method.java:498)
	at org.junit.runners.model.FrameworkMethod$1.runReflectiveCall(FrameworkMethod.java:50)
	at org.junit.internal.runners.model.ReflectiveCallable.run(ReflectiveCallable.java:12)
	at org.junit.runners.model.FrameworkMethod.invokeExplosively(FrameworkMethod.java:47)
	at org.junit.internal.runners.statements.InvokeMethod.evaluate(InvokeMethod.java:17)
	at org.junit.internal.runners.statements.RunBefores.evaluate(RunBefores.java:26)
	at org.junit.internal.runners.statements.RunAfters.evaluate(RunAfters.java:27)
	at org.junit.runners.ParentRunner.runLeaf(ParentRunner.java:325)
	at org.junit.runners.BlockJUnit4ClassRunner.runChild(BlockJUnit4ClassRunner.java:78)
	at org.junit.runners.BlockJUnit4ClassRunner.runChild(BlockJUnit4ClassRunner.java:57)
	at org.junit.runners.ParentRunner$3.run(ParentRunner.java:290)
	at org.junit.runners.ParentRunner$1.schedule(ParentRunner.java:71)
	at org.junit.runners.ParentRunner.runChildren(ParentRunner.java:288)
	at org.junit.runners.ParentRunner.access$000(ParentRunner.java:58)
	at org.junit.runners.ParentRunner$2.evaluate(ParentRunner.java:268)
	at org.junit.rules.ExternalResource$1.evaluate(ExternalResource.java:48)
	at org.testcontainers.containers.FailureDetectingExternalResource$1.evaluate(FailureDetectingExternalResource.java:30)
	at org.junit.rules.RunRules.evaluate(RunRules.java:20)
	at org.junit.runners.ParentRunner.run(ParentRunner.java:363)
	at org.apache.maven.surefire.junit4.JUnit4Provider.execute(JUnit4Provider.java:365)
	at org.apache.maven.surefire.junit4.JUnit4Provider.executeWithRerun(JUnit4Provider.java:273)
	at org.apache.maven.surefire.junit4.JUnit4Provider.executeTestSet(JUnit4Provider.java:238)
	at org.apache.maven.surefire.junit4.JUnit4Provider.invoke(JUnit4Provider.java:159)
	at org.apache.maven.surefire.booter.ForkedBooter.invokeProviderInSameClassLoader(ForkedBooter.java:384)
	at org.apache.maven.surefire.booter.ForkedBooter.runSuitesInProcess(ForkedBooter.java:345)
	at org.apache.maven.surefire.booter.ForkedBooter.execute(ForkedBooter.java:126)
	at org.apache.maven.surefire.booter.ForkedBooter.main(ForkedBooter.java:418)
Caused by: java.lang.AssertionError: There should be some suggestion
	at org.junit.Assert.fail(Assert.java:88)
	at org.junit.Assert.assertTrue(Assert.java:41)
	at org.junit.Assert.assertNotNull(Assert.java:712)
	at org.apache.jackrabbit.oak.plugins.index.IndexSuggestionCommonTest.lambda$checkSuggestions$0(IndexSuggestionCommonTest.java:143)
	at org.apache.jackrabbit.oak.plugins.index.TestUtils.assertEventually(TestUtils.java:35)
	... 34 more

BUILD FAILURE: Jackrabbit Oak - Build # 2837 - Still Failing

Posted by Apache Jenkins Server <je...@builds.apache.org>.
The Apache Jenkins build system has built Jackrabbit Oak (build #2837)

Status: Still Failing

Check console output at https://builds.apache.org/job/Jackrabbit%20Oak/2837/ to view the results.

Changes:
[ngupta] OAK-9152 | Implement 2 factor writes

 

Test results:
8 tests failed.
FAILED:  org.apache.jackrabbit.oak.plugins.index.elastic.ElasticIndexSuggestionCommonTest.suggestNodeName

Error Message:
Condition not satisfied after 9.10 seconds and 78 attempts

Stack Trace:
java.lang.AssertionError: Condition not satisfied after 9.10 seconds and 78 attempts
	at org.apache.jackrabbit.oak.plugins.index.TestUtils.assertEventually(TestUtils.java:43)
	at org.apache.jackrabbit.oak.plugins.index.IndexSuggestionCommonTest.assertEventually(IndexSuggestionCommonTest.java:367)
	at org.apache.jackrabbit.oak.plugins.index.IndexSuggestionCommonTest.suggestNodeName(IndexSuggestionCommonTest.java:196)
	at sun.reflect.NativeMethodAccessorImpl.invoke0(Native Method)
	at sun.reflect.NativeMethodAccessorImpl.invoke(NativeMethodAccessorImpl.java:62)
	at sun.reflect.DelegatingMethodAccessorImpl.invoke(DelegatingMethodAccessorImpl.java:43)
	at java.lang.reflect.Method.invoke(Method.java:498)
	at org.junit.runners.model.FrameworkMethod$1.runReflectiveCall(FrameworkMethod.java:50)
	at org.junit.internal.runners.model.ReflectiveCallable.run(ReflectiveCallable.java:12)
	at org.junit.runners.model.FrameworkMethod.invokeExplosively(FrameworkMethod.java:47)
	at org.junit.internal.runners.statements.InvokeMethod.evaluate(InvokeMethod.java:17)
	at org.junit.internal.runners.statements.RunBefores.evaluate(RunBefores.java:26)
	at org.junit.internal.runners.statements.RunAfters.evaluate(RunAfters.java:27)
	at org.junit.runners.ParentRunner.runLeaf(ParentRunner.java:325)
	at org.junit.runners.BlockJUnit4ClassRunner.runChild(BlockJUnit4ClassRunner.java:78)
	at org.junit.runners.BlockJUnit4ClassRunner.runChild(BlockJUnit4ClassRunner.java:57)
	at org.junit.runners.ParentRunner$3.run(ParentRunner.java:290)
	at org.junit.runners.ParentRunner$1.schedule(ParentRunner.java:71)
	at org.junit.runners.ParentRunner.runChildren(ParentRunner.java:288)
	at org.junit.runners.ParentRunner.access$000(ParentRunner.java:58)
	at org.junit.runners.ParentRunner$2.evaluate(ParentRunner.java:268)
	at org.junit.rules.ExternalResource$1.evaluate(ExternalResource.java:48)
	at org.testcontainers.containers.FailureDetectingExternalResource$1.evaluate(FailureDetectingExternalResource.java:30)
	at org.junit.rules.RunRules.evaluate(RunRules.java:20)
	at org.junit.runners.ParentRunner.run(ParentRunner.java:363)
	at org.apache.maven.surefire.junit4.JUnit4Provider.execute(JUnit4Provider.java:365)
	at org.apache.maven.surefire.junit4.JUnit4Provider.executeWithRerun(JUnit4Provider.java:273)
	at org.apache.maven.surefire.junit4.JUnit4Provider.executeTestSet(JUnit4Provider.java:238)
	at org.apache.maven.surefire.junit4.JUnit4Provider.invoke(JUnit4Provider.java:159)
	at org.apache.maven.surefire.booter.ForkedBooter.invokeProviderInSameClassLoader(ForkedBooter.java:384)
	at org.apache.maven.surefire.booter.ForkedBooter.runSuitesInProcess(ForkedBooter.java:345)
	at org.apache.maven.surefire.booter.ForkedBooter.execute(ForkedBooter.java:126)
	at org.apache.maven.surefire.booter.ForkedBooter.main(ForkedBooter.java:418)
Caused by: java.lang.AssertionError: Node name should be suggested expected:<indexedNode> but was:<null>
	at org.junit.Assert.fail(Assert.java:88)
	at org.junit.Assert.failNotEquals(Assert.java:834)
	at org.junit.Assert.assertEquals(Assert.java:118)
	at org.apache.jackrabbit.oak.plugins.index.IndexSuggestionCommonTest.lambda$suggestNodeName$2(IndexSuggestionCommonTest.java:198)
	at org.apache.jackrabbit.oak.plugins.index.TestUtils.assertEventually(TestUtils.java:35)
	... 32 more


FAILED:  org.apache.jackrabbit.oak.plugins.index.elastic.ElasticIndexSuggestionCommonTest.testMultipleSuggestions

Error Message:
Condition not satisfied after 9.00 seconds and 81 attempts

Stack Trace:
java.lang.AssertionError: Condition not satisfied after 9.00 seconds and 81 attempts
	at org.apache.jackrabbit.oak.plugins.index.TestUtils.assertEventually(TestUtils.java:43)
	at org.apache.jackrabbit.oak.plugins.index.IndexSuggestionCommonTest.assertEventually(IndexSuggestionCommonTest.java:367)
	at org.apache.jackrabbit.oak.plugins.index.IndexSuggestionCommonTest.checkSuggestions(IndexSuggestionCommonTest.java:141)
	at org.apache.jackrabbit.oak.plugins.index.IndexSuggestionCommonTest.checkSuggestions(IndexSuggestionCommonTest.java:102)
	at org.apache.jackrabbit.oak.plugins.index.IndexSuggestionCommonTest.testMultipleSuggestions(IndexSuggestionCommonTest.java:318)
	at sun.reflect.NativeMethodAccessorImpl.invoke0(Native Method)
	at sun.reflect.NativeMethodAccessorImpl.invoke(NativeMethodAccessorImpl.java:62)
	at sun.reflect.DelegatingMethodAccessorImpl.invoke(DelegatingMethodAccessorImpl.java:43)
	at java.lang.reflect.Method.invoke(Method.java:498)
	at org.junit.runners.model.FrameworkMethod$1.runReflectiveCall(FrameworkMethod.java:50)
	at org.junit.internal.runners.model.ReflectiveCallable.run(ReflectiveCallable.java:12)
	at org.junit.runners.model.FrameworkMethod.invokeExplosively(FrameworkMethod.java:47)
	at org.junit.internal.runners.statements.InvokeMethod.evaluate(InvokeMethod.java:17)
	at org.junit.internal.runners.statements.RunBefores.evaluate(RunBefores.java:26)
	at org.junit.internal.runners.statements.RunAfters.evaluate(RunAfters.java:27)
	at org.junit.runners.ParentRunner.runLeaf(ParentRunner.java:325)
	at org.junit.runners.BlockJUnit4ClassRunner.runChild(BlockJUnit4ClassRunner.java:78)
	at org.junit.runners.BlockJUnit4ClassRunner.runChild(BlockJUnit4ClassRunner.java:57)
	at org.junit.runners.ParentRunner$3.run(ParentRunner.java:290)
	at org.junit.runners.ParentRunner$1.schedule(ParentRunner.java:71)
	at org.junit.runners.ParentRunner.runChildren(ParentRunner.java:288)
	at org.junit.runners.ParentRunner.access$000(ParentRunner.java:58)
	at org.junit.runners.ParentRunner$2.evaluate(ParentRunner.java:268)
	at org.junit.rules.ExternalResource$1.evaluate(ExternalResource.java:48)
	at org.testcontainers.containers.FailureDetectingExternalResource$1.evaluate(FailureDetectingExternalResource.java:30)
	at org.junit.rules.RunRules.evaluate(RunRules.java:20)
	at org.junit.runners.ParentRunner.run(ParentRunner.java:363)
	at org.apache.maven.surefire.junit4.JUnit4Provider.execute(JUnit4Provider.java:365)
	at org.apache.maven.surefire.junit4.JUnit4Provider.executeWithRerun(JUnit4Provider.java:273)
	at org.apache.maven.surefire.junit4.JUnit4Provider.executeTestSet(JUnit4Provider.java:238)
	at org.apache.maven.surefire.junit4.JUnit4Provider.invoke(JUnit4Provider.java:159)
	at org.apache.maven.surefire.booter.ForkedBooter.invokeProviderInSameClassLoader(ForkedBooter.java:384)
	at org.apache.maven.surefire.booter.ForkedBooter.runSuitesInProcess(ForkedBooter.java:345)
	at org.apache.maven.surefire.booter.ForkedBooter.execute(ForkedBooter.java:126)
	at org.apache.maven.surefire.booter.ForkedBooter.main(ForkedBooter.java:418)
Caused by: java.lang.AssertionError: There should be some suggestion
	at org.junit.Assert.fail(Assert.java:88)
	at org.junit.Assert.assertTrue(Assert.java:41)
	at org.junit.Assert.assertNotNull(Assert.java:712)
	at org.apache.jackrabbit.oak.plugins.index.IndexSuggestionCommonTest.lambda$checkSuggestions$0(IndexSuggestionCommonTest.java:143)
	at org.apache.jackrabbit.oak.plugins.index.TestUtils.assertEventually(TestUtils.java:35)
	... 34 more


FAILED:  org.apache.jackrabbit.oak.plugins.index.elastic.ElasticIndexSuggestionCommonTest.testSuggestQueryWithUserAccess

Error Message:
Condition not satisfied after 9.06 seconds and 79 attempts

Stack Trace:
java.lang.AssertionError: Condition not satisfied after 9.06 seconds and 79 attempts
	at org.apache.jackrabbit.oak.plugins.index.TestUtils.assertEventually(TestUtils.java:43)
	at org.apache.jackrabbit.oak.plugins.index.IndexSuggestionCommonTest.assertEventually(IndexSuggestionCommonTest.java:367)
	at org.apache.jackrabbit.oak.plugins.index.IndexSuggestionCommonTest.checkSuggestions(IndexSuggestionCommonTest.java:141)
	at org.apache.jackrabbit.oak.plugins.index.IndexSuggestionCommonTest.checkSuggestions(IndexSuggestionCommonTest.java:102)
	at org.apache.jackrabbit.oak.plugins.index.IndexSuggestionCommonTest.testSuggestQueryWithUserAccess(IndexSuggestionCommonTest.java:272)
	at sun.reflect.NativeMethodAccessorImpl.invoke0(Native Method)
	at sun.reflect.NativeMethodAccessorImpl.invoke(NativeMethodAccessorImpl.java:62)
	at sun.reflect.DelegatingMethodAccessorImpl.invoke(DelegatingMethodAccessorImpl.java:43)
	at java.lang.reflect.Method.invoke(Method.java:498)
	at org.junit.runners.model.FrameworkMethod$1.runReflectiveCall(FrameworkMethod.java:50)
	at org.junit.internal.runners.model.ReflectiveCallable.run(ReflectiveCallable.java:12)
	at org.junit.runners.model.FrameworkMethod.invokeExplosively(FrameworkMethod.java:47)
	at org.junit.internal.runners.statements.InvokeMethod.evaluate(InvokeMethod.java:17)
	at org.junit.internal.runners.statements.RunBefores.evaluate(RunBefores.java:26)
	at org.junit.internal.runners.statements.RunAfters.evaluate(RunAfters.java:27)
	at org.junit.runners.ParentRunner.runLeaf(ParentRunner.java:325)
	at org.junit.runners.BlockJUnit4ClassRunner.runChild(BlockJUnit4ClassRunner.java:78)
	at org.junit.runners.BlockJUnit4ClassRunner.runChild(BlockJUnit4ClassRunner.java:57)
	at org.junit.runners.ParentRunner$3.run(ParentRunner.java:290)
	at org.junit.runners.ParentRunner$1.schedule(ParentRunner.java:71)
	at org.junit.runners.ParentRunner.runChildren(ParentRunner.java:288)
	at org.junit.runners.ParentRunner.access$000(ParentRunner.java:58)
	at org.junit.runners.ParentRunner$2.evaluate(ParentRunner.java:268)
	at org.junit.rules.ExternalResource$1.evaluate(ExternalResource.java:48)
	at org.testcontainers.containers.FailureDetectingExternalResource$1.evaluate(FailureDetectingExternalResource.java:30)
	at org.junit.rules.RunRules.evaluate(RunRules.java:20)
	at org.junit.runners.ParentRunner.run(ParentRunner.java:363)
	at org.apache.maven.surefire.junit4.JUnit4Provider.execute(JUnit4Provider.java:365)
	at org.apache.maven.surefire.junit4.JUnit4Provider.executeWithRerun(JUnit4Provider.java:273)
	at org.apache.maven.surefire.junit4.JUnit4Provider.executeTestSet(JUnit4Provider.java:238)
	at org.apache.maven.surefire.junit4.JUnit4Provider.invoke(JUnit4Provider.java:159)
	at org.apache.maven.surefire.booter.ForkedBooter.invokeProviderInSameClassLoader(ForkedBooter.java:384)
	at org.apache.maven.surefire.booter.ForkedBooter.runSuitesInProcess(ForkedBooter.java:345)
	at org.apache.maven.surefire.booter.ForkedBooter.execute(ForkedBooter.java:126)
	at org.apache.maven.surefire.booter.ForkedBooter.main(ForkedBooter.java:418)
Caused by: java.lang.NullPointerException
	at com.google.common.base.Preconditions.checkNotNull(Preconditions.java:192)
	at org.apache.jackrabbit.oak.plugins.memory.StringPropertyState.<init>(StringPropertyState.java:35)
	at org.apache.jackrabbit.oak.plugins.memory.StringPropertyState.stringProperty(StringPropertyState.java:46)
	at org.apache.jackrabbit.oak.plugins.memory.PropertyValues.newString(PropertyValues.java:67)
	at org.apache.jackrabbit.oak.plugins.index.search.spi.query.FulltextIndex$FulltextPathCursor$2.getValue(FulltextIndex.java:478)
	at org.apache.jackrabbit.oak.query.ast.SelectorImpl.currentOakProperty(SelectorImpl.java:791)
	at org.apache.jackrabbit.oak.query.ast.SelectorImpl.currentOakProperty(SelectorImpl.java:765)
	at org.apache.jackrabbit.oak.query.ast.SelectorImpl.currentOakProperty(SelectorImpl.java:696)
	at org.apache.jackrabbit.oak.query.ast.SelectorImpl.currentProperty(SelectorImpl.java:672)
	at org.apache.jackrabbit.oak.query.ast.ColumnImpl.currentProperty(ColumnImpl.java:59)
	at org.apache.jackrabbit.oak.query.QueryImpl.currentRow(QueryImpl.java:939)
	at org.apache.jackrabbit.oak.query.QueryImpl$RowIterator.fetchNext(QueryImpl.java:878)
	at org.apache.jackrabbit.oak.query.QueryImpl$RowIterator.hasNext(QueryImpl.java:903)
	at org.apache.jackrabbit.oak.jcr.query.QueryResultImpl$1.fetch(QueryResultImpl.java:103)
	at org.apache.jackrabbit.oak.jcr.query.QueryResultImpl$1.<init>(QueryResultImpl.java:99)
	at org.apache.jackrabbit.oak.jcr.query.QueryResultImpl.getRows(QueryResultImpl.java:83)
	at org.apache.jackrabbit.oak.plugins.index.IndexSuggestionCommonTest.getResult(IndexSuggestionCommonTest.java:165)
	at org.apache.jackrabbit.oak.plugins.index.IndexSuggestionCommonTest.lambda$checkSuggestions$0(IndexSuggestionCommonTest.java:143)
	at org.apache.jackrabbit.oak.plugins.index.TestUtils.assertEventually(TestUtils.java:35)
	... 34 more


FAILED:  org.apache.jackrabbit.oak.plugins.index.elastic.ElasticIndexSuggestionCommonTest.testSuggestQueryOnNonNtBase

Error Message:
Condition not satisfied after 9.04 seconds and 84 attempts

Stack Trace:
java.lang.AssertionError: Condition not satisfied after 9.04 seconds and 84 attempts
	at org.apache.jackrabbit.oak.plugins.index.TestUtils.assertEventually(TestUtils.java:43)
	at org.apache.jackrabbit.oak.plugins.index.IndexSuggestionCommonTest.assertEventually(IndexSuggestionCommonTest.java:367)
	at org.apache.jackrabbit.oak.plugins.index.IndexSuggestionCommonTest.checkSuggestions(IndexSuggestionCommonTest.java:141)
	at org.apache.jackrabbit.oak.plugins.index.IndexSuggestionCommonTest.checkSuggestions(IndexSuggestionCommonTest.java:102)
	at org.apache.jackrabbit.oak.plugins.index.IndexSuggestionCommonTest.testSuggestQueryOnNonNtBase(IndexSuggestionCommonTest.java:303)
	at sun.reflect.NativeMethodAccessorImpl.invoke0(Native Method)
	at sun.reflect.NativeMethodAccessorImpl.invoke(NativeMethodAccessorImpl.java:62)
	at sun.reflect.DelegatingMethodAccessorImpl.invoke(DelegatingMethodAccessorImpl.java:43)
	at java.lang.reflect.Method.invoke(Method.java:498)
	at org.junit.runners.model.FrameworkMethod$1.runReflectiveCall(FrameworkMethod.java:50)
	at org.junit.internal.runners.model.ReflectiveCallable.run(ReflectiveCallable.java:12)
	at org.junit.runners.model.FrameworkMethod.invokeExplosively(FrameworkMethod.java:47)
	at org.junit.internal.runners.statements.InvokeMethod.evaluate(InvokeMethod.java:17)
	at org.junit.internal.runners.statements.RunBefores.evaluate(RunBefores.java:26)
	at org.junit.internal.runners.statements.RunAfters.evaluate(RunAfters.java:27)
	at org.junit.runners.ParentRunner.runLeaf(ParentRunner.java:325)
	at org.junit.runners.BlockJUnit4ClassRunner.runChild(BlockJUnit4ClassRunner.java:78)
	at org.junit.runners.BlockJUnit4ClassRunner.runChild(BlockJUnit4ClassRunner.java:57)
	at org.junit.runners.ParentRunner$3.run(ParentRunner.java:290)
	at org.junit.runners.ParentRunner$1.schedule(ParentRunner.java:71)
	at org.junit.runners.ParentRunner.runChildren(ParentRunner.java:288)
	at org.junit.runners.ParentRunner.access$000(ParentRunner.java:58)
	at org.junit.runners.ParentRunner$2.evaluate(ParentRunner.java:268)
	at org.junit.rules.ExternalResource$1.evaluate(ExternalResource.java:48)
	at org.testcontainers.containers.FailureDetectingExternalResource$1.evaluate(FailureDetectingExternalResource.java:30)
	at org.junit.rules.RunRules.evaluate(RunRules.java:20)
	at org.junit.runners.ParentRunner.run(ParentRunner.java:363)
	at org.apache.maven.surefire.junit4.JUnit4Provider.execute(JUnit4Provider.java:365)
	at org.apache.maven.surefire.junit4.JUnit4Provider.executeWithRerun(JUnit4Provider.java:273)
	at org.apache.maven.surefire.junit4.JUnit4Provider.executeTestSet(JUnit4Provider.java:238)
	at org.apache.maven.surefire.junit4.JUnit4Provider.invoke(JUnit4Provider.java:159)
	at org.apache.maven.surefire.booter.ForkedBooter.invokeProviderInSameClassLoader(ForkedBooter.java:384)
	at org.apache.maven.surefire.booter.ForkedBooter.runSuitesInProcess(ForkedBooter.java:345)
	at org.apache.maven.surefire.booter.ForkedBooter.execute(ForkedBooter.java:126)
	at org.apache.maven.surefire.booter.ForkedBooter.main(ForkedBooter.java:418)
Caused by: java.lang.AssertionError: There should be some suggestion
	at org.junit.Assert.fail(Assert.java:88)
	at org.junit.Assert.assertTrue(Assert.java:41)
	at org.junit.Assert.assertNotNull(Assert.java:712)
	at org.apache.jackrabbit.oak.plugins.index.IndexSuggestionCommonTest.lambda$checkSuggestions$0(IndexSuggestionCommonTest.java:143)
	at org.apache.jackrabbit.oak.plugins.index.TestUtils.assertEventually(TestUtils.java:35)
	... 34 more


FAILED:  org.apache.jackrabbit.oak.plugins.index.elastic.ElasticIndexSuggestionCommonTest.testSuggestQuery

Error Message:
Condition not satisfied after 9.10 seconds and 85 attempts

Stack Trace:
java.lang.AssertionError: Condition not satisfied after 9.10 seconds and 85 attempts
	at org.apache.jackrabbit.oak.plugins.index.TestUtils.assertEventually(TestUtils.java:43)
	at org.apache.jackrabbit.oak.plugins.index.IndexSuggestionCommonTest.assertEventually(IndexSuggestionCommonTest.java:367)
	at org.apache.jackrabbit.oak.plugins.index.IndexSuggestionCommonTest.checkSuggestions(IndexSuggestionCommonTest.java:141)
	at org.apache.jackrabbit.oak.plugins.index.IndexSuggestionCommonTest.checkSuggestions(IndexSuggestionCommonTest.java:102)
	at org.apache.jackrabbit.oak.plugins.index.IndexSuggestionCommonTest.testSuggestQuery(IndexSuggestionCommonTest.java:214)
	at sun.reflect.NativeMethodAccessorImpl.invoke0(Native Method)
	at sun.reflect.NativeMethodAccessorImpl.invoke(NativeMethodAccessorImpl.java:62)
	at sun.reflect.DelegatingMethodAccessorImpl.invoke(DelegatingMethodAccessorImpl.java:43)
	at java.lang.reflect.Method.invoke(Method.java:498)
	at org.junit.runners.model.FrameworkMethod$1.runReflectiveCall(FrameworkMethod.java:50)
	at org.junit.internal.runners.model.ReflectiveCallable.run(ReflectiveCallable.java:12)
	at org.junit.runners.model.FrameworkMethod.invokeExplosively(FrameworkMethod.java:47)
	at org.junit.internal.runners.statements.InvokeMethod.evaluate(InvokeMethod.java:17)
	at org.junit.internal.runners.statements.RunBefores.evaluate(RunBefores.java:26)
	at org.junit.internal.runners.statements.RunAfters.evaluate(RunAfters.java:27)
	at org.junit.runners.ParentRunner.runLeaf(ParentRunner.java:325)
	at org.junit.runners.BlockJUnit4ClassRunner.runChild(BlockJUnit4ClassRunner.java:78)
	at org.junit.runners.BlockJUnit4ClassRunner.runChild(BlockJUnit4ClassRunner.java:57)
	at org.junit.runners.ParentRunner$3.run(ParentRunner.java:290)
	at org.junit.runners.ParentRunner$1.schedule(ParentRunner.java:71)
	at org.junit.runners.ParentRunner.runChildren(ParentRunner.java:288)
	at org.junit.runners.ParentRunner.access$000(ParentRunner.java:58)
	at org.junit.runners.ParentRunner$2.evaluate(ParentRunner.java:268)
	at org.junit.rules.ExternalResource$1.evaluate(ExternalResource.java:48)
	at org.testcontainers.containers.FailureDetectingExternalResource$1.evaluate(FailureDetectingExternalResource.java:30)
	at org.junit.rules.RunRules.evaluate(RunRules.java:20)
	at org.junit.runners.ParentRunner.run(ParentRunner.java:363)
	at org.apache.maven.surefire.junit4.JUnit4Provider.execute(JUnit4Provider.java:365)
	at org.apache.maven.surefire.junit4.JUnit4Provider.executeWithRerun(JUnit4Provider.java:273)
	at org.apache.maven.surefire.junit4.JUnit4Provider.executeTestSet(JUnit4Provider.java:238)
	at org.apache.maven.surefire.junit4.JUnit4Provider.invoke(JUnit4Provider.java:159)
	at org.apache.maven.surefire.booter.ForkedBooter.invokeProviderInSameClassLoader(ForkedBooter.java:384)
	at org.apache.maven.surefire.booter.ForkedBooter.runSuitesInProcess(ForkedBooter.java:345)
	at org.apache.maven.surefire.booter.ForkedBooter.execute(ForkedBooter.java:126)
	at org.apache.maven.surefire.booter.ForkedBooter.main(ForkedBooter.java:418)
Caused by: java.lang.AssertionError: There should be some suggestion
	at org.junit.Assert.fail(Assert.java:88)
	at org.junit.Assert.assertTrue(Assert.java:41)
	at org.junit.Assert.assertNotNull(Assert.java:712)
	at org.apache.jackrabbit.oak.plugins.index.IndexSuggestionCommonTest.lambda$checkSuggestions$0(IndexSuggestionCommonTest.java:143)
	at org.apache.jackrabbit.oak.plugins.index.TestUtils.assertEventually(TestUtils.java:35)
	... 34 more


FAILED:  org.apache.jackrabbit.oak.plugins.index.elastic.ElasticIndexSuggestionCommonTest.testSuggestQuerySpecialChars

Error Message:
Condition not satisfied after 9.07 seconds and 85 attempts

Stack Trace:
java.lang.AssertionError: Condition not satisfied after 9.07 seconds and 85 attempts
	at org.apache.jackrabbit.oak.plugins.index.TestUtils.assertEventually(TestUtils.java:43)
	at org.apache.jackrabbit.oak.plugins.index.IndexSuggestionCommonTest.assertEventually(IndexSuggestionCommonTest.java:367)
	at org.apache.jackrabbit.oak.plugins.index.IndexSuggestionCommonTest.checkSuggestions(IndexSuggestionCommonTest.java:141)
	at org.apache.jackrabbit.oak.plugins.index.IndexSuggestionCommonTest.checkSuggestions(IndexSuggestionCommonTest.java:102)
	at org.apache.jackrabbit.oak.plugins.index.IndexSuggestionCommonTest.testSuggestQuerySpecialChars(IndexSuggestionCommonTest.java:229)
	at sun.reflect.NativeMethodAccessorImpl.invoke0(Native Method)
	at sun.reflect.NativeMethodAccessorImpl.invoke(NativeMethodAccessorImpl.java:62)
	at sun.reflect.DelegatingMethodAccessorImpl.invoke(DelegatingMethodAccessorImpl.java:43)
	at java.lang.reflect.Method.invoke(Method.java:498)
	at org.junit.runners.model.FrameworkMethod$1.runReflectiveCall(FrameworkMethod.java:50)
	at org.junit.internal.runners.model.ReflectiveCallable.run(ReflectiveCallable.java:12)
	at org.junit.runners.model.FrameworkMethod.invokeExplosively(FrameworkMethod.java:47)
	at org.junit.internal.runners.statements.InvokeMethod.evaluate(InvokeMethod.java:17)
	at org.junit.internal.runners.statements.RunBefores.evaluate(RunBefores.java:26)
	at org.junit.internal.runners.statements.RunAfters.evaluate(RunAfters.java:27)
	at org.junit.runners.ParentRunner.runLeaf(ParentRunner.java:325)
	at org.junit.runners.BlockJUnit4ClassRunner.runChild(BlockJUnit4ClassRunner.java:78)
	at org.junit.runners.BlockJUnit4ClassRunner.runChild(BlockJUnit4ClassRunner.java:57)
	at org.junit.runners.ParentRunner$3.run(ParentRunner.java:290)
	at org.junit.runners.ParentRunner$1.schedule(ParentRunner.java:71)
	at org.junit.runners.ParentRunner.runChildren(ParentRunner.java:288)
	at org.junit.runners.ParentRunner.access$000(ParentRunner.java:58)
	at org.junit.runners.ParentRunner$2.evaluate(ParentRunner.java:268)
	at org.junit.rules.ExternalResource$1.evaluate(ExternalResource.java:48)
	at org.testcontainers.containers.FailureDetectingExternalResource$1.evaluate(FailureDetectingExternalResource.java:30)
	at org.junit.rules.RunRules.evaluate(RunRules.java:20)
	at org.junit.runners.ParentRunner.run(ParentRunner.java:363)
	at org.apache.maven.surefire.junit4.JUnit4Provider.execute(JUnit4Provider.java:365)
	at org.apache.maven.surefire.junit4.JUnit4Provider.executeWithRerun(JUnit4Provider.java:273)
	at org.apache.maven.surefire.junit4.JUnit4Provider.executeTestSet(JUnit4Provider.java:238)
	at org.apache.maven.surefire.junit4.JUnit4Provider.invoke(JUnit4Provider.java:159)
	at org.apache.maven.surefire.booter.ForkedBooter.invokeProviderInSameClassLoader(ForkedBooter.java:384)
	at org.apache.maven.surefire.booter.ForkedBooter.runSuitesInProcess(ForkedBooter.java:345)
	at org.apache.maven.surefire.booter.ForkedBooter.execute(ForkedBooter.java:126)
	at org.apache.maven.surefire.booter.ForkedBooter.main(ForkedBooter.java:418)
Caused by: java.lang.AssertionError: There should be some suggestion
	at org.junit.Assert.fail(Assert.java:88)
	at org.junit.Assert.assertTrue(Assert.java:41)
	at org.junit.Assert.assertNotNull(Assert.java:712)
	at org.apache.jackrabbit.oak.plugins.index.IndexSuggestionCommonTest.lambda$checkSuggestions$0(IndexSuggestionCommonTest.java:143)
	at org.apache.jackrabbit.oak.plugins.index.TestUtils.assertEventually(TestUtils.java:35)
	... 34 more


FAILED:  org.apache.jackrabbit.oak.plugins.index.elastic.ElasticIndexSuggestionCommonTest.testSuggestQueryInfix

Error Message:
Condition not satisfied after 9.07 seconds and 85 attempts

Stack Trace:
java.lang.AssertionError: Condition not satisfied after 9.07 seconds and 85 attempts
	at org.apache.jackrabbit.oak.plugins.index.TestUtils.assertEventually(TestUtils.java:43)
	at org.apache.jackrabbit.oak.plugins.index.IndexSuggestionCommonTest.assertEventually(IndexSuggestionCommonTest.java:367)
	at org.apache.jackrabbit.oak.plugins.index.IndexSuggestionCommonTest.checkSuggestions(IndexSuggestionCommonTest.java:141)
	at org.apache.jackrabbit.oak.plugins.index.IndexSuggestionCommonTest.checkSuggestions(IndexSuggestionCommonTest.java:102)
	at org.apache.jackrabbit.oak.plugins.index.IndexSuggestionCommonTest.testSuggestQueryInfix(IndexSuggestionCommonTest.java:346)
	at sun.reflect.NativeMethodAccessorImpl.invoke0(Native Method)
	at sun.reflect.NativeMethodAccessorImpl.invoke(NativeMethodAccessorImpl.java:62)
	at sun.reflect.DelegatingMethodAccessorImpl.invoke(DelegatingMethodAccessorImpl.java:43)
	at java.lang.reflect.Method.invoke(Method.java:498)
	at org.junit.runners.model.FrameworkMethod$1.runReflectiveCall(FrameworkMethod.java:50)
	at org.junit.internal.runners.model.ReflectiveCallable.run(ReflectiveCallable.java:12)
	at org.junit.runners.model.FrameworkMethod.invokeExplosively(FrameworkMethod.java:47)
	at org.junit.internal.runners.statements.InvokeMethod.evaluate(InvokeMethod.java:17)
	at org.junit.internal.runners.statements.RunBefores.evaluate(RunBefores.java:26)
	at org.junit.internal.runners.statements.RunAfters.evaluate(RunAfters.java:27)
	at org.junit.runners.ParentRunner.runLeaf(ParentRunner.java:325)
	at org.junit.runners.BlockJUnit4ClassRunner.runChild(BlockJUnit4ClassRunner.java:78)
	at org.junit.runners.BlockJUnit4ClassRunner.runChild(BlockJUnit4ClassRunner.java:57)
	at org.junit.runners.ParentRunner$3.run(ParentRunner.java:290)
	at org.junit.runners.ParentRunner$1.schedule(ParentRunner.java:71)
	at org.junit.runners.ParentRunner.runChildren(ParentRunner.java:288)
	at org.junit.runners.ParentRunner.access$000(ParentRunner.java:58)
	at org.junit.runners.ParentRunner$2.evaluate(ParentRunner.java:268)
	at org.junit.rules.ExternalResource$1.evaluate(ExternalResource.java:48)
	at org.testcontainers.containers.FailureDetectingExternalResource$1.evaluate(FailureDetectingExternalResource.java:30)
	at org.junit.rules.RunRules.evaluate(RunRules.java:20)
	at org.junit.runners.ParentRunner.run(ParentRunner.java:363)
	at org.apache.maven.surefire.junit4.JUnit4Provider.execute(JUnit4Provider.java:365)
	at org.apache.maven.surefire.junit4.JUnit4Provider.executeWithRerun(JUnit4Provider.java:273)
	at org.apache.maven.surefire.junit4.JUnit4Provider.executeTestSet(JUnit4Provider.java:238)
	at org.apache.maven.surefire.junit4.JUnit4Provider.invoke(JUnit4Provider.java:159)
	at org.apache.maven.surefire.booter.ForkedBooter.invokeProviderInSameClassLoader(ForkedBooter.java:384)
	at org.apache.maven.surefire.booter.ForkedBooter.runSuitesInProcess(ForkedBooter.java:345)
	at org.apache.maven.surefire.booter.ForkedBooter.execute(ForkedBooter.java:126)
	at org.apache.maven.surefire.booter.ForkedBooter.main(ForkedBooter.java:418)
Caused by: java.lang.AssertionError: There should be some suggestion
	at org.junit.Assert.fail(Assert.java:88)
	at org.junit.Assert.assertTrue(Assert.java:41)
	at org.junit.Assert.assertNotNull(Assert.java:712)
	at org.apache.jackrabbit.oak.plugins.index.IndexSuggestionCommonTest.lambda$checkSuggestions$0(IndexSuggestionCommonTest.java:143)
	at org.apache.jackrabbit.oak.plugins.index.TestUtils.assertEventually(TestUtils.java:35)
	... 34 more


FAILED:  org.apache.jackrabbit.oak.plugins.index.elastic.ElasticIndexSuggestionCommonTest.testSuggestQueryAnalyzed

Error Message:
Condition not satisfied after 9.01 seconds and 85 attempts

Stack Trace:
java.lang.AssertionError: Condition not satisfied after 9.01 seconds and 85 attempts
	at org.apache.jackrabbit.oak.plugins.index.TestUtils.assertEventually(TestUtils.java:43)
	at org.apache.jackrabbit.oak.plugins.index.IndexSuggestionCommonTest.assertEventually(IndexSuggestionCommonTest.java:367)
	at org.apache.jackrabbit.oak.plugins.index.IndexSuggestionCommonTest.checkSuggestions(IndexSuggestionCommonTest.java:141)
	at org.apache.jackrabbit.oak.plugins.index.IndexSuggestionCommonTest.checkSuggestions(IndexSuggestionCommonTest.java:102)
	at org.apache.jackrabbit.oak.plugins.index.IndexSuggestionCommonTest.testSuggestQueryAnalyzed(IndexSuggestionCommonTest.java:332)
	at sun.reflect.NativeMethodAccessorImpl.invoke0(Native Method)
	at sun.reflect.NativeMethodAccessorImpl.invoke(NativeMethodAccessorImpl.java:62)
	at sun.reflect.DelegatingMethodAccessorImpl.invoke(DelegatingMethodAccessorImpl.java:43)
	at java.lang.reflect.Method.invoke(Method.java:498)
	at org.junit.runners.model.FrameworkMethod$1.runReflectiveCall(FrameworkMethod.java:50)
	at org.junit.internal.runners.model.ReflectiveCallable.run(ReflectiveCallable.java:12)
	at org.junit.runners.model.FrameworkMethod.invokeExplosively(FrameworkMethod.java:47)
	at org.junit.internal.runners.statements.InvokeMethod.evaluate(InvokeMethod.java:17)
	at org.junit.internal.runners.statements.RunBefores.evaluate(RunBefores.java:26)
	at org.junit.internal.runners.statements.RunAfters.evaluate(RunAfters.java:27)
	at org.junit.runners.ParentRunner.runLeaf(ParentRunner.java:325)
	at org.junit.runners.BlockJUnit4ClassRunner.runChild(BlockJUnit4ClassRunner.java:78)
	at org.junit.runners.BlockJUnit4ClassRunner.runChild(BlockJUnit4ClassRunner.java:57)
	at org.junit.runners.ParentRunner$3.run(ParentRunner.java:290)
	at org.junit.runners.ParentRunner$1.schedule(ParentRunner.java:71)
	at org.junit.runners.ParentRunner.runChildren(ParentRunner.java:288)
	at org.junit.runners.ParentRunner.access$000(ParentRunner.java:58)
	at org.junit.runners.ParentRunner$2.evaluate(ParentRunner.java:268)
	at org.junit.rules.ExternalResource$1.evaluate(ExternalResource.java:48)
	at org.testcontainers.containers.FailureDetectingExternalResource$1.evaluate(FailureDetectingExternalResource.java:30)
	at org.junit.rules.RunRules.evaluate(RunRules.java:20)
	at org.junit.runners.ParentRunner.run(ParentRunner.java:363)
	at org.apache.maven.surefire.junit4.JUnit4Provider.execute(JUnit4Provider.java:365)
	at org.apache.maven.surefire.junit4.JUnit4Provider.executeWithRerun(JUnit4Provider.java:273)
	at org.apache.maven.surefire.junit4.JUnit4Provider.executeTestSet(JUnit4Provider.java:238)
	at org.apache.maven.surefire.junit4.JUnit4Provider.invoke(JUnit4Provider.java:159)
	at org.apache.maven.surefire.booter.ForkedBooter.invokeProviderInSameClassLoader(ForkedBooter.java:384)
	at org.apache.maven.surefire.booter.ForkedBooter.runSuitesInProcess(ForkedBooter.java:345)
	at org.apache.maven.surefire.booter.ForkedBooter.execute(ForkedBooter.java:126)
	at org.apache.maven.surefire.booter.ForkedBooter.main(ForkedBooter.java:418)
Caused by: java.lang.AssertionError: There should be some suggestion
	at org.junit.Assert.fail(Assert.java:88)
	at org.junit.Assert.assertTrue(Assert.java:41)
	at org.junit.Assert.assertNotNull(Assert.java:712)
	at org.apache.jackrabbit.oak.plugins.index.IndexSuggestionCommonTest.lambda$checkSuggestions$0(IndexSuggestionCommonTest.java:143)
	at org.apache.jackrabbit.oak.plugins.index.TestUtils.assertEventually(TestUtils.java:35)
	... 34 more