You are viewing a plain text version of this content. The canonical link for it is here.
Posted to dev@lucene.apache.org by Policeman Jenkins Server <je...@thetaphi.de> on 2017/02/25 16:54:40 UTC

[JENKINS-EA] Lucene-Solr-master-Linux (32bit/jdk-9-ea+158) - Build # 19048 - Still Unstable!

Build: https://jenkins.thetaphi.de/job/Lucene-Solr-master-Linux/19048/
Java: 32bit/jdk-9-ea+158 -server -XX:+UseG1GC

1 tests failed.
FAILED:  org.apache.lucene.index.TestReadOnlyIndex.testReadOnlyIndex

Error Message:
access denied ("java.io.FilePermission" "/home/jenkins/workspace/Lucene-Solr-master-Linux/lucene/build/core/test/J2/temp/readonlyindex7724897601575947099" "read")

Stack Trace:
java.security.AccessControlException: access denied ("java.io.FilePermission" "/home/jenkins/workspace/Lucene-Solr-master-Linux/lucene/build/core/test/J2/temp/readonlyindex7724897601575947099" "read")
	at __randomizedtesting.SeedInfo.seed([8AE6CC287AF2885A:336317763231C648]:0)
	at java.base/java.security.AccessControlContext.checkPermission(AccessControlContext.java:471)
	at java.base/java.security.AccessController.checkPermission(AccessController.java:894)
	at java.base/java.lang.SecurityManager.checkPermission(SecurityManager.java:560)
	at java.base/java.lang.SecurityManager.checkRead(SecurityManager.java:899)
	at java.base/sun.nio.fs.UnixPath.checkRead(UnixPath.java:818)
	at java.base/sun.nio.fs.UnixFileSystemProvider.newDirectoryStream(UnixFileSystemProvider.java:395)
	at java.base/java.nio.file.Files.newDirectoryStream(Files.java:460)
	at org.apache.lucene.store.FSDirectory.listAll(FSDirectory.java:215)
	at org.apache.lucene.store.FSDirectory.listAll(FSDirectory.java:234)
	at org.apache.lucene.index.SegmentInfos$FindSegmentsFile.run(SegmentInfos.java:646)
	at org.apache.lucene.index.StandardDirectoryReader.open(StandardDirectoryReader.java:77)
	at org.apache.lucene.index.DirectoryReader.open(DirectoryReader.java:63)
	at org.apache.lucene.index.TestReadOnlyIndex.doTestReadOnlyIndex(TestReadOnlyIndex.java:81)
	at java.base/java.security.AccessController.doPrivileged(Native Method)
	at org.apache.lucene.util.LuceneTestCase.runWithRestrictedPermissions(LuceneTestCase.java:2815)
	at org.apache.lucene.index.TestReadOnlyIndex.testReadOnlyIndex(TestReadOnlyIndex.java:69)
	at java.base/jdk.internal.reflect.NativeMethodAccessorImpl.invoke0(Native Method)
	at java.base/jdk.internal.reflect.NativeMethodAccessorImpl.invoke(NativeMethodAccessorImpl.java:62)
	at java.base/jdk.internal.reflect.DelegatingMethodAccessorImpl.invoke(DelegatingMethodAccessorImpl.java:43)
	at java.base/java.lang.reflect.Method.invoke(Method.java:547)
	at com.carrotsearch.randomizedtesting.RandomizedRunner.invoke(RandomizedRunner.java:1713)
	at com.carrotsearch.randomizedtesting.RandomizedRunner$8.evaluate(RandomizedRunner.java:907)
	at com.carrotsearch.randomizedtesting.RandomizedRunner$9.evaluate(RandomizedRunner.java:943)
	at com.carrotsearch.randomizedtesting.RandomizedRunner$10.evaluate(RandomizedRunner.java:957)
	at org.apache.lucene.util.TestRuleSetupTeardownChained$1.evaluate(TestRuleSetupTeardownChained.java:49)
	at org.apache.lucene.util.AbstractBeforeAfterRule$1.evaluate(AbstractBeforeAfterRule.java:45)
	at org.apache.lucene.util.TestRuleThreadAndTestName$1.evaluate(TestRuleThreadAndTestName.java:48)
	at org.apache.lucene.util.TestRuleIgnoreAfterMaxFailures$1.evaluate(TestRuleIgnoreAfterMaxFailures.java:64)
	at org.apache.lucene.util.TestRuleMarkFailure$1.evaluate(TestRuleMarkFailure.java:47)
	at com.carrotsearch.randomizedtesting.rules.StatementAdapter.evaluate(StatementAdapter.java:36)
	at com.carrotsearch.randomizedtesting.ThreadLeakControl$StatementRunner.run(ThreadLeakControl.java:368)
	at com.carrotsearch.randomizedtesting.ThreadLeakControl.forkTimeoutingTask(ThreadLeakControl.java:817)
	at com.carrotsearch.randomizedtesting.ThreadLeakControl$3.evaluate(ThreadLeakControl.java:468)
	at com.carrotsearch.randomizedtesting.RandomizedRunner.runSingleTest(RandomizedRunner.java:916)
	at com.carrotsearch.randomizedtesting.RandomizedRunner$5.evaluate(RandomizedRunner.java:802)
	at com.carrotsearch.randomizedtesting.RandomizedRunner$6.evaluate(RandomizedRunner.java:852)
	at com.carrotsearch.randomizedtesting.RandomizedRunner$7.evaluate(RandomizedRunner.java:863)
	at org.apache.lucene.util.AbstractBeforeAfterRule$1.evaluate(AbstractBeforeAfterRule.java:45)
	at com.carrotsearch.randomizedtesting.rules.StatementAdapter.evaluate(StatementAdapter.java:36)
	at org.apache.lucene.util.TestRuleStoreClassName$1.evaluate(TestRuleStoreClassName.java:41)
	at com.carrotsearch.randomizedtesting.rules.NoShadowingOrOverridesOnMethodsRule$1.evaluate(NoShadowingOrOverridesOnMethodsRule.java:40)
	at com.carrotsearch.randomizedtesting.rules.NoShadowingOrOverridesOnMethodsRule$1.evaluate(NoShadowingOrOverridesOnMethodsRule.java:40)
	at com.carrotsearch.randomizedtesting.rules.StatementAdapter.evaluate(StatementAdapter.java:36)
	at com.carrotsearch.randomizedtesting.rules.StatementAdapter.evaluate(StatementAdapter.java:36)
	at org.apache.lucene.util.TestRuleAssertionsRequired$1.evaluate(TestRuleAssertionsRequired.java:53)
	at org.apache.lucene.util.TestRuleMarkFailure$1.evaluate(TestRuleMarkFailure.java:47)
	at org.apache.lucene.util.TestRuleIgnoreAfterMaxFailures$1.evaluate(TestRuleIgnoreAfterMaxFailures.java:64)
	at org.apache.lucene.util.TestRuleIgnoreTestSuites$1.evaluate(TestRuleIgnoreTestSuites.java:54)
	at com.carrotsearch.randomizedtesting.rules.StatementAdapter.evaluate(StatementAdapter.java:36)
	at com.carrotsearch.randomizedtesting.ThreadLeakControl$StatementRunner.run(ThreadLeakControl.java:368)
	at java.base/java.lang.Thread.run(Thread.java:844)




Build Log:
[...truncated 452 lines...]
   [junit4] Suite: org.apache.lucene.index.TestReadOnlyIndex
   [junit4]   2> NOTE: reproduce with: ant test  -Dtestcase=TestReadOnlyIndex -Dtests.method=testReadOnlyIndex -Dtests.seed=8AE6CC287AF2885A -Dtests.multiplier=3 -Dtests.slow=true -Dtests.locale=es-BR -Dtests.timezone=America/Tegucigalpa -Dtests.asserts=true -Dtests.file.encoding=ISO-8859-1
   [junit4] ERROR   0.02s J2 | TestReadOnlyIndex.testReadOnlyIndex <<<
   [junit4]    > Throwable #1: java.security.AccessControlException: access denied ("java.io.FilePermission" "/home/jenkins/workspace/Lucene-Solr-master-Linux/lucene/build/core/test/J2/temp/readonlyindex7724897601575947099" "read")
   [junit4]    > 	at __randomizedtesting.SeedInfo.seed([8AE6CC287AF2885A:336317763231C648]:0)
   [junit4]    > 	at java.base/java.security.AccessControlContext.checkPermission(AccessControlContext.java:471)
   [junit4]    > 	at java.base/java.security.AccessController.checkPermission(AccessController.java:894)
   [junit4]    > 	at java.base/java.lang.SecurityManager.checkPermission(SecurityManager.java:560)
   [junit4]    > 	at java.base/java.lang.SecurityManager.checkRead(SecurityManager.java:899)
   [junit4]    > 	at java.base/sun.nio.fs.UnixPath.checkRead(UnixPath.java:818)
   [junit4]    > 	at java.base/sun.nio.fs.UnixFileSystemProvider.newDirectoryStream(UnixFileSystemProvider.java:395)
   [junit4]    > 	at java.base/java.nio.file.Files.newDirectoryStream(Files.java:460)
   [junit4]    > 	at org.apache.lucene.store.FSDirectory.listAll(FSDirectory.java:215)
   [junit4]    > 	at org.apache.lucene.store.FSDirectory.listAll(FSDirectory.java:234)
   [junit4]    > 	at org.apache.lucene.index.SegmentInfos$FindSegmentsFile.run(SegmentInfos.java:646)
   [junit4]    > 	at org.apache.lucene.index.StandardDirectoryReader.open(StandardDirectoryReader.java:77)
   [junit4]    > 	at org.apache.lucene.index.DirectoryReader.open(DirectoryReader.java:63)
   [junit4]    > 	at org.apache.lucene.index.TestReadOnlyIndex.doTestReadOnlyIndex(TestReadOnlyIndex.java:81)
   [junit4]    > 	at java.base/java.security.AccessController.doPrivileged(Native Method)
   [junit4]    > 	at org.apache.lucene.util.LuceneTestCase.runWithRestrictedPermissions(LuceneTestCase.java:2815)
   [junit4]    > 	at org.apache.lucene.index.TestReadOnlyIndex.testReadOnlyIndex(TestReadOnlyIndex.java:69)
   [junit4]    > 	at java.base/jdk.internal.reflect.NativeMethodAccessorImpl.invoke0(Native Method)
   [junit4]    > 	at java.base/jdk.internal.reflect.NativeMethodAccessorImpl.invoke(NativeMethodAccessorImpl.java:62)
   [junit4]    > 	at java.base/jdk.internal.reflect.DelegatingMethodAccessorImpl.invoke(DelegatingMethodAccessorImpl.java:43)
   [junit4]    > 	at java.base/java.lang.reflect.Method.invoke(Method.java:547)
   [junit4]    > 	at java.base/java.lang.Thread.run(Thread.java:844)
   [junit4]   2> NOTE: test params are: codec=Asserting(Lucene70): {fieldname=PostingsFormat(name=Memory)}, docValues:{}, maxPointsInLeafNode=1012, maxMBSortInHeap=6.984923248393164, sim=RandomSimilarity(queryNorm=true): {fieldname=DFR I(ne)Z(0.3)}, locale=es-BR, timezone=America/Tegucigalpa
   [junit4]   2> NOTE: Linux 4.4.0-53-generic i386/Oracle Corporation 9-ea (32-bit)/cpus=12,threads=1,free=65953792,total=88080384
   [junit4]   2> NOTE: All tests run in this JVM: [TestConjunctionDISI, TestSearchWithThreads, TestRollingUpdates, TestPositiveScoresOnlyCollector, TestBlockPostingsFormat, TestPerFieldPostingsFormat2, TestPackedTokenAttributeImpl, TestGeoEncodingUtils, TestGraphTokenStreamFiniteStrings, TestBoolean2ScorerSupplier, TestReqExclBulkScorer, TestSegmentTermEnum, TestCollectionUtil, TestIndexWriterDeleteByQuery, TestLucene50StoredFieldsFormatHighCompression, TestReadOnlyIndex]
   [junit4] Completed [78/448 (1!)] on J2 in 0.59s, 1 test, 1 error <<< FAILURES!

[...truncated 64256 lines...]


[JENKINS-EA] Lucene-Solr-master-Linux (64bit/jdk-9-ea+158) - Build # 19049 - Still Unstable!

Posted by Policeman Jenkins Server <je...@thetaphi.de>.
Build: https://jenkins.thetaphi.de/job/Lucene-Solr-master-Linux/19049/
Java: 64bit/jdk-9-ea+158 -XX:+UseCompressedOops -XX:+UseSerialGC

1 tests failed.
FAILED:  org.apache.lucene.index.TestReadOnlyIndex.testReadOnlyIndex

Error Message:
access denied ("java.io.FilePermission" "/home/jenkins/workspace/Lucene-Solr-master-Linux/lucene/build/core/test/J2/temp/readonlyindex10012105085290547901" "read")

Stack Trace:
java.security.AccessControlException: access denied ("java.io.FilePermission" "/home/jenkins/workspace/Lucene-Solr-master-Linux/lucene/build/core/test/J2/temp/readonlyindex10012105085290547901" "read")
	at __randomizedtesting.SeedInfo.seed([3CFFEA7E0C8B88A6:857A31204448C6B4]:0)
	at java.base/java.security.AccessControlContext.checkPermission(AccessControlContext.java:471)
	at java.base/java.security.AccessController.checkPermission(AccessController.java:894)
	at java.base/java.lang.SecurityManager.checkPermission(SecurityManager.java:560)
	at java.base/java.lang.SecurityManager.checkRead(SecurityManager.java:899)
	at java.base/sun.nio.fs.UnixPath.checkRead(UnixPath.java:818)
	at java.base/sun.nio.fs.UnixFileSystemProvider.newDirectoryStream(UnixFileSystemProvider.java:395)
	at java.base/java.nio.file.Files.newDirectoryStream(Files.java:460)
	at org.apache.lucene.store.FSDirectory.listAll(FSDirectory.java:215)
	at org.apache.lucene.store.FSDirectory.listAll(FSDirectory.java:234)
	at org.apache.lucene.index.SegmentInfos$FindSegmentsFile.run(SegmentInfos.java:646)
	at org.apache.lucene.index.StandardDirectoryReader.open(StandardDirectoryReader.java:77)
	at org.apache.lucene.index.DirectoryReader.open(DirectoryReader.java:63)
	at org.apache.lucene.index.TestReadOnlyIndex.doTestReadOnlyIndex(TestReadOnlyIndex.java:81)
	at java.base/java.security.AccessController.doPrivileged(Native Method)
	at org.apache.lucene.util.LuceneTestCase.runWithRestrictedPermissions(LuceneTestCase.java:2815)
	at org.apache.lucene.index.TestReadOnlyIndex.testReadOnlyIndex(TestReadOnlyIndex.java:69)
	at java.base/jdk.internal.reflect.NativeMethodAccessorImpl.invoke0(Native Method)
	at java.base/jdk.internal.reflect.NativeMethodAccessorImpl.invoke(NativeMethodAccessorImpl.java:62)
	at java.base/jdk.internal.reflect.DelegatingMethodAccessorImpl.invoke(DelegatingMethodAccessorImpl.java:43)
	at java.base/java.lang.reflect.Method.invoke(Method.java:547)
	at com.carrotsearch.randomizedtesting.RandomizedRunner.invoke(RandomizedRunner.java:1713)
	at com.carrotsearch.randomizedtesting.RandomizedRunner$8.evaluate(RandomizedRunner.java:907)
	at com.carrotsearch.randomizedtesting.RandomizedRunner$9.evaluate(RandomizedRunner.java:943)
	at com.carrotsearch.randomizedtesting.RandomizedRunner$10.evaluate(RandomizedRunner.java:957)
	at org.apache.lucene.util.TestRuleSetupTeardownChained$1.evaluate(TestRuleSetupTeardownChained.java:49)
	at org.apache.lucene.util.AbstractBeforeAfterRule$1.evaluate(AbstractBeforeAfterRule.java:45)
	at org.apache.lucene.util.TestRuleThreadAndTestName$1.evaluate(TestRuleThreadAndTestName.java:48)
	at org.apache.lucene.util.TestRuleIgnoreAfterMaxFailures$1.evaluate(TestRuleIgnoreAfterMaxFailures.java:64)
	at org.apache.lucene.util.TestRuleMarkFailure$1.evaluate(TestRuleMarkFailure.java:47)
	at com.carrotsearch.randomizedtesting.rules.StatementAdapter.evaluate(StatementAdapter.java:36)
	at com.carrotsearch.randomizedtesting.ThreadLeakControl$StatementRunner.run(ThreadLeakControl.java:368)
	at com.carrotsearch.randomizedtesting.ThreadLeakControl.forkTimeoutingTask(ThreadLeakControl.java:817)
	at com.carrotsearch.randomizedtesting.ThreadLeakControl$3.evaluate(ThreadLeakControl.java:468)
	at com.carrotsearch.randomizedtesting.RandomizedRunner.runSingleTest(RandomizedRunner.java:916)
	at com.carrotsearch.randomizedtesting.RandomizedRunner$5.evaluate(RandomizedRunner.java:802)
	at com.carrotsearch.randomizedtesting.RandomizedRunner$6.evaluate(RandomizedRunner.java:852)
	at com.carrotsearch.randomizedtesting.RandomizedRunner$7.evaluate(RandomizedRunner.java:863)
	at org.apache.lucene.util.AbstractBeforeAfterRule$1.evaluate(AbstractBeforeAfterRule.java:45)
	at com.carrotsearch.randomizedtesting.rules.StatementAdapter.evaluate(StatementAdapter.java:36)
	at org.apache.lucene.util.TestRuleStoreClassName$1.evaluate(TestRuleStoreClassName.java:41)
	at com.carrotsearch.randomizedtesting.rules.NoShadowingOrOverridesOnMethodsRule$1.evaluate(NoShadowingOrOverridesOnMethodsRule.java:40)
	at com.carrotsearch.randomizedtesting.rules.NoShadowingOrOverridesOnMethodsRule$1.evaluate(NoShadowingOrOverridesOnMethodsRule.java:40)
	at com.carrotsearch.randomizedtesting.rules.StatementAdapter.evaluate(StatementAdapter.java:36)
	at com.carrotsearch.randomizedtesting.rules.StatementAdapter.evaluate(StatementAdapter.java:36)
	at org.apache.lucene.util.TestRuleAssertionsRequired$1.evaluate(TestRuleAssertionsRequired.java:53)
	at org.apache.lucene.util.TestRuleMarkFailure$1.evaluate(TestRuleMarkFailure.java:47)
	at org.apache.lucene.util.TestRuleIgnoreAfterMaxFailures$1.evaluate(TestRuleIgnoreAfterMaxFailures.java:64)
	at org.apache.lucene.util.TestRuleIgnoreTestSuites$1.evaluate(TestRuleIgnoreTestSuites.java:54)
	at com.carrotsearch.randomizedtesting.rules.StatementAdapter.evaluate(StatementAdapter.java:36)
	at com.carrotsearch.randomizedtesting.ThreadLeakControl$StatementRunner.run(ThreadLeakControl.java:368)
	at java.base/java.lang.Thread.run(Thread.java:844)




Build Log:
[...truncated 1513 lines...]
   [junit4] Suite: org.apache.lucene.index.TestReadOnlyIndex
   [junit4]   2> NOTE: reproduce with: ant test  -Dtestcase=TestReadOnlyIndex -Dtests.method=testReadOnlyIndex -Dtests.seed=3CFFEA7E0C8B88A6 -Dtests.multiplier=3 -Dtests.slow=true -Dtests.locale=ks -Dtests.timezone=CET -Dtests.asserts=true -Dtests.file.encoding=UTF-8
   [junit4] ERROR   0.01s J2 | TestReadOnlyIndex.testReadOnlyIndex <<<
   [junit4]    > Throwable #1: java.security.AccessControlException: access denied ("java.io.FilePermission" "/home/jenkins/workspace/Lucene-Solr-master-Linux/lucene/build/core/test/J2/temp/readonlyindex10012105085290547901" "read")
   [junit4]    > 	at __randomizedtesting.SeedInfo.seed([3CFFEA7E0C8B88A6:857A31204448C6B4]:0)
   [junit4]    > 	at java.base/java.security.AccessControlContext.checkPermission(AccessControlContext.java:471)
   [junit4]    > 	at java.base/java.security.AccessController.checkPermission(AccessController.java:894)
   [junit4]    > 	at java.base/java.lang.SecurityManager.checkPermission(SecurityManager.java:560)
   [junit4]    > 	at java.base/java.lang.SecurityManager.checkRead(SecurityManager.java:899)
   [junit4]    > 	at java.base/sun.nio.fs.UnixPath.checkRead(UnixPath.java:818)
   [junit4]    > 	at java.base/sun.nio.fs.UnixFileSystemProvider.newDirectoryStream(UnixFileSystemProvider.java:395)
   [junit4]    > 	at java.base/java.nio.file.Files.newDirectoryStream(Files.java:460)
   [junit4]    > 	at org.apache.lucene.store.FSDirectory.listAll(FSDirectory.java:215)
   [junit4]    > 	at org.apache.lucene.store.FSDirectory.listAll(FSDirectory.java:234)
   [junit4]    > 	at org.apache.lucene.index.SegmentInfos$FindSegmentsFile.run(SegmentInfos.java:646)
   [junit4]    > 	at org.apache.lucene.index.StandardDirectoryReader.open(StandardDirectoryReader.java:77)
   [junit4]    > 	at org.apache.lucene.index.DirectoryReader.open(DirectoryReader.java:63)
   [junit4]    > 	at org.apache.lucene.index.TestReadOnlyIndex.doTestReadOnlyIndex(TestReadOnlyIndex.java:81)
   [junit4]    > 	at java.base/java.security.AccessController.doPrivileged(Native Method)
   [junit4]    > 	at org.apache.lucene.util.LuceneTestCase.runWithRestrictedPermissions(LuceneTestCase.java:2815)
   [junit4]    > 	at org.apache.lucene.index.TestReadOnlyIndex.testReadOnlyIndex(TestReadOnlyIndex.java:69)
   [junit4]    > 	at java.base/jdk.internal.reflect.NativeMethodAccessorImpl.invoke0(Native Method)
   [junit4]    > 	at java.base/jdk.internal.reflect.NativeMethodAccessorImpl.invoke(NativeMethodAccessorImpl.java:62)
   [junit4]    > 	at java.base/jdk.internal.reflect.DelegatingMethodAccessorImpl.invoke(DelegatingMethodAccessorImpl.java:43)
   [junit4]    > 	at java.base/java.lang.reflect.Method.invoke(Method.java:547)
   [junit4]    > 	at java.base/java.lang.Thread.run(Thread.java:844)
   [junit4]   2> NOTE: test params are: codec=Asserting(Lucene70): {fieldname=BlockTreeOrds(blocksize=128)}, docValues:{}, maxPointsInLeafNode=1436, maxMBSortInHeap=6.748213310199169, sim=RandomSimilarity(queryNorm=false): {fieldname=DFR I(n)2}, locale=ks, timezone=CET
   [junit4]   2> NOTE: Linux 4.4.0-53-generic amd64/Oracle Corporation 9-ea (64-bit)/cpus=12,threads=1,free=96882872,total=509018112
   [junit4]   2> NOTE: All tests run in this JVM: [TermInSetQueryTest, TestConsistentFieldNumbers, TestSimpleFSLockFactory, TestRoaringDocIdSet, TestFieldsReader, TestRollingBuffer, TestTwoPhaseCommitTool, TestLongBitSet, TestNoMergePolicy, TestRamUsageEstimator, TestIndexWriterOnDiskFull, TestCachingTokenFilter, TestScoreCachingWrappingScorer, TestIndexWriterDeleteByQuery, TestStopFilter, TestSearchWithThreads, TestSortedSetDocValues, TestMultiMMap, TestNRTReaderWithThreads, TestOneMergeWrappingMergePolicy, TestSameTokenSamePosition, TestTryDelete, TestCharTermAttributeImpl, TestMultiCollector, TestSubScorerFreqs, TestAttributeSource, TestClassicSimilarity, TestVersion, TestSpanSearchEquivalence, TestTrackingDirectoryWrapper, TestFieldCacheRewriteMethod, TestStringMSBRadixSorter, TestTermdocPerf, TestCollectionUtil, TestDirectoryReader, TestSparseFixedBitDocIdSet, TestFilterDirectoryReader, TestPackedInts, TestReqExclBulkScorer, TestNewestSegment, TestSpanNotQuery, TestDisjunctionMaxQuery, TestArrayUtil, TestMultiFields, TestIndexCommit, TestShardSearching, TestStressAdvance, TestBinaryDocument, TestSpansEnum, TestSegmentReader, TestTermVectors, TestHighCompressionMode, TestCharsRef, TestParallelCompositeReader, Test2BNumericDocValues, TestDirectPacked, TestSentinelIntSet, TestIndexOrDocValuesQuery, TestTermScorer, TestMultiLevelSkipList, TestBufferedIndexInput, TestDocument, TestDocValuesScoring, TestMixedCodecs, TestFixedBitSet, TestLongValuesSource, TestRegexpQuery, TestOfflineSorter, TestGraphTokenStreamFiniteStrings, TestSetOnce, TestExitableDirectoryReader, TestLogMergePolicy, TestPrefixQuery, TestLucene70DocValuesFormat, TestForUtil, TestNearSpansOrdered, TestTermRangeQuery, TestDocumentsWriterDeleteQueue, TestDocumentWriter, TestCrashCausesCorruptIndex, TestLiveFieldValues, TestForTooMuchCloning, TestFuzzyQuery, TestPayloads, TestDoc, TestWildcard, TestSimilarity2, TestExternalCodecs, TestPrefixInBooleanQuery, TestUniqueTermCount, TestSortRandom, TestAutomatonQuery, TestPrefixRandom, TestCheckIndex, TestPayloadsOnVectors, TestSearchForDuplicates, TestIndexFileDeleter, TestElevationComparator, TestConjunctions, TestField, TestSimilarity, TestSearch, TestCachingCollector, TestAutomatonQueryUnicode, TestIsCurrent, TestIndexWriterLockRelease, TestBytesRef, TestAssertions, TestReaderClosed, TestDocBoost, TestIntsRef, Test2BPostingsBytes, Test2BTerms, Test2BBinaryDocValues, TestCharArrayMap, TestCharacterUtils, TestWordlistLoader, TestPackedTokenAttributeImpl, TestCodecUtil, TestBlockPostingsFormat, TestLucene50StoredFieldsFormat, TestLucene50StoredFieldsFormatHighCompression, TestLucene60PointsFormat, TestGeoEncodingUtils, TestPolygon, TestPolygon2D, Test2BSortedDocValuesOrds, TestAllFilesHaveChecksumFooter, TestDocsWithFieldSet, TestExceedMaxTermLength, TestIndexWriterExceptions2, TestMultiTermsEnum, TestReadOnlyIndex]
   [junit4] Completed [398/448 (1!)] on J2 in 0.18s, 1 test, 1 error <<< FAILURES!

[...truncated 63171 lines...]


RE: [JENKINS-EA] Lucene-Solr-master-Linux (32bit/jdk-9-ea+158) - Build # 19048 - Still Unstable!

Posted by Uwe Schindler <uw...@thetaphi.de>.
I committed a fix: http://git-wip-us.apache.org/repos/asf/lucene-solr/commit/6f3f6a2d 

 

Uwe

 

-----

Uwe Schindler

Achterdiek 19, D-28357 Bremen

 <http://www.thetaphi.de/> http://www.thetaphi.de

eMail: uwe@thetaphi.de

 

From: Uwe Schindler [mailto:uwe@thetaphi.de] 
Sent: Saturday, February 25, 2017 7:53 PM
To: dev@lucene.apache.org
Subject: Re: [JENKINS-EA] Lucene-Solr-master-Linux (32bit/jdk-9-ea+158) - Build # 19048 - Still Unstable!

 

I will look into this. This is caused by Java 9 and canonic paths... Should be easy to fix.

Uwe

Am 25. Februar 2017 17:54:40 MEZ schrieb Policeman Jenkins Server < <ma...@thetaphi.de> jenkins@thetaphi.de>:

Build:  <https://jenkins.thetaphi.de/job/Lucene-Solr-master-Linux/19048> https://jenkins.thetaphi.de/job/Lucene-Solr-master-Linux/19048/
Java: 32bit/jdk-9-ea+158 -server -XX:+UseG1GC

1 tests failed.
FAILED:  org.apache.lucene.index.TestReadOnlyIndex.testReadOnlyIndex

Error Message:
access denied (" <http://java.io> java.io.FilePermission" "/home/jenkins/workspace/Lucene-Solr-master-Linux/lucene/build/core/test/J2/temp/readonlyindex7724897601575947099" "read")

Stack Trace:
 <http://java.security> java.security.AccessControlException: access denied (" <http://java.io> java.io.FilePermission" "/home/jenkins/workspace/Lucene-Solr-master-Linux/lucene/build/core/test/J2/temp/readonlyindex7724897601575947099" "read")
 at __randomizedtesting.SeedInfo.seed([8AE6CC287AF2885A:336317763231C648]:0)
 at java.base/ <http://java.security> java.security.AccessControlContext.checkPermission( <AccessControlContext.java:471> AccessControlContext.java:471)
 at java.base/ <http://java.security> java.security.AccessController.checkPermission( <AccessController.java:894> AccessController.java:894)
 at java.base/java.lang.SecurityManager.checkPermission( <SecurityManager.java:560> SecurityManager.java:560)
 at java.base/java.lang.SecurityManager.checkRead( <SecurityManager.java:899> SecurityManager.java:899)
 at java.base/sun.nio.fs.UnixPath.checkRead( <UnixPath.java:818> UnixPath.java:818)
 at java.base/sun.nio.fs.UnixFileSystemProvider.newDirectoryStream( <UnixFileSystemProvider.java:395> UnixFileSystemProvider.java:395)
 at java.base/java.nio.file.Files.newDirectoryStream( <Files.java:460> Files.java:460)
 at  <http://org.apache.lucene.store> org.apache.lucene.store.FSDirectory.listAll( <FSDirectory.java:215> FSDirectory.java:215)
 at  <http://org.apache.lucene.store> org.apache.lucene.store.FSDirectory.listAll( <FSDirectory.java:234> FSDirectory.java:234)
 at org.apache.lucene.index.SegmentInfos$ <http://FindSegmentsFile.run> FindSegmentsFile.run( <SegmentInfos.java:646> SegmentInfos.java:646)
 at  <http://org.apache.lucene.index.StandardDirectoryReader.open> org.apache.lucene.index.StandardDirectoryReader.open( <StandardDirectoryReader.java:77> StandardDirectoryReader.java:77)
 at  <http://org.apache.lucene.index.DirectoryReader.open> org.apache.lucene.index.DirectoryReader.open( <DirectoryReader.java:63> DirectoryReader.java:63)
 at org.apache.lucene.index.TestReadOnlyIndex.doTestReadOnlyIndex( <TestReadOnlyIndex.java:81> TestReadOnlyIndex.java:81)
 at java.base/ <http://java.security> java.security.AccessController.doPrivileged(Native Method)
 at org.apache.lucene.util.LuceneTestCase.runWithRestrictedPermissions(LuceneTestCase.java:2815)
 at org.apache.lucene.index.TestReadOnlyIndex.testReadOnlyIndex(TestReadOnlyIndex.java:69)
 at java.base/jdk.internal.reflect.NativeMethodAccessorImpl.invoke0(Native Method)
 at java.base/jdk.internal.reflect.NativeMethodAccessorImpl.invoke(NativeMethodAccessorImpl.java:62)
 at java.base/jdk.internal.reflect.DelegatingMethodAccessorImpl.invoke(DelegatingMethodAccessorImpl.java:43)
 at java.base/java.lang.reflect.Method.invoke(Method.java:547)
 at com.carrotsearch.randomizedtesting.RandomizedRunner.invoke(RandomizedRunner.java:1713)
 at com.carrotsearch.randomizedtesting.RandomizedRunner$8.evaluate(RandomizedRunner.java:907)
 at com.carrotsearch.randomizedtesting.RandomizedRunner$9.evaluate(RandomizedRunner.java:943)
 at com.carrotsearch.randomizedtesting.RandomizedRunner$10.evaluate(RandomizedRunner.java:957)
 at org.apache.lucene.util.TestRuleSetupTeardownChained$1.evaluate(TestRuleSetupTeardownChained.java:49)
 at org.apache.lucene.util.AbstractBeforeAfterRule$1.evaluate(AbstractBeforeAfterRule.java:45)
 at org.apache.lucene.util.TestRuleThreadAndTestName$1.evaluate(TestRuleThreadAndTestName.java:48)
 at org.apache.lucene.util.TestRuleIgnoreAfterMaxFailures$1.evaluate(TestRuleIgnoreAfterMaxFailures.java:64)
 at org.apache.lucene.util.TestRuleMarkFailure$1.evaluate(TestRuleMarkFailure.java:47)
 at com.carrotsearch.randomizedtesting.rules.StatementAdapter.evaluate(StatementAdapter.java:36)
 at com.carrotsearch.randomizedtesting.ThreadLeakControl$StatementRunner.run <http://StatementRunner.run> (ThreadLeakControl.java:368)
 at com.carrotsearch.randomizedtesting.ThreadLeakControl.forkTimeoutingTask(ThreadLeakControl.java:817)
 at com.carrotsearch.randomizedtesting.ThreadLeakControl$3.evaluate(ThreadLeakControl.java:468)
 at com.carrotsearch.randomizedtesting.RandomizedRunner.runSingleTest(RandomizedRunner.java:916)
 at com.carrotsearch.randomizedtesting.RandomizedRunner$5.evaluate(RandomizedRunner.java:802)
 at com.carrotsearch.randomizedtesting.RandomizedRunner$6.evaluate(RandomizedRunner.java:852)
 at com.carrotsearch.randomizedtesting.RandomizedRunner$7.evaluate(RandomizedRunner.java:863)
 at org.apache.lucene.util.AbstractBeforeAfterRule$1.evaluate(AbstractBeforeAfterRule.java:45)
 at com.carrotsearch.randomizedtesting.rules.StatementAdapter.evaluate(StatementAdapter.java:36)
 at org.apache.lucene.util.TestRuleStoreClassName$1.evaluate(TestRuleStoreClassName.java:41)
 at com.carrotsearch.randomizedtesting.rules.NoShadowingOrOverridesOnMethodsRule$1.evaluate(NoShadowingOrOverridesOnMethodsRule.java:40)
 at com.carrotsearch.randomizedtesting.rules.NoShadowingOrOverridesOnMethodsRule$1.evaluate(NoShadowingOrOverridesOnMethodsRule.java:40)
 at com.carrotsearch.randomizedtesting.rules.StatementAdapter.evaluate(StatementAdapter.java:36)
 at com.carrotsearch.randomizedtesting.rules.StatementAdapter.evaluate(StatementAdapter.java:36)
 at org.apache.lucene.util.TestRuleAssertionsRequired$1.evaluate(TestRuleAssertionsRequired.java:53)
 at org.apache.lucene.util.TestRuleMarkFailure$1.evaluate(TestRuleMarkFailure.java:47)
 at org.apache.lucene.util.TestRuleIgnoreAfterMaxFailures$1.evaluate(TestRuleIgnoreAfterMaxFailures.java:64)
 at org.apache.lucene.util.TestRuleIgnoreTestSuites$1.evaluate(TestRuleIgnoreTestSuites.java:54)
 at com.carrotsearch.randomizedtesting.rules.StatementAdapter.evaluate(StatementAdapter.java:36)
 at com.carrotsearch.randomizedtesting.ThreadLeakControl$StatementRunner.run <http://StatementRunner.run> (ThreadLeakControl.java:368)
 at java.base/java.lang.Thread.run <http://java.lang.Thread.run> (Thread.java:844)




Build Log:
[...truncated 452 lines...]
   [junit4] Suite: org.apache.lucene.index.TestReadOnlyIndex
   [junit4]   2> NOTE: reproduce with: ant test  -Dtestcase=TestReadOnlyIndex -Dtests.method=testReadOnlyIndex -Dtests.seed=8AE6CC287AF2885A -Dtests.multiplier=3 -Dtests.slow=true -Dtests.locale=es-BR -Dtests.timezone=America/Tegucigalpa -Dtests.asserts=true -Dtests.file.encoding=ISO-8859-1
   [junit4] ERROR   0.02s J2 | TestReadOnlyIndex.testReadOnlyIndex <<<
   [junit4]    > Throwable #1:  <http://java.security> java.security.AccessControlException: access denied (" <http://java.io> java.io.FilePermission" "/home/jenkins/workspace/Lucene-Solr-master-Linux/lucene/build/core/test/J2/temp/readonlyindex7724897601575947099" "read")
   [junit4]    >  at __randomizedtesting.SeedInfo.seed([8AE6CC287AF2885A:336317763231C648]:0)
   [junit4]    >  at java.base/ <http://java.security> java.security.AccessControlContext.checkPermission( <AccessControlContext.java:471> AccessControlContext.java:471)
   [junit4]    >  at java.base/ <http://java.security> java.security.AccessController.checkPermission( <AccessController.java:894> AccessController.java:894)
   [junit4]    >  at java.base/java.lang.SecurityManager.checkPermission( <SecurityManager.java:560> SecurityManager.java:560)
   [junit4]    >  at java.base/java.lang.SecurityManager.checkRead( <SecurityManager.java:899> SecurityManager.java:899)
   [junit4]    >  at java.base/sun.nio.fs.UnixPath.checkRead( <UnixPath.java:818> UnixPath.java:818)
   [junit4]    >  at java.base/sun.nio.fs.UnixFileSystemProvider.newDirectoryStream( <UnixFileSystemProvider.java:395> UnixFileSystemProvider.java:395)
   [junit4]    >  at java.base/java.nio.file.Files.newDirectoryStream( <Files.java:460> Files.java:460)
   [junit4]    >  at  <http://org.apache.lucene.store> org.apache.lucene.store.FSDirectory.listAll( <FSDirectory.java:215> FSDirectory.java:215)
   [junit4]    >  at  <http://org.apache.lucene.store> org.apache.lucene.store.FSDirectory.listAll( <FSDirectory.java:234> FSDirectory.java:234)
   [junit4]    >  at org.apache.lucene.index.SegmentInfos$ <http://FindSegmentsFile.run> FindSegmentsFile.run( <SegmentInfos.java:646> SegmentInfos.java:646)
   [junit4]    >  at  <http://org.apache.lucene.index.StandardDirectoryReader.open> org.apache.lucene.index.StandardDirectoryReader.open( <StandardDirectoryReader.java:77> StandardDirectoryReader.java:77)
   [junit4]    >  at  <http://org.apache.lucene.index.DirectoryReader.open> org.apache.lucene.index.DirectoryReader.open( <DirectoryReader.java:63> DirectoryReader.java:63)
   [junit4]    >  at org.apache.lucene.index.TestReadOnlyIndex.doTestReadOnlyIndex( <TestReadOnlyIndex.java:81> TestReadOnlyIndex.java:81)
   [junit4]    >  at java.base/ <http://java.security> java.security.AccessController.doPrivileged(Native Method)
   [junit4]    >  at org.apache.lucene.util.LuceneTestCase.runWithRestrictedPermissions( <LuceneTestCase.java:2815> LuceneTestCase.java:2815)
   [junit4]    >  at org.apache.lucene.index.TestReadOnlyIndex.testReadOnlyIndex( <TestReadOnlyIndex.java:69> TestReadOnlyIndex.java:69)
   [junit4]    >  at java.base/jdk.internal.reflect.NativeMethodAccessorImpl.invoke0(Native Method)
   [junit4]    >  at java.base/jdk.internal.reflect.NativeMethodAccessorImpl.invoke( <NativeMethodAccessorImpl.java:62> NativeMethodAccessorImpl.java:62)
   [junit4]    >  at java.base/jdk.internal.reflect.DelegatingMethodAccessorImpl.invoke( <DelegatingMethodAccessorImpl.java:43> DelegatingMethodAccessorImpl.java:43)
   [junit4]    >  at java.base/java.lang.reflect.Method.invoke( <Method.java:547> Method.java:547)
   [junit4]    >  at java.base/ <http://java.lang.Thread.run> java.lang.Thread.run( <Thread.java:844> Thread.java:844)
   [junit4]   2> NOTE: test params are: codec=Asserting(Lucene70): {fieldname=PostingsFormat(name=Memory)}, docValues:{}, maxPointsInLeafNode=1012, maxMBSortInHeap=6.984923248393164, sim=RandomSimilarity(queryNorm=true): {fieldname=DFR I(ne)Z(0.3)}, locale=es-BR, timezone=America/Tegucigalpa
   [junit4]   2> NOTE: Linux 4.4.0-53-generic i386/Oracle Corporation 9-ea (32-bit)/cpus=12,threads=1,free=65953792,total=88080384
   [junit4]   2> NOTE: All tests run in this JVM: [TestConjunctionDISI, TestSearchWithThreads, TestRollingUpdates, TestPositiveScoresOnlyCollector, TestBlockPostingsFormat, TestPerFieldPostingsFormat2, TestPackedTokenAttributeImpl, TestGeoEncodingUtils, TestGraphTokenStreamFiniteStrings, TestBoolean2ScorerSupplier, TestReqExclBulkScorer, TestSegmentTermEnum, TestCollectionUtil, TestIndexWriterDeleteByQuery, TestLucene50StoredFieldsFormatHighCompression, TestReadOnlyIndex]
   [junit4] Completed [78/448 (1!)] on J2 in 0.59s, 1 test, 1 error <<< FAILURES!

[...truncated 64256 lines...]


--
Uwe Schindler
Achterdiek 19, 28357 Bremen
https://www.thetaphi.de


Re: [JENKINS-EA] Lucene-Solr-master-Linux (32bit/jdk-9-ea+158) - Build # 19048 - Still Unstable!

Posted by Uwe Schindler <uw...@thetaphi.de>.
I will look into this. This is caused by Java 9 and canonic paths... Should be easy to fix.

Uwe

Am 25. Februar 2017 17:54:40 MEZ schrieb Policeman Jenkins Server <je...@thetaphi.de>:
>Build: https://jenkins.thetaphi.de/job/Lucene-Solr-master-Linux/19048/
>Java: 32bit/jdk-9-ea+158 -server -XX:+UseG1GC
>
>1 tests failed.
>FAILED:  org.apache.lucene.index.TestReadOnlyIndex.testReadOnlyIndex
>
>Error Message:
>access denied ("java.io.FilePermission"
>"/home/jenkins/workspace/Lucene-Solr-master-Linux/lucene/build/core/test/J2/temp/readonlyindex7724897601575947099"
>"read")
>
>Stack Trace:
>java.security.AccessControlException: access denied
>("java.io.FilePermission"
>"/home/jenkins/workspace/Lucene-Solr-master-Linux/lucene/build/core/test/J2/temp/readonlyindex7724897601575947099"
>"read")
>	at
>__randomizedtesting.SeedInfo.seed([8AE6CC287AF2885A:336317763231C648]:0)
>	at
>java.base/java.security.AccessControlContext.checkPermission(AccessControlContext.java:471)
>	at
>java.base/java.security.AccessController.checkPermission(AccessController.java:894)
>	at
>java.base/java.lang.SecurityManager.checkPermission(SecurityManager.java:560)
>	at
>java.base/java.lang.SecurityManager.checkRead(SecurityManager.java:899)
>	at java.base/sun.nio.fs.UnixPath.checkRead(UnixPath.java:818)
>	at
>java.base/sun.nio.fs.UnixFileSystemProvider.newDirectoryStream(UnixFileSystemProvider.java:395)
>	at java.base/java.nio.file.Files.newDirectoryStream(Files.java:460)
>	at org.apache.lucene.store.FSDirectory.listAll(FSDirectory.java:215)
>	at org.apache.lucene.store.FSDirectory.listAll(FSDirectory.java:234)
>	at
>org.apache.lucene.index.SegmentInfos$FindSegmentsFile.run(SegmentInfos.java:646)
>	at
>org.apache.lucene.index.StandardDirectoryReader.open(StandardDirectoryReader.java:77)
>	at
>org.apache.lucene.index.DirectoryReader.open(DirectoryReader.java:63)
>	at
>org.apache.lucene.index.TestReadOnlyIndex.doTestReadOnlyIndex(TestReadOnlyIndex.java:81)
>	at java.base/java.security.AccessController.doPrivileged(Native
>Method)
>	at
>org.apache.lucene.util.LuceneTestCase.runWithRestrictedPermissions(LuceneTestCase.java:2815)
>	at
>org.apache.lucene.index.TestReadOnlyIndex.testReadOnlyIndex(TestReadOnlyIndex.java:69)
>	at
>java.base/jdk.internal.reflect.NativeMethodAccessorImpl.invoke0(Native
>Method)
>	at
>java.base/jdk.internal.reflect.NativeMethodAccessorImpl.invoke(NativeMethodAccessorImpl.java:62)
>	at
>java.base/jdk.internal.reflect.DelegatingMethodAccessorImpl.invoke(DelegatingMethodAccessorImpl.java:43)
>	at java.base/java.lang.reflect.Method.invoke(Method.java:547)
>	at
>com.carrotsearch.randomizedtesting.RandomizedRunner.invoke(RandomizedRunner.java:1713)
>	at
>com.carrotsearch.randomizedtesting.RandomizedRunner$8.evaluate(RandomizedRunner.java:907)
>	at
>com.carrotsearch.randomizedtesting.RandomizedRunner$9.evaluate(RandomizedRunner.java:943)
>	at
>com.carrotsearch.randomizedtesting.RandomizedRunner$10.evaluate(RandomizedRunner.java:957)
>	at
>org.apache.lucene.util.TestRuleSetupTeardownChained$1.evaluate(TestRuleSetupTeardownChained.java:49)
>	at
>org.apache.lucene.util.AbstractBeforeAfterRule$1.evaluate(AbstractBeforeAfterRule.java:45)
>	at
>org.apache.lucene.util.TestRuleThreadAndTestName$1.evaluate(TestRuleThreadAndTestName.java:48)
>	at
>org.apache.lucene.util.TestRuleIgnoreAfterMaxFailures$1.evaluate(TestRuleIgnoreAfterMaxFailures.java:64)
>	at
>org.apache.lucene.util.TestRuleMarkFailure$1.evaluate(TestRuleMarkFailure.java:47)
>	at
>com.carrotsearch.randomizedtesting.rules.StatementAdapter.evaluate(StatementAdapter.java:36)
>	at
>com.carrotsearch.randomizedtesting.ThreadLeakControl$StatementRunner.run(ThreadLeakControl.java:368)
>	at
>com.carrotsearch.randomizedtesting.ThreadLeakControl.forkTimeoutingTask(ThreadLeakControl.java:817)
>	at
>com.carrotsearch.randomizedtesting.ThreadLeakControl$3.evaluate(ThreadLeakControl.java:468)
>	at
>com.carrotsearch.randomizedtesting.RandomizedRunner.runSingleTest(RandomizedRunner.java:916)
>	at
>com.carrotsearch.randomizedtesting.RandomizedRunner$5.evaluate(RandomizedRunner.java:802)
>	at
>com.carrotsearch.randomizedtesting.RandomizedRunner$6.evaluate(RandomizedRunner.java:852)
>	at
>com.carrotsearch.randomizedtesting.RandomizedRunner$7.evaluate(RandomizedRunner.java:863)
>	at
>org.apache.lucene.util.AbstractBeforeAfterRule$1.evaluate(AbstractBeforeAfterRule.java:45)
>	at
>com.carrotsearch.randomizedtesting.rules.StatementAdapter.evaluate(StatementAdapter.java:36)
>	at
>org.apache.lucene.util.TestRuleStoreClassName$1.evaluate(TestRuleStoreClassName.java:41)
>	at
>com.carrotsearch.randomizedtesting.rules.NoShadowingOrOverridesOnMethodsRule$1.evaluate(NoShadowingOrOverridesOnMethodsRule.java:40)
>	at
>com.carrotsearch.randomizedtesting.rules.NoShadowingOrOverridesOnMethodsRule$1.evaluate(NoShadowingOrOverridesOnMethodsRule.java:40)
>	at
>com.carrotsearch.randomizedtesting.rules.StatementAdapter.evaluate(StatementAdapter.java:36)
>	at
>com.carrotsearch.randomizedtesting.rules.StatementAdapter.evaluate(StatementAdapter.java:36)
>	at
>org.apache.lucene.util.TestRuleAssertionsRequired$1.evaluate(TestRuleAssertionsRequired.java:53)
>	at
>org.apache.lucene.util.TestRuleMarkFailure$1.evaluate(TestRuleMarkFailure.java:47)
>	at
>org.apache.lucene.util.TestRuleIgnoreAfterMaxFailures$1.evaluate(TestRuleIgnoreAfterMaxFailures.java:64)
>	at
>org.apache.lucene.util.TestRuleIgnoreTestSuites$1.evaluate(TestRuleIgnoreTestSuites.java:54)
>	at
>com.carrotsearch.randomizedtesting.rules.StatementAdapter.evaluate(StatementAdapter.java:36)
>	at
>com.carrotsearch.randomizedtesting.ThreadLeakControl$StatementRunner.run(ThreadLeakControl.java:368)
>	at java.base/java.lang.Thread.run(Thread.java:844)
>
>
>
>
>Build Log:
>[...truncated 452 lines...]
>   [junit4] Suite: org.apache.lucene.index.TestReadOnlyIndex
>[junit4]   2> NOTE: reproduce with: ant test 
>-Dtestcase=TestReadOnlyIndex -Dtests.method=testReadOnlyIndex
>-Dtests.seed=8AE6CC287AF2885A -Dtests.multiplier=3 -Dtests.slow=true
>-Dtests.locale=es-BR -Dtests.timezone=America/Tegucigalpa
>-Dtests.asserts=true -Dtests.file.encoding=ISO-8859-1
>   [junit4] ERROR   0.02s J2 | TestReadOnlyIndex.testReadOnlyIndex <<<
>[junit4]    > Throwable #1: java.security.AccessControlException:
>access denied ("java.io.FilePermission"
>"/home/jenkins/workspace/Lucene-Solr-master-Linux/lucene/build/core/test/J2/temp/readonlyindex7724897601575947099"
>"read")
>[junit4]    > 	at
>__randomizedtesting.SeedInfo.seed([8AE6CC287AF2885A:336317763231C648]:0)
>[junit4]    > 	at
>java.base/java.security.AccessControlContext.checkPermission(AccessControlContext.java:471)
>[junit4]    > 	at
>java.base/java.security.AccessController.checkPermission(AccessController.java:894)
>[junit4]    > 	at
>java.base/java.lang.SecurityManager.checkPermission(SecurityManager.java:560)
>[junit4]    > 	at
>java.base/java.lang.SecurityManager.checkRead(SecurityManager.java:899)
>[junit4]    > 	at
>java.base/sun.nio.fs.UnixPath.checkRead(UnixPath.java:818)
>[junit4]    > 	at
>java.base/sun.nio.fs.UnixFileSystemProvider.newDirectoryStream(UnixFileSystemProvider.java:395)
>[junit4]    > 	at
>java.base/java.nio.file.Files.newDirectoryStream(Files.java:460)
>[junit4]    > 	at
>org.apache.lucene.store.FSDirectory.listAll(FSDirectory.java:215)
>[junit4]    > 	at
>org.apache.lucene.store.FSDirectory.listAll(FSDirectory.java:234)
>[junit4]    > 	at
>org.apache.lucene.index.SegmentInfos$FindSegmentsFile.run(SegmentInfos.java:646)
>[junit4]    > 	at
>org.apache.lucene.index.StandardDirectoryReader.open(StandardDirectoryReader.java:77)
>[junit4]    > 	at
>org.apache.lucene.index.DirectoryReader.open(DirectoryReader.java:63)
>[junit4]    > 	at
>org.apache.lucene.index.TestReadOnlyIndex.doTestReadOnlyIndex(TestReadOnlyIndex.java:81)
>[junit4]    > 	at
>java.base/java.security.AccessController.doPrivileged(Native Method)
>[junit4]    > 	at
>org.apache.lucene.util.LuceneTestCase.runWithRestrictedPermissions(LuceneTestCase.java:2815)
>[junit4]    > 	at
>org.apache.lucene.index.TestReadOnlyIndex.testReadOnlyIndex(TestReadOnlyIndex.java:69)
>[junit4]    > 	at
>java.base/jdk.internal.reflect.NativeMethodAccessorImpl.invoke0(Native
>Method)
>[junit4]    > 	at
>java.base/jdk.internal.reflect.NativeMethodAccessorImpl.invoke(NativeMethodAccessorImpl.java:62)
>[junit4]    > 	at
>java.base/jdk.internal.reflect.DelegatingMethodAccessorImpl.invoke(DelegatingMethodAccessorImpl.java:43)
>[junit4]    > 	at
>java.base/java.lang.reflect.Method.invoke(Method.java:547)
>   [junit4]    > 	at java.base/java.lang.Thread.run(Thread.java:844)
>[junit4]   2> NOTE: test params are: codec=Asserting(Lucene70):
>{fieldname=PostingsFormat(name=Memory)}, docValues:{},
>maxPointsInLeafNode=1012, maxMBSortInHeap=6.984923248393164,
>sim=RandomSimilarity(queryNorm=true): {fieldname=DFR I(ne)Z(0.3)},
>locale=es-BR, timezone=America/Tegucigalpa
>[junit4]   2> NOTE: Linux 4.4.0-53-generic i386/Oracle Corporation 9-ea
>(32-bit)/cpus=12,threads=1,free=65953792,total=88080384
>[junit4]   2> NOTE: All tests run in this JVM: [TestConjunctionDISI,
>TestSearchWithThreads, TestRollingUpdates,
>TestPositiveScoresOnlyCollector, TestBlockPostingsFormat,
>TestPerFieldPostingsFormat2, TestPackedTokenAttributeImpl,
>TestGeoEncodingUtils, TestGraphTokenStreamFiniteStrings,
>TestBoolean2ScorerSupplier, TestReqExclBulkScorer, TestSegmentTermEnum,
>TestCollectionUtil, TestIndexWriterDeleteByQuery,
>TestLucene50StoredFieldsFormatHighCompression, TestReadOnlyIndex]
>[junit4] Completed [78/448 (1!)] on J2 in 0.59s, 1 test, 1 error <<<
>FAILURES!
>
>[...truncated 64256 lines...]

--
Uwe Schindler
Achterdiek 19, 28357 Bremen
https://www.thetaphi.de